Data Publisher,Dataset,Dataset Rights,Collector name,Collector number,Field number,GUID,Date collected,Institution code,Collection code,Catalogue number,Basis of record,Image url,Last indexed,Identifier,Identification date,Scientific name,Author,Scientific name (interpreted),Kingdom,Phylum,Class,Order,Family,Genus,Country,Country (interpreted),Locality,County,Continent or Ocean,State/Province,Region,Publisher country,Latitude,Longitude,Coordinate precision,Cell id,Centi cell id,Min depth,Max depth,Max depth,Min altitude,Max altitude,Altitude precision,GBIF portal url,GBIF webservice url
"National Museum of Nature and Science, Japan","Herbarium Specimens of Tokushima Prefectural Museum, Japan",,,,,,,TKPM,B,SP139445,Specimen,,23:14.0,,,Osmanthus fragrans Lour.  var. aurantiacus Makino,Lour.,Osmanthus fragrans var. aurantiacus Makino,Plantae,Angiospermae,Dicotyledoneae,Angiospermae,Oleaceae,Osmanthus,Japan,Japan,,Naruto City,,Tokushima Pref.,Eastern Asia,Japan,,,,,,,,,,,,http://data.gbif.org/occurrences/150143921,http://data.gbif.org/ws/rest/occurrence/get?key=150143921
"National Museum of Nature and Science, Japan","Plant specimens depodited in Osaka Museum of Natural History, Japan.",,,,,,,OSA,C,OSA18692,Specimen,,21:35.0,,,Osmanthus fragrans Lour. var. aurantiacus Mak.,Lour.,Osmanthus fragrans var. aurantiacus Mak.,Plantae,,,,Oleaceae,Osmanthus,Japan,Japan,"Yusen-ji Temple, Mt. Nijo-zan",Taima-cho,,Nara Prefecture,Eastern Asia,Japan,,,,,,,,,,,,http://data.gbif.org/occurrences/295151625,http://data.gbif.org/ws/rest/occurrence/get?key=295151625
"National Museum of Nature and Science, Japan","Plant specimens depodited in Osaka Museum of Natural History, Japan.",,,,,,,OSA,C,OSA18693,Specimen,,21:35.0,,,Osmanthus fragrans Lour. var. aurantiacus Mak.,Lour.,Osmanthus fragrans var. aurantiacus Mak.,Plantae,,,,Oleaceae,Osmanthus,Japan,Japan,Taima-dera Temple,Taima-cho,,Nara Prefecture,Eastern Asia,Japan,,,,,,,,,,,,http://data.gbif.org/occurrences/295151626,http://data.gbif.org/ws/rest/occurrence/get?key=295151626
"National Museum of Nature and Science, Japan",Angiospermatatophytina Collection of Saitama Museum of Natural History,,,,,,,SMNH,As,23814,Specimen,,53:16.0,,,Osmanthus fragrans Lour. var. aurantiacus Makino,Makino,Osmanthus fragrans var. aurantiacus Makino,Plantae,Angiospermae,Dicotyledoneae,Oleales,Oleaceae,Osmanthus,Japan,Japan,,Kodama-gun Kodamamachi,,Saitama,Eastern Asia,Japan,,,,,,,,,,,,http://data.gbif.org/occurrences/393105182,http://data.gbif.org/ws/rest/occurrence/get?key=393105182
"National Museum of Nature and Science, Japan","Herbarium Specimens of Museum of Nature and Human Activities, Hyogo Prefecture, Japan",,,,,,,HYO,HYO-C,C1-121216,Specimen,,27:34.0,,,Osmanthus fragrans Lour. var. aurantiacus Makino,Lour.,Osmanthus fragrans var. aurantiacus Makino,Plantae,,,,Oleaceae,Osmanthus,Japan,Japan,"Karita,Sumiyoshiku,Osaka-city",,,Osaka,Eastern Asia,Japan,,,,,,,,,,,,http://data.gbif.org/occurrences/177371880,http://data.gbif.org/ws/rest/occurrence/get?key=177371880
"National Museum of Nature and Science, Japan","Herbarium Specimens of Museum of Nature and Human Activities, Hyogo Prefecture, Japan",,,,,,,HYO,HYO-C,C1-200352,Specimen,,27:36.0,,,Osmanthus fragrans Lour. var. aurantiacus Makino,Lour.,Osmanthus fragrans var. aurantiacus Makino,Plantae,,,,Oleaceae,Osmanthus,Japan,Japan,"Mikageyamate1choume,  Higasinadaku,  Kobe City.",,,Hyogo,Eastern Asia,Japan,,,,,,,,,70,,,http://data.gbif.org/occurrences/177372518,http://data.gbif.org/ws/rest/occurrence/get?key=177372518
"National Museum of Nature and Science, Japan","Ibaraki Nature Museum, Vascular Plants collection",,,,,,,INM,Va,28139,Specimen,,52:45.0,,,Osmanthus fragrans Lour. var. aurantiacus Makino,Makino,Osmanthus fragrans var. aurantiacus Makino,Plantae,ANGIOSPERMAE,DICOTYLEDONEAE,,OLEACEAE,Osmanthus,Japan,Japan,,Tsukuba-shi,,Ibaraki,Eastern Asia,Japan,,,,,,,,,,,,http://data.gbif.org/occurrences/381825573,http://data.gbif.org/ws/rest/occurrence/get?key=381825573
"National Museum of Nature and Science, Japan","Ibaraki Nature Museum, Vascular Plants collection",,,,,,,INM,Va,101062,Specimen,,52:47.0,,,Osmanthus fragrans Lour. var. aurantiacus Makino,Makino,Osmanthus fragrans var. aurantiacus Makino,Plantae,SPERMATOPHYTAANGIOSPERMAE,DICOTYLEDONEAE,,OLEACEAE,Osmanthus,Japan,Japan,,Kashima-gun Kamisumachi,,Ibaraki,Eastern Asia,Japan,,,,,,,,,,,,http://data.gbif.org/occurrences/381825796,http://data.gbif.org/ws/rest/occurrence/get?key=381825796
"National Museum of Nature and Science, Japan",Plant Specimens of Kurashiki Museum of Natural History,,,,,,,KURA,KURA,49127,Specimen,,16:39.0,,,Osmanthus fragrans Lour. var. aurantiacus Makino,Lour.,Osmanthus fragrans var. aurantiacus Makino,Plantae,,,,Oleaceae,Osmanthus,Japan,Japan,,,,Wakayama,Eastern Asia,Japan,,,,,,,,,,,,http://data.gbif.org/occurrences/43157123,http://data.gbif.org/ws/rest/occurrence/get?key=43157123
"National Museum of Nature and Science, Japan",Plant Specimens of Kurashiki Museum of Natural History,,,,,,,KURA,KURA,49130,Specimen,,16:39.0,,,Osmanthus fragrans Lour. var. aurantiacus Makino,Lour.,Osmanthus fragrans var. aurantiacus Makino,Plantae,,,,Oleaceae,Osmanthus,Japan,Japan,,,,Okayama,Eastern Asia,Japan,,,,,,,,,,,,http://data.gbif.org/occurrences/43157099,http://data.gbif.org/ws/rest/occurrence/get?key=43157099
"National Museum of Nature and Science, Japan",Plant Specimens of Kurashiki Museum of Natural History,,,,,,,KURA,KURA,49129,Specimen,,16:39.0,,,Osmanthus fragrans Lour. var. aurantiacus Makino,Lour.,Osmanthus fragrans var. aurantiacus Makino,Plantae,,,,Oleaceae,Osmanthus,Japan,Japan,,,,Hyogo,Eastern Asia,Japan,,,,,,,,,,,,http://data.gbif.org/occurrences/43157110,http://data.gbif.org/ws/rest/occurrence/get?key=43157110
"National Museum of Nature and Science, Japan",Plant Specimens of Kurashiki Museum of Natural History,,,,,,,KURA,KURA,49128,Specimen,,16:39.0,,,Osmanthus fragrans Lour. var. aurantiacus Makino,Lour.,Osmanthus fragrans var. aurantiacus Makino,Plantae,,,,Oleaceae,Osmanthus,Japan,Japan,,,,Hyogo,Eastern Asia,Japan,,,,,,,,,,,,http://data.gbif.org/occurrences/43157101,http://data.gbif.org/ws/rest/occurrence/get?key=43157101
"National Museum of Nature and Science, Japan","Plant specimens depodited in Osaka Museum of Natural History, Japan.",,,,,,,OSA,C,OSA54048,Specimen,,21:36.0,,,Osmanthus fragrans Lour. var. aurantiacus Makino,Lour.,Osmanthus fragrans var. aurantiacus Makino,Plantae,,,,Oleaceae,Osmanthus,Japan,Japan,"Nagai Botanical Garden, cult.",Osaka-shi,,Osaka Prefecture,Eastern Asia,Japan,,,,,,,,,,,,http://data.gbif.org/occurrences/295151885,http://data.gbif.org/ws/rest/occurrence/get?key=295151885
"National Museum of Nature and Science, Japan","Plant specimens depodited in Osaka Museum of Natural History, Japan.",,,,,,,OSA,C,OSA54049,Specimen,,21:36.0,,,Osmanthus fragrans Lour. var. aurantiacus Makino,Lour.,Osmanthus fragrans var. aurantiacus Makino,Plantae,,,,Oleaceae,Osmanthus,Japan,Japan,"Nagai Botanical Garden, cult.",Osaka-shi,,Osaka Prefecture,Eastern Asia,Japan,,,,,,,,,,,,http://data.gbif.org/occurrences/295151886,http://data.gbif.org/ws/rest/occurrence/get?key=295151886
Royal Botanic Garden Edinburgh,RBGE Herbarium (E),Copyright Royal Botanic Garden Edinburgh. Contact us for rights to commercial use.,"Furuse, M.",47337,,,00:00.0,E,E,E00264306,Specimen,,49:18.0,,,Osmanthus aurantiacus (Makino) Nakai,,Osmanthus aurantiacus (Makino) Nakai,,,,,Oleaceae,Osmanthus,JP,Japan,,,,,Eastern Asia,,,,,,,,,,,,,http://data.gbif.org/occurrences/575210944,http://data.gbif.org/ws/rest/occurrence/get?key=575210944
"National Museum of Nature and Science, Japan",Kochi Prefectural Makino Botanical Garden,,,,,,,MBK,MBK,2808,Specimen,,20:44.0,,,Osmanthus aurantiacus Nakai,Nakai,Osmanthus aurantiacus Nakai,Plantae,,,,Oleaceae,Osmanthus,Japan,Japan,Oizumi,Nerima-ku,,Tokyo,Eastern Asia,Japan,35.7663,139.592,,45319,75,,,,,,,http://data.gbif.org/occurrences/287506586,http://data.gbif.org/ws/rest/occurrence/get?key=287506586
"National Museum of Nature and Science, Japan",Kochi Prefectural Makino Botanical Garden,,,,,,,MBK,MBK,2805,Specimen,,20:43.0,,,Osmanthus aurantiacus Nakai,Nakai,Osmanthus aurantiacus Nakai,Plantae,,,,Oleaceae,Osmanthus,Japan,Japan,Oizumi,Nerima-ku,,Tokyo,Eastern Asia,Japan,35.7663,139.592,,45319,75,,,,,,,http://data.gbif.org/occurrences/287506580,http://data.gbif.org/ws/rest/occurrence/get?key=287506580
"National Museum of Nature and Science, Japan",Kochi Prefectural Makino Botanical Garden,,,,,,,MBK,MBK,186745,Specimen,,04:13.0,,,Osmanthus aurantiacus Nakai,Nakai,Osmanthus aurantiacus Nakai,Plantae,,,,Oleaceae,Osmanthus,Japan,Japan,Oizumi,Nerima-ku,,Tokyo,Eastern Asia,Japan,,,,,,,,,,,,http://data.gbif.org/occurrences/354282294,http://data.gbif.org/ws/rest/occurrence/get?key=354282294
"National Museum of Nature and Science, Japan",Kochi Prefectural Makino Botanical Garden,,,,,,,MBK,MBK,2807,Specimen,,20:44.0,,,Osmanthus aurantiacus Nakai,Nakai,Osmanthus aurantiacus Nakai,Plantae,,,,Oleaceae,Osmanthus,Japan,Japan,Oizumi,Nerima-ku,,Tokyo,Eastern Asia,Japan,35.7663,139.592,,45319,75,,,,,,,http://data.gbif.org/occurrences/287506584,http://data.gbif.org/ws/rest/occurrence/get?key=287506584
"National Museum of Nature and Science, Japan",Kochi Prefectural Makino Botanical Garden,,,,,,,MBK,MBK,2800,Specimen,,20:43.0,,,Osmanthus aurantiacus Nakai,Nakai,Osmanthus aurantiacus Nakai,Plantae,,,,Oleaceae,Osmanthus,Japan,Japan,Oizumi,Nerima-ku,,Tokyo,Eastern Asia,Japan,35.7663,139.592,,45319,75,,,,,,,http://data.gbif.org/occurrences/287506570,http://data.gbif.org/ws/rest/occurrence/get?key=287506570
"National Museum of Nature and Science, Japan",Kochi Prefectural Makino Botanical Garden,,,,,,,MBK,MBK,186820,Specimen,,04:13.0,,,Osmanthus aurantiacus Nakai,Nakai,Osmanthus aurantiacus Nakai,Plantae,,,,Oleaceae,Osmanthus,Japan,Japan,Oizumi,Nerima-ku,,Tokyo,Eastern Asia,Japan,,,,,,,,,,,,http://data.gbif.org/occurrences/354282299,http://data.gbif.org/ws/rest/occurrence/get?key=354282299
"National Museum of Nature and Science, Japan",Kochi Prefectural Makino Botanical Garden,,,,,,,MBK,MBK,2804,Specimen,,20:43.0,,,Osmanthus aurantiacus Nakai,Nakai,Osmanthus aurantiacus Nakai,Plantae,,,,Oleaceae,Osmanthus,Japan,Japan,Oizumi,Nerima-ku,,Tokyo,Eastern Asia,Japan,35.7663,139.592,,45319,75,,,,,,,http://data.gbif.org/occurrences/287506578,http://data.gbif.org/ws/rest/occurrence/get?key=287506578
"National Museum of Nature and Science, Japan",Kochi Prefectural Makino Botanical Garden,,,,,,,MBK,MBK,186746,Specimen,,04:13.0,,,Osmanthus aurantiacus Nakai,Nakai,Osmanthus aurantiacus Nakai,Plantae,,,,Oleaceae,Osmanthus,Japan,Japan,Oizumi,Nerima-ku,,Tokyo,Eastern Asia,Japan,,,,,,,,,,,,http://data.gbif.org/occurrences/354282295,http://data.gbif.org/ws/rest/occurrence/get?key=354282295
"National Museum of Nature and Science, Japan",Kochi Prefectural Makino Botanical Garden,,,,,,,MBK,MBK,2802,Specimen,,20:43.0,,,Osmanthus aurantiacus Nakai,Nakai,Osmanthus aurantiacus Nakai,Plantae,,,,Oleaceae,Osmanthus,Japan,Japan,Oizumi,Nerima-ku,,Tokyo,Eastern Asia,Japan,35.7663,139.592,,45319,75,,,,,,,http://data.gbif.org/occurrences/287506574,http://data.gbif.org/ws/rest/occurrence/get?key=287506574
"National Museum of Nature and Science, Japan",Kochi Prefectural Makino Botanical Garden,,,,,,,MBK,MBK,186793,Specimen,,04:13.0,,,Osmanthus aurantiacus Nakai,Nakai,Osmanthus aurantiacus Nakai,Plantae,,,,Oleaceae,Osmanthus,Japan,Japan,Oizumi,Nerima-ku,,Tokyo,Eastern Asia,Japan,,,,,,,,,,,,http://data.gbif.org/occurrences/354282305,http://data.gbif.org/ws/rest/occurrence/get?key=354282305
"National Museum of Nature and Science, Japan",Kochi Prefectural Makino Botanical Garden,,,,,,,MBK,MBK,2978,Specimen,,04:13.0,,,Osmanthus aurantiacus Nakai,Nakai,Osmanthus aurantiacus Nakai,Plantae,,,,Oleaceae,Osmanthus,Japan,Japan,Oizumi,Nerima-ku,,Tokyo,Eastern Asia,Japan,,,,,,,,,,,,http://data.gbif.org/occurrences/354282303,http://data.gbif.org/ws/rest/occurrence/get?key=354282303
"National Museum of Nature and Science, Japan",Kochi Prefectural Makino Botanical Garden,,,,,,,MBK,MBK,2809,Specimen,,20:44.0,,,Osmanthus aurantiacus Nakai,Nakai,Osmanthus aurantiacus Nakai,Plantae,,,,Oleaceae,Osmanthus,Japan,Japan,Oizumi,Nerima-ku,,Tokyo,Eastern Asia,Japan,35.7663,139.592,,45319,75,,,,,,,http://data.gbif.org/occurrences/287506588,http://data.gbif.org/ws/rest/occurrence/get?key=287506588
"National Museum of Nature and Science, Japan",Kochi Prefectural Makino Botanical Garden,,,,,,,MBK,MBK,186825,Specimen,,04:13.0,,,Osmanthus aurantiacus Nakai,Nakai,Osmanthus aurantiacus Nakai,Plantae,,,,Oleaceae,Osmanthus,Japan,Japan,Oizumi,Nerima-ku,,Tokyo,Eastern Asia,Japan,,,,,,,,,,,,http://data.gbif.org/occurrences/354282302,http://data.gbif.org/ws/rest/occurrence/get?key=354282302
"National Museum of Nature and Science, Japan",Kochi Prefectural Makino Botanical Garden,,,,,,,MBK,MBK,2979,Specimen,,04:13.0,,,Osmanthus aurantiacus Nakai,Nakai,Osmanthus aurantiacus Nakai,Plantae,,,,Oleaceae,Osmanthus,Japan,Japan,Oizumi,Nerima-ku,,Tokyo,Eastern Asia,Japan,,,,,,,,,,,,http://data.gbif.org/occurrences/354282304,http://data.gbif.org/ws/rest/occurrence/get?key=354282304
"National Museum of Nature and Science, Japan",Kochi Prefectural Makino Botanical Garden,,,,,,,MBK,MBK,2806,Specimen,,20:43.0,,,Osmanthus aurantiacus Nakai,Nakai,Osmanthus aurantiacus Nakai,Plantae,,,,Oleaceae,Osmanthus,Japan,Japan,Oizumi,Nerima-ku,,Tokyo,Eastern Asia,Japan,35.7663,139.592,,45319,75,,,,,,,http://data.gbif.org/occurrences/287506582,http://data.gbif.org/ws/rest/occurrence/get?key=287506582
"National Museum of Nature and Science, Japan",Kochi Prefectural Makino Botanical Garden,,,,,,,MBK,MBK,2977,Specimen,,04:13.0,,,Osmanthus aurantiacus Nakai,Nakai,Osmanthus aurantiacus Nakai,Plantae,,,,Oleaceae,Osmanthus,Japan,Japan,Oizumi,Nerima-ku,,Tokyo,Eastern Asia,Japan,,,,,,,,,,,,http://data.gbif.org/occurrences/354282298,http://data.gbif.org/ws/rest/occurrence/get?key=354282298
"National Museum of Nature and Science, Japan",Kochi Prefectural Makino Botanical Garden,,,,,,,MBK,MBK,2811,Specimen,,20:44.0,,,Osmanthus aurantiacus Nakai,Nakai,Osmanthus aurantiacus Nakai,Plantae,,,,Oleaceae,Osmanthus,Japan,Japan,Oizumi,Nerima-ku,,Tokyo,Eastern Asia,Japan,35.7663,139.592,,45319,75,,,,,,,http://data.gbif.org/occurrences/287506592,http://data.gbif.org/ws/rest/occurrence/get?key=287506592
"National Museum of Nature and Science, Japan",Kochi Prefectural Makino Botanical Garden,,,,,,,MBK,MBK,186747,Specimen,,04:13.0,,,Osmanthus aurantiacus Nakai,Nakai,Osmanthus aurantiacus Nakai,Plantae,,,,Oleaceae,Osmanthus,Japan,Japan,Oizumi,Nerima-ku,,Tokyo,Eastern Asia,Japan,,,,,,,,,,,,http://data.gbif.org/occurrences/354282296,http://data.gbif.org/ws/rest/occurrence/get?key=354282296
"National Museum of Nature and Science, Japan",Kochi Prefectural Makino Botanical Garden,,,,,,,MBK,MBK,2810,Specimen,,20:44.0,,,Osmanthus aurantiacus Nakai,Nakai,Osmanthus aurantiacus Nakai,Plantae,,,,Oleaceae,Osmanthus,Japan,Japan,Oizumi,Nerima-ku,,Tokyo,Eastern Asia,Japan,35.7663,139.592,,45319,75,,,,,,,http://data.gbif.org/occurrences/287506590,http://data.gbif.org/ws/rest/occurrence/get?key=287506590
"National Museum of Nature and Science, Japan",Kochi Prefectural Makino Botanical Garden,,,,,,,MBK,MBK,2801,Specimen,,20:43.0,,,Osmanthus aurantiacus Nakai,Nakai,Osmanthus aurantiacus Nakai,Plantae,,,,Oleaceae,Osmanthus,Japan,Japan,Oizumi,Nerima-ku,,Tokyo,Eastern Asia,Japan,35.7663,139.592,,45319,75,,,,,,,http://data.gbif.org/occurrences/287506572,http://data.gbif.org/ws/rest/occurrence/get?key=287506572
"National Museum of Nature and Science, Japan",Kochi Prefectural Makino Botanical Garden,,,,,,,MBK,MBK,186826,Specimen,,04:13.0,,,Osmanthus aurantiacus Nakai,Nakai,Osmanthus aurantiacus Nakai,Plantae,,,,Oleaceae,Osmanthus,Japan,Japan,Oizumi,Nerima-ku,,Tokyo,Eastern Asia,Japan,,,,,,,,,,,,http://data.gbif.org/occurrences/354282301,http://data.gbif.org/ws/rest/occurrence/get?key=354282301
"National Museum of Nature and Science, Japan",Kochi Prefectural Makino Botanical Garden,,,,,,,MBK,MBK,2980,Specimen,,04:13.0,,,Osmanthus aurantiacus Nakai,Nakai,Osmanthus aurantiacus Nakai,Plantae,,,,Oleaceae,Osmanthus,Japan,Japan,Oizumi,Nerima-ku,,Tokyo,Eastern Asia,Japan,,,,,,,,,,,,http://data.gbif.org/occurrences/354282300,http://data.gbif.org/ws/rest/occurrence/get?key=354282300
"National Museum of Nature and Science, Japan",Kochi Prefectural Makino Botanical Garden,,,,,,,MBK,MBK,186744,Specimen,,04:13.0,,,Osmanthus aurantiacus Nakai,Nakai,Osmanthus aurantiacus Nakai,Plantae,,,,Oleaceae,Osmanthus,Japan,Japan,Oizumi,Nerima-ku,,Tokyo,Eastern Asia,Japan,,,,,,,,,,,,http://data.gbif.org/occurrences/354282293,http://data.gbif.org/ws/rest/occurrence/get?key=354282293
"National Museum of Nature and Science, Japan",Kochi Prefectural Makino Botanical Garden,,,,,,,MBK,MBK,2812,Specimen,,20:44.0,,,Osmanthus aurantiacus Nakai,Nakai,Osmanthus aurantiacus Nakai,Plantae,,,,Oleaceae,Osmanthus,Japan,Japan,Oizumi,Nerima-ku,,Tokyo,Eastern Asia,Japan,35.7663,139.592,,45319,75,,,,,,,http://data.gbif.org/occurrences/287506594,http://data.gbif.org/ws/rest/occurrence/get?key=287506594
"National Museum of Nature and Science, Japan",Kochi Prefectural Makino Botanical Garden,,,,,,,MBK,MBK,186748,Specimen,,04:13.0,,,Osmanthus aurantiacus Nakai,Nakai,Osmanthus aurantiacus Nakai,Plantae,,,,Oleaceae,Osmanthus,Japan,Japan,Oizumi,Nerima-ku,,Tokyo,Eastern Asia,Japan,,,,,,,,,,,,http://data.gbif.org/occurrences/354282297,http://data.gbif.org/ws/rest/occurrence/get?key=354282297
