Data Publisher,Dataset,Dataset Rights,Collector name,Collector number,Field number,GUID,Date collected,Institution code,Collection code,Catalogue number,Basis of record,Image url,Last indexed,Identifier,Identification date,Scientific name,Author,Scientific name (interpreted),Kingdom,Phylum,Class,Order,Family,Genus,Country,Country (interpreted),Locality,County,Continent or Ocean,State/Province,Region,Publisher country,Latitude,Longitude,Coordinate precision,Cell id,Centi cell id,Min depth,Max depth,Max depth,Min altitude,Max altitude,Altitude precision,GBIF portal url,GBIF webservice url
"National Museum of Nature and Science, Japan","FKSE-Herbarium specimens of Faculty of Symbiotic Systems Science, Fukushima University, Japan",,,,,,,FKSE,Plant,8712,Specimen,,51:10.0,,,Cardamine impatiens L.  var. eriocarpa DC.,L.,Cardamine impatiens var. eriocarpa DC.,Plantae,,,,BRASSICACEAE,Cardamine,Japan,Japan,"Honshu, Tohoku Distr., Fukushima Pref., Yama-gun, Inawashiro-machi, Kijigoya",,,,Eastern Asia,Japan,,,,,,,,,,,,http://data.gbif.org/occurrences/238089092,http://data.gbif.org/ws/rest/occurrence/get?key=238089092
"National Museum of Nature and Science, Japan","FKSE-Herbarium specimens of Faculty of Symbiotic Systems Science, Fukushima University, Japan",,,,,,,FKSE,Plant,8713,Specimen,,51:10.0,,,Cardamine impatiens L.  var. eriocarpa DC.,L.,Cardamine impatiens var. eriocarpa DC.,Plantae,,,,BRASSICACEAE,Cardamine,Japan,Japan,"Honshu, Tohoku Distr., Fukushima Pref., Oonuma-gun, Takada-machi",,,,Eastern Asia,Japan,,,,,,,,,,,,http://data.gbif.org/occurrences/238089093,http://data.gbif.org/ws/rest/occurrence/get?key=238089093
"National Museum of Nature and Science, Japan","Herbarium Specimens of Tokushima Prefectural Museum, Japan",,,,,,,TKPM,B,SP042446,Specimen,,22:02.0,,,Cardamine impatiens L.  var. eriocarpa DC.,L.,Cardamine impatiens var. eriocarpa DC.,Plantae,Angiospermae,Dicotyledoneae,Angiospermae,Cruciferae,Cardamine,Japan,Japan,,Ikeda-cho,,Tokushima Pref.,Eastern Asia,Japan,,,,,,,,,,,,http://data.gbif.org/occurrences/150127100,http://data.gbif.org/ws/rest/occurrence/get?key=150127100
"National Museum of Nature and Science, Japan","Herbarium Specimens of Tokushima Prefectural Museum, Japan",,,,,,,TKPM,B,SP037754,Specimen,,22:02.0,,,Cardamine impatiens L.  var. eriocarpa DC.,L.,Cardamine impatiens var. eriocarpa DC.,Plantae,Angiospermae,Dicotyledoneae,Angiospermae,Cruciferae,Cardamine,Japan,Japan,,Kainan-cho,,Tokushima Pref.,Eastern Asia,Japan,,,,,,,,,,,,http://data.gbif.org/occurrences/150127026,http://data.gbif.org/ws/rest/occurrence/get?key=150127026
"National Museum of Nature and Science, Japan","Vascular Plant Collection of Natural History Museum and Institute, Chiba",,,,,,,CBM,BS,38391,Specimen,,58:23.0,,,Cardamine impatiens L.  var. eriocarpa DC.,L.,Cardamine impatiens var. eriocarpa DC.,Plantae,Angiospermae,Dicotyledoneae,Papaverales,Cruciferae,Cardamine,Japan,Japan,Tsukizaki,Ichihara-shi,,Chiba,Eastern Asia,Japan,,,,,,,,,,,,http://data.gbif.org/occurrences/624040311,http://data.gbif.org/ws/rest/occurrence/get?key=624040311
"National Museum of Nature and Science, Japan","Vascular Plant Collection of Natural History Museum and Institute, Chiba",,,,,,,CBM,BS,38464,Specimen,,58:23.0,,,Cardamine impatiens L.  var. eriocarpa DC.,L.,Cardamine impatiens var. eriocarpa DC.,Plantae,Angiospermae,Dicotyledoneae,Papaverales,Cruciferae,Cardamine,Japan,Japan,Imobara,Ichihara-shi,,Chiba,Eastern Asia,Japan,,,,,,,,,,,,http://data.gbif.org/occurrences/624040312,http://data.gbif.org/ws/rest/occurrence/get?key=624040312
"National Museum of Nature and Science, Japan",Angiospermatatophytina Collection of Saitama Museum of Natural History,,,,,,,SMNH,As,22963,Specimen,,52:20.0,,,Cardamine impatiens L. var. eriocarpa DC.,DC.,Cardamine impatiens var. eriocarpa DC.,Plantae,Angiospermae,Dicotyledoneae,Papaverales,Cruciferae,Cardamine,Japan,Japan,,,,Yamanashi,Eastern Asia,Japan,,,,,,,,,,,,http://data.gbif.org/occurrences/393093278,http://data.gbif.org/ws/rest/occurrence/get?key=393093278
"National Museum of Nature and Science, Japan",Kochi Prefectural Makino Botanical Garden,,,,,,,MBK,MBK,380,Specimen,,22:24.0,,,Cardamine impatiens L. var. eriocarpa DC.,L.,Cardamine impatiens var. eriocarpa DC.,Plantae,,,,Cruciferae,Cardamine,Japan,Japan,Mt. Kariyose-yama,,,Tokyo,Eastern Asia,Japan,35.5796,139.716,,45319,57,,,,,,,http://data.gbif.org/occurrences/287490804,http://data.gbif.org/ws/rest/occurrence/get?key=287490804
"National Museum of Nature and Science, Japan",Kochi Prefectural Makino Botanical Garden,,,,,,,MBK,MBK,333,Specimen,,03:00.0,,,Cardamine impatiens L. var. eriocarpa DC.,L.,Cardamine impatiens var. eriocarpa DC.,Plantae,,,,Cruciferae,Cardamine,Japan,Japan,Mt. Kariyose-yama,,,Tokyo,Eastern Asia,Japan,,,,,,,,,,,,http://data.gbif.org/occurrences/354275278,http://data.gbif.org/ws/rest/occurrence/get?key=354275278
"National Museum of Nature and Science, Japan",Plant Specimens of Kurashiki Museum of Natural History,,,,,,,KURA,KURA,43515,Specimen,,12:32.0,,,Cardamine impatiens L. var. eriocarpa DC.,,Cardamine impatiens var. eriocarpa DC.,Plantae,,,Papaverales,Cruciferae,Cardamine,Japan,Japan,Imazaike,Okayama City,,Okayama Prefecture,Eastern Asia,Japan,,,,,,,,,,,,http://data.gbif.org/occurrences/148833140,http://data.gbif.org/ws/rest/occurrence/get?key=148833140
"National Museum of Nature and Science, Japan",Plant Specimens of Kurashiki Museum of Natural History,,,,,,,KURA,KURA,43514,Specimen,,12:32.0,,,Cardamine impatiens L. var. eriocarpa DC.,,Cardamine impatiens var. eriocarpa DC.,Plantae,,,Papaverales,Cruciferae,Cardamine,Japan,Japan,Imazaike,Okayama City,,Okayama Prefecture,Eastern Asia,Japan,,,,,,,,,,,,http://data.gbif.org/occurrences/148833139,http://data.gbif.org/ws/rest/occurrence/get?key=148833139
"National Museum of Nature and Science, Japan","Plant specimens depodited in Osaka Museum of Natural History, Japan.",,,,,,,OSA,C,OSA8635,Specimen,,16:57.0,,,Cardamine impatiens L. var. eriocarpa DC.,L.,Cardamine impatiens var. eriocarpa DC.,Plantae,,,,Brassicaceae,Cardamine,Japan,Japan,Kata Seashore,Wakayama-shi,,Wakayama Prefecture,Eastern Asia,Japan,,,,,,,,,,,,http://data.gbif.org/occurrences/295115439,http://data.gbif.org/ws/rest/occurrence/get?key=295115439
"National Museum of Nature and Science, Japan","Plant specimens depodited in Osaka Museum of Natural History, Japan.",,,,,,,OSA,C,OSA66233,Specimen,,16:59.0,,,Cardamine impatiens L. var. eriocarpa DC.,L.,Cardamine impatiens var. eriocarpa DC.,Plantae,,,,Brassicaceae,Cardamine,Japan,Japan,,Watarai-gun Nantocho,,Mie Prefecture,Eastern Asia,Japan,,,,,,,,,,,,http://data.gbif.org/occurrences/295115867,http://data.gbif.org/ws/rest/occurrence/get?key=295115867
"National Museum of Nature and Science, Japan","Plant specimens depodited in Osaka Museum of Natural History, Japan.",,,,,,,OSA,C,OSA21404,Specimen,,16:58.0,,,Cardamine impatiens L. var. eriocarpa DC.,L.,Cardamine impatiens var. eriocarpa DC.,Plantae,,,,Brassicaceae,Cardamine,Japan,Japan,Nariai,Takatsuki-shi,,Osaka Prefecture,Eastern Asia,Japan,,,,,,,,,,,,http://data.gbif.org/occurrences/295115528,http://data.gbif.org/ws/rest/occurrence/get?key=295115528
"National Museum of Nature and Science, Japan","Plant specimens depodited in Osaka Museum of Natural History, Japan.",,,,,,,OSA,C,OSA66234,Specimen,,16:59.0,,,Cardamine impatiens L. var. eriocarpa DC.,L.,Cardamine impatiens var. eriocarpa DC.,Plantae,,,,Brassicaceae,Cardamine,Japan,Japan,,Watarai-gun Nantocho,,Mie Prefecture,Eastern Asia,Japan,,,,,,,,,,,,http://data.gbif.org/occurrences/295115868,http://data.gbif.org/ws/rest/occurrence/get?key=295115868
"National Museum of Nature and Science, Japan","Plant specimens depodited in Osaka Museum of Natural History, Japan.",,,,,,,OSA,C,OSA21514,Specimen,,16:58.0,,,Cardamine impatiens L. var. eriocarpa DC.,L.,Cardamine impatiens var. eriocarpa DC.,Plantae,,,,Brassicaceae,Cardamine,Japan,Japan,Nakanohata,Takatsuki-shi,,Osaka Prefecture,Eastern Asia,Japan,,,,,,,,,,,,http://data.gbif.org/occurrences/295115533,http://data.gbif.org/ws/rest/occurrence/get?key=295115533
"National Museum of Nature and Science, Japan",Vascular Plants Collection of Sagamihara City Museum,,,,,,,JSCM,VS,16005,Specimen,,42:15.0,,,Cardamine impatiens L. var. eriocarpa DC.,L.,Cardamine impatiens var. eriocarpa DC.,Plantae,Spermatophyta,,,CRUCIFERAE,Cardamine,Japan,Japan,,Hachioji-shi,,Tokyo,Eastern Asia,Japan,,,,,,,,,,,,http://data.gbif.org/occurrences/351214028,http://data.gbif.org/ws/rest/occurrence/get?key=351214028
"National Museum of Nature and Science, Japan",Vascular Plant Specimen Database of Kanagawa Prefectural Museum of Natural History,,,,,,,KPM,NA,KPM-NA0150602,Specimen,,23:13.0,,,Cardamine impatiens L. var. eriocarpa DC.,,Cardamine impatiens var. eriocarpa DC.,Plantae,Angiospermae,Dicotyledoneae,,BRASSICACEAE (CRUCIFERAE),Cardamine,Japan,Japan,,"Tsukui-gun, Fujino-machi",,Kanagawa Prefecture,Eastern Asia,Japan,,,,,,,,,,,,http://data.gbif.org/occurrences/388801012,http://data.gbif.org/ws/rest/occurrence/get?key=388801012
"National Museum of Nature and Science, Japan",Vascular Plant Specimen Database of Kanagawa Prefectural Museum of Natural History,,,,,,,KPM,NA,KPM-NA1040765,Specimen,,23:11.0,,,Cardamine impatiens L. var. eriocarpa DC.,,Cardamine impatiens var. eriocarpa DC.,Plantae,Angiospermae,Dicotyledoneae,,CRUCIFERAE,Cardamine,Japan,Japan,,"Tsukui-gun, Fujino-machi",,Kanagawa Prefecture,Eastern Asia,Japan,35.5741,139.191,,45319,51,,,,,,,http://data.gbif.org/occurrences/234412841,http://data.gbif.org/ws/rest/occurrence/get?key=234412841
"National Museum of Nature and Science, Japan",Vascular Plant Specimen Database of Kanagawa Prefectural Museum of Natural History,,,,,,,KPM,NA,KPM-NA1040819,Specimen,,23:11.0,,,Cardamine impatiens L. var. eriocarpa DC.,,Cardamine impatiens var. eriocarpa DC.,Plantae,Angiospermae,Dicotyledoneae,,CRUCIFERAE,Cardamine,Japan,Japan,Mine-machi,"Yokohama-shi, Isogo-ku",,Kanagawa Prefecture,Eastern Asia,Japan,35.3658,139.603,,45319,36,,,,,,,http://data.gbif.org/occurrences/234412891,http://data.gbif.org/ws/rest/occurrence/get?key=234412891
"National Museum of Nature and Science, Japan",Vascular Plant Specimen Database of Kanagawa Prefectural Museum of Natural History,,,,,,,KPM,NA,KPM-NA0113791,Specimen,,23:13.0,,,Cardamine impatiens L. var. eriocarpa DC.,,Cardamine impatiens var. eriocarpa DC.,Plantae,Angiospermae,Dicotyledoneae,,BRASSICACEAE (CRUCIFERAE),Cardamine,Japan,Japan,,"Ashigarakami-gun, Yamakita-machi",,Kanagawa Prefecture,Eastern Asia,Japan,,,,,,,,,,,,http://data.gbif.org/occurrences/388800933,http://data.gbif.org/ws/rest/occurrence/get?key=388800933
"National Institute of Genetics, ROIS","Herbarium Specimens of Museum of Nature and Human Activities, Hyogo Pref., Japan",,,,,,,HYO,VP,C1-109727,Specimen,,22:16.0,,,Cardamine impatiens var. eriocarpa,,Cardamine impatiens var. eriocarpa,Plantae,Magnoliophyta,,,Cruciferae,Cardamine,Japan,Japan,"Pref. Hyogo: Takedao, Nishinomiya City.",,,Hyogo,Eastern Asia,Japan,135.317,34.85,,,,,,,100,200,,http://data.gbif.org/occurrences/323499035,http://data.gbif.org/ws/rest/occurrence/get?key=323499035
"National Institute of Genetics, ROIS","Herbarium Specimens of Museum of Nature and Human Activities, Hyogo Pref., Japan",,,,,,,HYO,VP,C1-160844,Specimen,,24:51.0,N.Kurosaki,,Cardamine impatiens var. eriocarpa,,Cardamine impatiens var. eriocarpa,Plantae,Magnoliophyta,,,Cruciferae,Cardamine,Japan,Japan,"Hyogo Pref.; Mikata-gun, Hamasaka-cho, Toishi-dani",,,Hyogo,Eastern Asia,Japan,134.45,35.5833,,,,,,,,,,http://data.gbif.org/occurrences/323512978,http://data.gbif.org/ws/rest/occurrence/get?key=323512978
"National Institute of Genetics, ROIS","Herbarium Specimens of Museum of Nature and Human Activities, Hyogo Pref., Japan",,,,,,,HYO,VP,C1-160858,Specimen,,25:32.0,,,Cardamine impatiens var. eriocarpa,,Cardamine impatiens var. eriocarpa,Plantae,Magnoliophyta,,,Cruciferae,Cardamine,Japan,Japan,"Hyogo Pref.; Yabu-gun, Yohka-cho, Ishihara, along Osa-gawa rivre.",,,Hyogo,Eastern Asia,Japan,134.7,35.4,,,,,,,200,400,,http://data.gbif.org/occurrences/323517045,http://data.gbif.org/ws/rest/occurrence/get?key=323517045
"National Institute of Genetics, ROIS","Herbarium Specimens of Museum of Nature and Human Activities, Hyogo Pref., Japan",,,,,,,HYO,VP,C1-160859,Specimen,,25:12.0,,,Cardamine impatiens var. eriocarpa,,Cardamine impatiens var. eriocarpa,Plantae,Magnoliophyta,,,Cruciferae,Cardamine,Japan,Japan,"Hyogo Pref.; Takarazuka-shi, Takedao.",,,Hyogo,Eastern Asia,Japan,135.3,34.85,,,,,,,100,200,,http://data.gbif.org/occurrences/323515057,http://data.gbif.org/ws/rest/occurrence/get?key=323515057
"National Institute of Genetics, ROIS","Herbarium Specimens of Museum of Nature and Human Activities, Hyogo Pref., Japan",,,,,,,HYO,VP,C1-047056,Specimen,,23:00.0,G.Murata,,Cardamine impatiens var. eriocarpa,,Cardamine impatiens var. eriocarpa,Plantae,Magnoliophyta,,,Cruciferae,Cardamine,Japan,Japan,"Honshu Pref.-Kyouto : Kitakuwata-gun, Ryu-ga-take.",,,Kyoto,Eastern Asia,Japan,,,,,,,,,500,700,,http://data.gbif.org/occurrences/323503261,http://data.gbif.org/ws/rest/occurrence/get?key=323503261
"National Institute of Genetics, ROIS","Herbarium Specimens of Museum of Nature and Human Activities, Hyogo Pref., Japan",,,,,,,HYO,VP,C1-161457,Specimen,,25:25.0,,,Cardamine impatiens var. eriocarpa,,Cardamine impatiens var. eriocarpa,Plantae,Magnoliophyta,,,Cruciferae,Cardamine,Japan,Japan,"Hyogo Pref.; Yabu-gun, Ohya-cho, Wakasu, Fujinashi-yama.",,,Hyogo,Eastern Asia,Japan,,,,,,,,,,,,http://data.gbif.org/occurrences/323516333,http://data.gbif.org/ws/rest/occurrence/get?key=323516333
"National Institute of Genetics, ROIS","Herbarium Specimens of Museum of Nature and Human Activities, Hyogo Pref., Japan",,,,,,,HYO,VP,C1-109074,Specimen,,26:35.0,,,Cardamine impatiens var. eriocarpa,,Cardamine impatiens var. eriocarpa,Plantae,Magnoliophyta,,,Cruciferae,Cardamine,Japan,Japan,"Pref. Hyogo: along the river Muko-gawa, Takedao, Takaraduka City.",,,Hyogo,Eastern Asia,Japan,135.317,34.85,,,,,,,120,200,,http://data.gbif.org/occurrences/323523153,http://data.gbif.org/ws/rest/occurrence/get?key=323523153
"National Institute of Genetics, ROIS","Herbarium Specimens of Museum of Nature and Human Activities, Hyogo Pref., Japan",,,,,,,HYO,VP,C1-172010,Specimen,,24:17.0,,,Cardamine impatiens var. eriocarpa,,Cardamine impatiens var. eriocarpa,Plantae,Magnoliophyta,,,Cruciferae,Cardamine,Japan,Japan,"Hyogo Pref.; en route from Tentaki falls to Ikada, Ooya-cho, Yabu-gun.",,,Hyogo,Eastern Asia,Japan,134.617,35.3333,,,,,,,300,600,,http://data.gbif.org/occurrences/323509873,http://data.gbif.org/ws/rest/occurrence/get?key=323509873
"National Institute of Genetics, ROIS","Herbarium Specimens of Museum of Nature and Human Activities, Hyogo Pref., Japan",,,,,,,HYO,VP,C1-160864,Specimen,,26:30.0,,,Cardamine impatiens var. eriocarpa,,Cardamine impatiens var. eriocarpa,Plantae,Magnoliophyta,,,Cruciferae,Cardamine,Japan,Japan,"Okayama Pref.; Maniwa-gun, Yubara-cho, Tabane.",,,Okayama,Eastern Asia,Japan,133.767,35.2167,,,,,,,420,580,,http://data.gbif.org/occurrences/323522632,http://data.gbif.org/ws/rest/occurrence/get?key=323522632
"National Institute of Genetics, ROIS","Herbarium Specimens of Museum of Nature and Human Activities, Hyogo Pref., Japan",,,,,,,HYO,VP,C1-172340,Specimen,,21:07.0,,,Cardamine impatiens var. eriocarpa,,Cardamine impatiens var. eriocarpa,Plantae,Magnoliophyta,,,Cruciferae,Cardamine,Japan,Japan,"Hyogo Pref.; Mt.Funakoshi-yama, Nanko-cho, Sayo-gun.",,,Hyogo,Eastern Asia,Japan,,,,,,,,,,,,http://data.gbif.org/occurrences/323485991,http://data.gbif.org/ws/rest/occurrence/get?key=323485991
"National Institute of Genetics, ROIS","Herbarium Specimens of Museum of Nature and Human Activities, Hyogo Pref., Japan",,,,,,,HYO,VP,C1-106340,Specimen,,27:29.0,,,Cardamine impatiens var. eriocarpa,,Cardamine impatiens var. eriocarpa,Plantae,Magnoliophyta,,,Cruciferae,Cardamine,Japan,Japan,"Shiga Pref.; Sakata-gun, Ibuki-cho, Ibuki-yama Mt. SW slope",,,Shiga,Eastern Asia,Japan,,,,,,,,,,,,http://data.gbif.org/occurrences/323528433,http://data.gbif.org/ws/rest/occurrence/get?key=323528433
"National Institute of Genetics, ROIS","Herbarium Specimens of Museum of Nature and Human Activities, Hyogo Pref., Japan",,,,,,,HYO,VP,C1-005635,Specimen,,25:34.0,,,Cardamine impatiens var. eriocarpa,,Cardamine impatiens var. eriocarpa,Plantae,Magnoliophyta,,,Cruciferae,Cardamine,Japan,Japan,"Hyogo Pref.; Yabu-gun, Yohka-cho, Shukuminami.",,,Hyogo,Eastern Asia,Japan,134.783,35.4333,,,,,,,,,,http://data.gbif.org/occurrences/323517200,http://data.gbif.org/ws/rest/occurrence/get?key=323517200
"National Institute of Genetics, ROIS","Herbarium Specimens of Museum of Nature and Human Activities, Hyogo Pref., Japan",,,,,,,HYO,VP,C1-006418,Specimen,,20:28.0,,,Cardamine impatiens var. eriocarpa,,Cardamine impatiens var. eriocarpa,Plantae,Magnoliophyta,,,Cruciferae,Cardamine,Japan,Japan,"Hyogo Pref.; Mihara-gun, Seidan-cho, Matsuho",,,Hyogo,Eastern Asia,Japan,134.633,35.45,,,,,,,,,,http://data.gbif.org/occurrences/323479231,http://data.gbif.org/ws/rest/occurrence/get?key=323479231
