Data Publisher,Dataset,Dataset Rights,Collector name,Collector number,Field number,GUID,Date collected,Institution code,Collection code,Catalogue number,Basis of record,Image url,Last indexed,Identifier,Identification date,Scientific name,Author,Scientific name (interpreted),Kingdom,Phylum,Class,Order,Family,Genus,Country,Country (interpreted),Locality,County,Continent or Ocean,State/Province,Region,Publisher country,Latitude,Longitude,Coordinate precision,Cell id,Centi cell id,Min depth,Max depth,Max depth,Min altitude,Max altitude,Altitude precision,GBIF portal url,GBIF webservice url
"National Museum of Nature and Science, Japan","Plant specimens depodited in Osaka Museum of Natural History, Japan.",,,,,,,OSA,C,OSA26570,Specimen,,25:33.0,,,Viola thibaudieri F. et S.,F. et S.,Viola thibaudieri F. & S.,Plantae,,,,Violaceae,Viola,Japan,Japan,,Higashichikuma-gun Hongomura,,Nagano Prefecture,Eastern Asia,Japan,,,,,,,,,,,,http://data.gbif.org/occurrences/295180208,http://data.gbif.org/ws/rest/occurrence/get?key=295180208
"National Museum of Nature and Science, Japan","Plant specimens depodited in Osaka Museum of Natural History, Japan.",,,,,,,OSA,C,OSA71674,Specimen,,25:34.0,,,Viola thibaudieri F. et S.,,Viola thibaudieri F. & S.,Plantae,,,,Violaceae,Viola,Japan,Japan,Around Mt. Hakamagoshi-yama,Higashichikuma-gun Hongomura,,Nagano,Eastern Asia,Japan,,,,,,,,,,,,http://data.gbif.org/occurrences/295180535,http://data.gbif.org/ws/rest/occurrence/get?key=295180535
"National Museum of Nature and Science, Japan","Plant specimens depodited in Osaka Museum of Natural History, Japan.",,,,,,,OSA,C,OSA71675,Specimen,,25:34.0,,,Viola thibaudieri F. et S.,,Viola thibaudieri F. & S.,Plantae,,,,Violaceae,Viola,Japan,Japan,Around Mt. Hakamagoshi-yama,Higashichikuma-gun Hongomura,,Nagano,Eastern Asia,Japan,,,,,,,,,,,,http://data.gbif.org/occurrences/295180536,http://data.gbif.org/ws/rest/occurrence/get?key=295180536
"National Museum of Nature and Science, Japan","Plant specimens depodited in Osaka Museum of Natural History, Japan.",,,,,,,OSA,C,OSA25220,Specimen,,25:33.0,,,Viola thibaudieri F. et S.,F. et S.,Viola thibaudieri F. & S.,Plantae,,,,Violaceae,Viola,Japan,Japan,,Higashichikuma-gun Hongomura,,Nagano Prefecture,Eastern Asia,Japan,,,,,,,,,,,,http://data.gbif.org/occurrences/295180182,http://data.gbif.org/ws/rest/occurrence/get?key=295180182
"National Museum of Nature and Science, Japan","Plant specimens depodited in Osaka Museum of Natural History, Japan.",,,,,,,OSA,C,OSA71667,Specimen,,25:34.0,,,Viola thibaudieri Fr. et Sav.,,Viola thibaudieri Fr. & Sav.,Plantae,,,,Violaceae,Viola,Japan,Japan,Around Mt. Hakamagoshi-yama,Higashichikuma-gun Hongomura,,Nagano,Eastern Asia,Japan,,,,,,,,,,,,http://data.gbif.org/occurrences/295180533,http://data.gbif.org/ws/rest/occurrence/get?key=295180533
"National Museum of Nature and Science, Japan",Angiosperm specimens of Iwate Prefectural Museum,,,,,,,IPMM,PA,72562,Specimen,,00:23.0,,,Viola thibaudieri Franch. et Sav.,Franch. et Sav.,Viola thibaudieri Franch. & Sav.,Plantae,Angiospermae,Dicotyledoneae,,Violaceae,Viola,Japan,Japan,,Matsumoto-shi,,Nagano,Eastern Asia,Japan,,,,,,,,,,,,http://data.gbif.org/occurrences/93899088,http://data.gbif.org/ws/rest/occurrence/get?key=93899088
"National Museum of Nature and Science, Japan",Angiosperm specimens of Iwate Prefectural Museum,,,,,,,IPMM,PA,72561,Specimen,,00:23.0,,,Viola thibaudieri Franch. et Sav.,Franch. et Sav.,Viola thibaudieri Franch. & Sav.,Plantae,Angiospermae,Dicotyledoneae,,Violaceae,Viola,Japan,Japan,,Matsumoto-shi,,Nagano,Eastern Asia,Japan,,,,,,,,,,,,http://data.gbif.org/occurrences/93899075,http://data.gbif.org/ws/rest/occurrence/get?key=93899075
"National Institute of Genetics, ROIS","Plant Specimen Database of Tama Forest Science Garden, Forestry and Forest Products Research Institute, Japan",,,,,,,FFPRI,TFA,19779,Specimen,,23:46.0,,,Viola thibaudieri Franch. et Sav.,,Viola thibaudieri Franch. & Sav.,Plantae,Magnoliophyta,Magnoliopsida,Violales,Violaceae,Viola,Japan,Japan,,,,Nagano Prefecture,Eastern Asia,Japan,,,,,,,,,,,,http://data.gbif.org/occurrences/360263083,http://data.gbif.org/ws/rest/occurrence/get?key=360263083
"National Museum of Nature and Science, Japan","Ibaraki Nature Museum, Vascular Plants collection",,,,,,,INM,Va,41836,Specimen,,54:59.0,,,Viola thibaudieri Franch. et Savat.,Franch. et Savat.,Viola thibaudieri Franch. & Savat.,Plantae,ANGIOSPERMAE,DICOTYLEDONEAE,,VIOLACEAE,Viola,Japan,Japan,,,,,Eastern Asia,Japan,,,,,,,,,,,,http://data.gbif.org/occurrences/381852453,http://data.gbif.org/ws/rest/occurrence/get?key=381852453
