Data Publisher,Dataset,Dataset Rights,Collector name,Collector number,Field number,GUID,Date collected,Institution code,Collection code,Catalogue number,Basis of record,Image url,Last indexed,Identifier,Identification date,Scientific name,Author,Scientific name (interpreted),Kingdom,Phylum,Class,Order,Family,Genus,Country,Country (interpreted),Locality,County,Continent or Ocean,State/Province,Region,Publisher country,Latitude,Longitude,Coordinate precision,Cell id,Centi cell id,Min depth,Max depth,Max depth,Min altitude,Max altitude,Altitude precision,GBIF portal url,GBIF webservice url
"National Museum of Nature and Science, Japan","Herbarium Specimens of Tokushima Prefectural Museum, Japan",,,,,,,TKPM,B,SP136412,Specimen,,23:45.0,,,Smilax sieboldii Miq.  f. inermis (Nakai) H.Hara,Miq.,Smilax sieboldii f. inermis (Nakai) H.Hara,Plantae,,,,Smilacaceae,Smilax,Japan,Japan,,Tosayama-mura,,Kouchi Pref.,Eastern Asia,Japan,,,,,,,,,,,,http://data.gbif.org/occurrences/150149304,http://data.gbif.org/ws/rest/occurrence/get?key=150149304
"National Museum of Nature and Science, Japan",Plant Specimens of Kurashiki Museum of Natural History,,,,,,,KURA,KURA,kt155403,Specimen,,18:47.0,,,Smilax sieboldii Miq. f. inermis Hara,Miq.,Smilax sieboldii f. inermis Hara,Plantae,,,Liliiflorae,Liliaceae,Smilax,Japan,Japan,,Mitsu-cho,,Okayama,Eastern Asia,Japan,,,,,,,,,,,,http://data.gbif.org/occurrences/204293401,http://data.gbif.org/ws/rest/occurrence/get?key=204293401
"National Museum of Nature and Science, Japan",Plant Specimens of Kurashiki Museum of Natural History,,,,,,,KURA,KURA,kt130867,Specimen,,18:46.0,,,Smilax sieboldii Miq. f. inermis Hara,Miq.,Smilax sieboldii f. inermis Hara,Plantae,,,Liliiflorae,Liliaceae,Smilax,Japan,Japan,,Takahashi-shi,,Okayama,Eastern Asia,Japan,,,,,,,,,,,,http://data.gbif.org/occurrences/204292986,http://data.gbif.org/ws/rest/occurrence/get?key=204292986
"National Museum of Nature and Science, Japan",Plant Specimens of Kurashiki Museum of Natural History,,,,,,,KURA,KURA,22541,Specimen,,18:47.0,,,Smilax sieboldii Miq. f. inermis Hara,Miq.,Smilax sieboldii f. inermis Hara,Plantae,,,Liliiflorae,Liliaceae,Smilax,Japan,Japan,,Tomi-son,,Okayama,Eastern Asia,Japan,,,,,,,,,,,,http://data.gbif.org/occurrences/395803614,http://data.gbif.org/ws/rest/occurrence/get?key=395803614
"National Museum of Nature and Science, Japan",Plant Specimens of Kurashiki Museum of Natural History,,,,,,,KURA,KURA,kt158650,Specimen,,18:47.0,,,Smilax sieboldii Miq. f. inermis Hara,Miq.,Smilax sieboldii f. inermis Hara,Plantae,,,Liliiflorae,Liliaceae,Smilax,Japan,Japan,,Yoshii-cho,,Okayama,Eastern Asia,Japan,,,,,,,,,,,,http://data.gbif.org/occurrences/204293350,http://data.gbif.org/ws/rest/occurrence/get?key=204293350
"National Museum of Nature and Science, Japan",Plant Specimens of Kurashiki Museum of Natural History,,,,,,,KURA,KURA,kt21395,Specimen,,18:46.0,,,Smilax sieboldii Miq. f. inermis Hara,Miq.,Smilax sieboldii f. inermis Hara,Plantae,,,Liliiflorae,Liliaceae,Smilax,Japan,Japan,,Takahashi-shi,,Okayama,Eastern Asia,Japan,,,,,,,,,,,,http://data.gbif.org/occurrences/204292970,http://data.gbif.org/ws/rest/occurrence/get?key=204292970
"National Museum of Nature and Science, Japan",Plant Specimens of Kurashiki Museum of Natural History,,,,,,,KURA,KURA,83624,Specimen,,18:48.0,,,Smilax sieboldii Miq. f. inermis Hara,Miq.,Smilax sieboldii f. inermis Hara,Plantae,,,Liliiflorae,Liliaceae,Smilax,Japan,Japan,,Kumenan-cho,,Okayama,Eastern Asia,Japan,,,,,,,,,,,,http://data.gbif.org/occurrences/395803727,http://data.gbif.org/ws/rest/occurrence/get?key=395803727
"National Museum of Nature and Science, Japan",Plant Specimens of Kurashiki Museum of Natural History,,,,,,,KURA,KURA,162453,Specimen,,18:49.0,,,Smilax sieboldii Miq. f. inermis Hara,Miq.,Smilax sieboldii f. inermis Hara,Plantae,,,Liliiflorae,Liliaceae,Smilax,Japan,Japan,,Kumenan-cho,,Okayama,Eastern Asia,Japan,,,,,,,,,,,,http://data.gbif.org/occurrences/395803951,http://data.gbif.org/ws/rest/occurrence/get?key=395803951
"National Museum of Nature and Science, Japan",Plant Specimens of Kurashiki Museum of Natural History,,,,,,,KURA,KURA,22542,Specimen,,18:47.0,,,Smilax sieboldii Miq. f. inermis Hara,Miq.,Smilax sieboldii f. inermis Hara,Plantae,,,Liliiflorae,Liliaceae,Smilax,Japan,Japan,,Tomi-son,,Okayama,Eastern Asia,Japan,,,,,,,,,,,,http://data.gbif.org/occurrences/395803615,http://data.gbif.org/ws/rest/occurrence/get?key=395803615
"National Museum of Nature and Science, Japan",Plant Specimens of Kurashiki Museum of Natural History,,,,,,,KURA,KURA,kt123629,Specimen,,18:46.0,,,Smilax sieboldii Miq. f. inermis Hara,Miq.,Smilax sieboldii f. inermis Hara,Plantae,,,Liliiflorae,Liliaceae,Smilax,Japan,Japan,,Tamano-shi,,Okayama,Eastern Asia,Japan,,,,,,,,,,,,http://data.gbif.org/occurrences/204292941,http://data.gbif.org/ws/rest/occurrence/get?key=204292941
"National Museum of Nature and Science, Japan",Plant Specimens of Kurashiki Museum of Natural History,,,,,,,KURA,KURA,kt14983,Specimen,,18:46.0,,,Smilax sieboldii Miq. f. inermis Hara,Miq.,Smilax sieboldii f. inermis Hara,Plantae,,,Liliiflorae,Liliaceae,Smilax,Japan,Japan,,Nariwa-cho,,Okayama,Eastern Asia,Japan,,,,,,,,,,,,http://data.gbif.org/occurrences/204293163,http://data.gbif.org/ws/rest/occurrence/get?key=204293163
