Data Publisher,Dataset,Dataset Rights,Collector name,Collector number,Field number,GUID,Date collected,Institution code,Collection code,Catalogue number,Basis of record,Image url,Last indexed,Identifier,Identification date,Scientific name,Author,Scientific name (interpreted),Kingdom,Phylum,Class,Order,Family,Genus,Country,Country (interpreted),Locality,County,Continent or Ocean,State/Province,Region,Publisher country,Latitude,Longitude,Coordinate precision,Cell id,Centi cell id,Min depth,Max depth,Max depth,Min altitude,Max altitude,Altitude precision,GBIF portal url,GBIF webservice url
"National Museum of Nature and Science, Japan",Kochi Prefectural Makino Botanical Garden,,,,,,,MBK,MBK,0001885-B,Specimen,,04:28.0,,,Prunus x sakabae Makino,Makino,Prunus �~sakabae Makino,Plantae,,,,Rosaceae,Prunus,Japan,Japan,Oizumi,Nerima-ku,,Tokyo,Eastern Asia,Japan,,,,,,,,,,,,http://data.gbif.org/occurrences/354282818,http://data.gbif.org/ws/rest/occurrence/get?key=354282818
"National Museum of Nature and Science, Japan",Kochi Prefectural Makino Botanical Garden,,,,,,,MBK,MBK,0001864-B,Specimen,,04:28.0,,,Prunus x sakabae Makino,Makino,Prunus �~sakabae Makino,Plantae,,,,Rosaceae,Prunus,Japan,Japan,Oizumi,Nerima-ku,,Tokyo,Eastern Asia,Japan,,,,,,,,,,,,http://data.gbif.org/occurrences/354282823,http://data.gbif.org/ws/rest/occurrence/get?key=354282823
"National Museum of Nature and Science, Japan",Kochi Prefectural Makino Botanical Garden,,,,,,,MBK,MBK,451,Specimen,,12:50.0,,,Prunus x sakabae Makino,Makino,Prunus �~sakabae Makino,Plantae,,,,Rosaceae,Prunus,Japan,Japan,Oizumi,Nerima-ku,,Tokyo,Eastern Asia,Japan,35.7663,139.592,,45319,75,,,,,,,http://data.gbif.org/occurrences/287509490,http://data.gbif.org/ws/rest/occurrence/get?key=287509490
"National Museum of Nature and Science, Japan",Kochi Prefectural Makino Botanical Garden,,,,,,,MBK,MBK,458,Specimen,,12:50.0,,,Prunus x sakabae Makino,Makino,Prunus �~sakabae Makino,Plantae,,,,Rosaceae,Prunus,Japan,Japan,Oizumi,Nerima-ku,,Tokyo,Eastern Asia,Japan,35.7663,139.592,,45319,75,,,,,,,http://data.gbif.org/occurrences/287509505,http://data.gbif.org/ws/rest/occurrence/get?key=287509505
"National Museum of Nature and Science, Japan",Kochi Prefectural Makino Botanical Garden,,,,,,,MBK,MBK,3116,Specimen,,12:54.0,,,Prunus x sakabae Makino,Makino,Prunus �~sakabae Makino,Plantae,,,,Rosaceae,Prunus,Japan,Japan,Oizumi,Nerima-ku,,Tokyo,Eastern Asia,Japan,35.7663,139.592,,45319,75,,,,,,,http://data.gbif.org/occurrences/287509717,http://data.gbif.org/ws/rest/occurrence/get?key=287509717
"National Museum of Nature and Science, Japan",Kochi Prefectural Makino Botanical Garden,,,,,,,MBK,MBK,0001860-A,Specimen,,04:28.0,,,Prunus x sakabae Makino,Makino,Prunus �~sakabae Makino,Plantae,,,,Rosaceae,Prunus,Japan,Japan,Oizumi,Nerima-ku,,Tokyo,Eastern Asia,Japan,,,,,,,,,,,,http://data.gbif.org/occurrences/354282830,http://data.gbif.org/ws/rest/occurrence/get?key=354282830
"National Museum of Nature and Science, Japan",Kochi Prefectural Makino Botanical Garden,,,,,,,MBK,MBK,454,Specimen,,12:50.0,,,Prunus x sakabae Makino,Makino,Prunus �~sakabae Makino,Plantae,,,,Rosaceae,Prunus,Japan,Japan,Oizumi,Nerima-ku,,Tokyo,Eastern Asia,Japan,35.7663,139.592,,45319,75,,,,,,,http://data.gbif.org/occurrences/287509498,http://data.gbif.org/ws/rest/occurrence/get?key=287509498
"National Museum of Nature and Science, Japan",Kochi Prefectural Makino Botanical Garden,,,,,,,MBK,MBK,462,Specimen,,12:51.0,,,Prunus x sakabae Makino,Makino,Prunus �~sakabae Makino,Plantae,,,,Rosaceae,Prunus,Japan,Japan,Oizumi,Nerima-ku,,Tokyo,Eastern Asia,Japan,35.7663,139.592,,45319,75,,,,,,,http://data.gbif.org/occurrences/287509513,http://data.gbif.org/ws/rest/occurrence/get?key=287509513
"National Museum of Nature and Science, Japan",Kochi Prefectural Makino Botanical Garden,,,,,,,MBK,MBK,186647,Specimen,,04:28.0,,,Prunus x sakabae Makino,Makino,Prunus �~sakabae Makino,Plantae,,,,Rosaceae,Prunus,Japan,Japan,Oizumi,Nerima-ku,,Tokyo,Eastern Asia,Japan,,,,,,,,,,,,http://data.gbif.org/occurrences/354282942,http://data.gbif.org/ws/rest/occurrence/get?key=354282942
"National Museum of Nature and Science, Japan",Kochi Prefectural Makino Botanical Garden,,,,,,,MBK,MBK,460,Specimen,,12:50.0,,,Prunus x sakabae Makino,Makino,Prunus �~sakabae Makino,Plantae,,,,Rosaceae,Prunus,Japan,Japan,Oizumi,Nerima-ku,,Tokyo,Eastern Asia,Japan,35.7663,139.592,,45319,75,,,,,,,http://data.gbif.org/occurrences/287509509,http://data.gbif.org/ws/rest/occurrence/get?key=287509509
"National Museum of Nature and Science, Japan",Kochi Prefectural Makino Botanical Garden,,,,,,,MBK,MBK,3118,Specimen,,12:54.0,,,Prunus x sakabae Makino,Makino,Prunus �~sakabae Makino,Plantae,,,,Rosaceae,Prunus,Japan,Japan,Oizumi,Nerima-ku,,Tokyo,Eastern Asia,Japan,35.7663,139.592,,45319,75,,,,,,,http://data.gbif.org/occurrences/287509720,http://data.gbif.org/ws/rest/occurrence/get?key=287509720
"National Museum of Nature and Science, Japan",Kochi Prefectural Makino Botanical Garden,,,,,,,MBK,MBK,453,Specimen,,12:50.0,,,Prunus x sakabae Makino,Makino,Prunus �~sakabae Makino,Plantae,,,,Rosaceae,Prunus,Japan,Japan,Oizumi,Nerima-ku,,Tokyo,Eastern Asia,Japan,35.7663,139.592,,45319,75,,,,,,,http://data.gbif.org/occurrences/287509495,http://data.gbif.org/ws/rest/occurrence/get?key=287509495
"National Museum of Nature and Science, Japan",Kochi Prefectural Makino Botanical Garden,,,,,,,MBK,MBK,449,Specimen,,12:50.0,,,Prunus x sakabae Makino,Makino,Prunus �~sakabae Makino,Plantae,,,,Rosaceae,Prunus,Japan,Japan,Oizumi,Nerima-ku,,Tokyo,Eastern Asia,Japan,35.7663,139.592,,45319,75,,,,,,,http://data.gbif.org/occurrences/287509486,http://data.gbif.org/ws/rest/occurrence/get?key=287509486
"National Museum of Nature and Science, Japan",Kochi Prefectural Makino Botanical Garden,,,,,,,MBK,MBK,1890,Specimen,,04:28.0,,,Prunus x sakabae Makino,Makino,Prunus �~sakabae Makino,Plantae,,,,Rosaceae,Prunus,Japan,Japan,Oizumi,Nerima-ku,,Tokyo,Eastern Asia,Japan,,,,,,,,,,,,http://data.gbif.org/occurrences/354282827,http://data.gbif.org/ws/rest/occurrence/get?key=354282827
"National Museum of Nature and Science, Japan",Kochi Prefectural Makino Botanical Garden,,,,,,,MBK,MBK,3125,Specimen,,12:54.0,,,Prunus x sakabae Makino,Makino,Prunus �~sakabae Makino,Plantae,,,,Rosaceae,Prunus,Japan,Japan,Oizumi,Nerima-ku,,Tokyo,Eastern Asia,Japan,35.7663,139.592,,45319,75,,,,,,,http://data.gbif.org/occurrences/287509736,http://data.gbif.org/ws/rest/occurrence/get?key=287509736
"National Museum of Nature and Science, Japan",Kochi Prefectural Makino Botanical Garden,,,,,,,MBK,MBK,450,Specimen,,12:50.0,,,Prunus x sakabae Makino,Makino,Prunus �~sakabae Makino,Plantae,,,,Rosaceae,Prunus,Japan,Japan,Oizumi,Nerima-ku,,Tokyo,Eastern Asia,Japan,35.7663,139.592,,45319,75,,,,,,,http://data.gbif.org/occurrences/287509488,http://data.gbif.org/ws/rest/occurrence/get?key=287509488
"National Museum of Nature and Science, Japan",Kochi Prefectural Makino Botanical Garden,,,,,,,MBK,MBK,186880,Specimen,,04:28.0,,,Prunus x sakabae Makino,Makino,Prunus �~sakabae Makino,Plantae,,,,Rosaceae,Prunus,Japan,Japan,Oizumi,Nerima-ku,,Tokyo,Eastern Asia,Japan,,,,,,,,,,,,http://data.gbif.org/occurrences/354282934,http://data.gbif.org/ws/rest/occurrence/get?key=354282934
"National Museum of Nature and Science, Japan",Kochi Prefectural Makino Botanical Garden,,,,,,,MBK,MBK,3114,Specimen,,12:54.0,,,Prunus x sakabae Makino,Makino,Prunus �~sakabae Makino,Plantae,,,,Rosaceae,Prunus,Japan,Japan,Oizumi,Nerima-ku,,Tokyo,Eastern Asia,Japan,35.7663,139.592,,45319,75,,,,,,,http://data.gbif.org/occurrences/287509713,http://data.gbif.org/ws/rest/occurrence/get?key=287509713
"National Museum of Nature and Science, Japan",Kochi Prefectural Makino Botanical Garden,,,,,,,MBK,MBK,3120,Specimen,,12:54.0,,,Prunus x sakabae Makino,Makino,Prunus �~sakabae Makino,Plantae,,,,Rosaceae,Prunus,Japan,Japan,Oizumi,Nerima-ku,,Tokyo,Eastern Asia,Japan,35.7663,139.592,,45319,75,,,,,,,http://data.gbif.org/occurrences/287509725,http://data.gbif.org/ws/rest/occurrence/get?key=287509725
"National Museum of Nature and Science, Japan",Kochi Prefectural Makino Botanical Garden,,,,,,,MBK,MBK,3117,Specimen,,12:54.0,,,Prunus x sakabae Makino,Makino,Prunus �~sakabae Makino,Plantae,,,,Rosaceae,Prunus,Japan,Japan,Oizumi,Nerima-ku,,Tokyo,Eastern Asia,Japan,35.7663,139.592,,45319,75,,,,,,,http://data.gbif.org/occurrences/287509718,http://data.gbif.org/ws/rest/occurrence/get?key=287509718
"National Museum of Nature and Science, Japan",Kochi Prefectural Makino Botanical Garden,,,,,,,MBK,MBK,186814,Specimen,,04:28.0,,,Prunus x sakabae Makino,Makino,Prunus �~sakabae Makino,Plantae,,,,Rosaceae,Prunus,Japan,Japan,Oizumi,Nerima-ku,,Tokyo,Eastern Asia,Japan,,,,,,,,,,,,http://data.gbif.org/occurrences/354282932,http://data.gbif.org/ws/rest/occurrence/get?key=354282932
"National Museum of Nature and Science, Japan",Kochi Prefectural Makino Botanical Garden,,,,,,,MBK,MBK,455,Specimen,,12:50.0,,,Prunus x sakabae Makino,Makino,Prunus �~sakabae Makino,Plantae,,,,Rosaceae,Prunus,Japan,Japan,Oizumi,Nerima-ku,,Tokyo,Eastern Asia,Japan,35.7663,139.592,,45319,75,,,,,,,http://data.gbif.org/occurrences/287509500,http://data.gbif.org/ws/rest/occurrence/get?key=287509500
"National Museum of Nature and Science, Japan",Kochi Prefectural Makino Botanical Garden,,,,,,,MBK,MBK,463,Specimen,,12:51.0,,,Prunus x sakabae Makino,Makino,Prunus �~sakabae Makino,Plantae,,,,Rosaceae,Prunus,Japan,Japan,Oizumi,Nerima-ku,,Tokyo,Eastern Asia,Japan,35.7663,139.592,,45319,75,,,,,,,http://data.gbif.org/occurrences/287509515,http://data.gbif.org/ws/rest/occurrence/get?key=287509515
"National Museum of Nature and Science, Japan",Kochi Prefectural Makino Botanical Garden,,,,,,,MBK,MBK,0001881-B,Specimen,,04:28.0,,,Prunus x sakabae Makino,Makino,Prunus �~sakabae Makino,Plantae,,,,Rosaceae,Prunus,Japan,Japan,Oizumi,Nerima-ku,,Tokyo,Eastern Asia,Japan,,,,,,,,,,,,http://data.gbif.org/occurrences/354282815,http://data.gbif.org/ws/rest/occurrence/get?key=354282815
"National Museum of Nature and Science, Japan",Kochi Prefectural Makino Botanical Garden,,,,,,,MBK,MBK,186645,Specimen,,04:29.0,,,Prunus x sakabae Makino,Makino,Prunus �~sakabae Makino,Plantae,,,,Rosaceae,Prunus,Japan,Japan,Oizumi,Nerima-ku,,Tokyo,Eastern Asia,Japan,,,,,,,,,,,,http://data.gbif.org/occurrences/354282943,http://data.gbif.org/ws/rest/occurrence/get?key=354282943
"National Museum of Nature and Science, Japan",Kochi Prefectural Makino Botanical Garden,,,,,,,MBK,MBK,0001888-A,Specimen,,04:28.0,,,Prunus x sakabae Makino,Makino,Prunus �~sakabae Makino,Plantae,,,,Rosaceae,Prunus,Japan,Japan,Oizumi,Nerima-ku,,Tokyo,Eastern Asia,Japan,,,,,,,,,,,,http://data.gbif.org/occurrences/354282828,http://data.gbif.org/ws/rest/occurrence/get?key=354282828
"National Museum of Nature and Science, Japan",Kochi Prefectural Makino Botanical Garden,,,,,,,MBK,MBK,3121,Specimen,,12:54.0,,,Prunus x sakabae Makino,Makino,Prunus �~sakabae Makino,Plantae,,,,Rosaceae,Prunus,Japan,Japan,Oizumi,Nerima-ku,,Tokyo,Eastern Asia,Japan,35.7663,139.592,,45319,75,,,,,,,http://data.gbif.org/occurrences/287509728,http://data.gbif.org/ws/rest/occurrence/get?key=287509728
"National Museum of Nature and Science, Japan",Kochi Prefectural Makino Botanical Garden,,,,,,,MBK,MBK,186879,Specimen,,04:28.0,,,Prunus x sakabae Makino,Makino,Prunus �~sakabae Makino,Plantae,,,,Rosaceae,Prunus,Japan,Japan,Oizumi,Nerima-ku,,Tokyo,Eastern Asia,Japan,,,,,,,,,,,,http://data.gbif.org/occurrences/354282935,http://data.gbif.org/ws/rest/occurrence/get?key=354282935
"National Museum of Nature and Science, Japan",Kochi Prefectural Makino Botanical Garden,,,,,,,MBK,MBK,3115,Specimen,,12:54.0,,,Prunus x sakabae Makino,Makino,Prunus �~sakabae Makino,Plantae,,,,Rosaceae,Prunus,Japan,Japan,Oizumi,Nerima-ku,,Tokyo,Eastern Asia,Japan,35.7663,139.592,,45319,75,,,,,,,http://data.gbif.org/occurrences/287509715,http://data.gbif.org/ws/rest/occurrence/get?key=287509715
"National Museum of Nature and Science, Japan",Kochi Prefectural Makino Botanical Garden,,,,,,,MBK,MBK,461,Specimen,,12:50.0,,,Prunus x sakabae Makino,Makino,Prunus �~sakabae Makino,Plantae,,,,Rosaceae,Prunus,Japan,Japan,Oizumi,Nerima-ku,,Tokyo,Eastern Asia,Japan,35.7663,139.592,,45319,75,,,,,,,http://data.gbif.org/occurrences/287509511,http://data.gbif.org/ws/rest/occurrence/get?key=287509511
"National Museum of Nature and Science, Japan",Kochi Prefectural Makino Botanical Garden,,,,,,,MBK,MBK,186799,Specimen,,04:28.0,,,Prunus x sakabae Makino,Makino,Prunus �~sakabae Makino,Plantae,,,,Rosaceae,Prunus,Japan,Japan,Oizumi,Nerima-ku,,Tokyo,Eastern Asia,Japan,,,,,,,,,,,,http://data.gbif.org/occurrences/354282940,http://data.gbif.org/ws/rest/occurrence/get?key=354282940
"National Museum of Nature and Science, Japan",Kochi Prefectural Makino Botanical Garden,,,,,,,MBK,MBK,1861,Specimen,,04:28.0,,,Prunus x sakabae Makino,Makino,Prunus �~sakabae Makino,Plantae,,,,Rosaceae,Prunus,Japan,Japan,Oizumi,Nerima-ku,,Tokyo,Eastern Asia,Japan,,,,,,,,,,,,http://data.gbif.org/occurrences/354282833,http://data.gbif.org/ws/rest/occurrence/get?key=354282833
"National Museum of Nature and Science, Japan",Kochi Prefectural Makino Botanical Garden,,,,,,,MBK,MBK,1889,Specimen,,04:28.0,,,Prunus x sakabae Makino,Makino,Prunus �~sakabae Makino,Plantae,,,,Rosaceae,Prunus,Japan,Japan,Oizumi,Nerima-ku,,Tokyo,Eastern Asia,Japan,,,,,,,,,,,,http://data.gbif.org/occurrences/354282826,http://data.gbif.org/ws/rest/occurrence/get?key=354282826
"National Museum of Nature and Science, Japan",Kochi Prefectural Makino Botanical Garden,,,,,,,MBK,MBK,186800,Specimen,,04:28.0,,,Prunus x sakabae Makino,Makino,Prunus �~sakabae Makino,Plantae,,,,Rosaceae,Prunus,Japan,Japan,Oizumi,Nerima-ku,,Tokyo,Eastern Asia,Japan,,,,,,,,,,,,http://data.gbif.org/occurrences/354282939,http://data.gbif.org/ws/rest/occurrence/get?key=354282939
"National Museum of Nature and Science, Japan",Kochi Prefectural Makino Botanical Garden,,,,,,,MBK,MBK,0001885-A,Specimen,,04:28.0,,,Prunus x sakabae Makino,Makino,Prunus �~sakabae Makino,Plantae,,,,Rosaceae,Prunus,Japan,Japan,Oizumi,Nerima-ku,,Tokyo,Eastern Asia,Japan,,,,,,,,,,,,http://data.gbif.org/occurrences/354282816,http://data.gbif.org/ws/rest/occurrence/get?key=354282816
"National Museum of Nature and Science, Japan",Kochi Prefectural Makino Botanical Garden,,,,,,,MBK,MBK,186646,Specimen,,04:29.0,,,Prunus x sakabae Makino,Makino,Prunus �~sakabae Makino,Plantae,,,,Rosaceae,Prunus,Japan,Japan,Oizumi,Nerima-ku,,Tokyo,Eastern Asia,Japan,,,,,,,,,,,,http://data.gbif.org/occurrences/354282944,http://data.gbif.org/ws/rest/occurrence/get?key=354282944
"National Museum of Nature and Science, Japan",Kochi Prefectural Makino Botanical Garden,,,,,,,MBK,MBK,186801,Specimen,,04:28.0,,,Prunus x sakabae Makino,Makino,Prunus �~sakabae Makino,Plantae,,,,Rosaceae,Prunus,Japan,Japan,Oizumi,Nerima-ku,,Tokyo,Eastern Asia,Japan,,,,,,,,,,,,http://data.gbif.org/occurrences/354282937,http://data.gbif.org/ws/rest/occurrence/get?key=354282937
"National Museum of Nature and Science, Japan",Kochi Prefectural Makino Botanical Garden,,,,,,,MBK,MBK,0001860-B,Specimen,,04:28.0,,,Prunus x sakabae Makino,Makino,Prunus �~sakabae Makino,Plantae,,,,Rosaceae,Prunus,Japan,Japan,Oizumi,Nerima-ku,,Tokyo,Eastern Asia,Japan,,,,,,,,,,,,http://data.gbif.org/occurrences/354282831,http://data.gbif.org/ws/rest/occurrence/get?key=354282831
"National Museum of Nature and Science, Japan",Kochi Prefectural Makino Botanical Garden,,,,,,,MBK,MBK,459,Specimen,,12:50.0,,,Prunus x sakabae Makino,Makino,Prunus �~sakabae Makino,Plantae,,,,Rosaceae,Prunus,Japan,Japan,Oizumi,Nerima-ku,,Tokyo,Eastern Asia,Japan,35.7663,139.592,,45319,75,,,,,,,http://data.gbif.org/occurrences/287509507,http://data.gbif.org/ws/rest/occurrence/get?key=287509507
"National Museum of Nature and Science, Japan",Kochi Prefectural Makino Botanical Garden,,,,,,,MBK,MBK,1884,Specimen,,04:28.0,,,Prunus x sakabae Makino,Makino,Prunus �~sakabae Makino,Plantae,,,,Rosaceae,Prunus,Japan,Japan,Oizumi,Nerima-ku,,Tokyo,Eastern Asia,Japan,,,,,,,,,,,,http://data.gbif.org/occurrences/354282820,http://data.gbif.org/ws/rest/occurrence/get?key=354282820
"National Museum of Nature and Science, Japan",Kochi Prefectural Makino Botanical Garden,,,,,,,MBK,MBK,3126,Specimen,,12:54.0,,,Prunus x sakabae Makino,Makino,Prunus �~sakabae Makino,Plantae,,,,Rosaceae,Prunus,Japan,Japan,Oizumi,Nerima-ku,,Tokyo,Eastern Asia,Japan,35.7663,139.592,,45319,75,,,,,,,http://data.gbif.org/occurrences/287509737,http://data.gbif.org/ws/rest/occurrence/get?key=287509737
"National Museum of Nature and Science, Japan",Kochi Prefectural Makino Botanical Garden,,,,,,,MBK,MBK,464,Specimen,,12:51.0,,,Prunus x sakabae Makino,Makino,Prunus �~sakabae Makino,Plantae,,,,Rosaceae,Prunus,Japan,Japan,Oizumi,Nerima-ku,,Tokyo,Eastern Asia,Japan,35.7663,139.592,,45319,75,,,,,,,http://data.gbif.org/occurrences/287509517,http://data.gbif.org/ws/rest/occurrence/get?key=287509517
"National Museum of Nature and Science, Japan",Kochi Prefectural Makino Botanical Garden,,,,,,,MBK,MBK,186802,Specimen,,04:28.0,,,Prunus x sakabae Makino,Makino,Prunus �~sakabae Makino,Plantae,,,,Rosaceae,Prunus,Japan,Japan,Oizumi,Nerima-ku,,Tokyo,Eastern Asia,Japan,,,,,,,,,,,,http://data.gbif.org/occurrences/354282938,http://data.gbif.org/ws/rest/occurrence/get?key=354282938
"National Museum of Nature and Science, Japan",Kochi Prefectural Makino Botanical Garden,,,,,,,MBK,MBK,3119,Specimen,,12:54.0,,,Prunus x sakabae Makino,Makino,Prunus �~sakabae Makino,Plantae,,,,Rosaceae,Prunus,Japan,Japan,Oizumi,Nerima-ku,,Tokyo,Eastern Asia,Japan,35.7663,139.592,,45319,75,,,,,,,http://data.gbif.org/occurrences/287509722,http://data.gbif.org/ws/rest/occurrence/get?key=287509722
"National Museum of Nature and Science, Japan",Kochi Prefectural Makino Botanical Garden,,,,,,,MBK,MBK,3123,Specimen,,12:54.0,,,Prunus x sakabae Makino,Makino,Prunus �~sakabae Makino,Plantae,,,,Rosaceae,Prunus,Japan,Japan,Oizumi,Nerima-ku,,Tokyo,Eastern Asia,Japan,35.7663,139.592,,45319,75,,,,,,,http://data.gbif.org/occurrences/287509732,http://data.gbif.org/ws/rest/occurrence/get?key=287509732
"National Museum of Nature and Science, Japan",Kochi Prefectural Makino Botanical Garden,,,,,,,MBK,MBK,0001881-A,Specimen,,04:28.0,,,Prunus x sakabae Makino,Makino,Prunus �~sakabae Makino,Plantae,,,,Rosaceae,Prunus,Japan,Japan,Oizumi,Nerima-ku,,Tokyo,Eastern Asia,Japan,,,,,,,,,,,,http://data.gbif.org/occurrences/354282813,http://data.gbif.org/ws/rest/occurrence/get?key=354282813
"National Museum of Nature and Science, Japan",Kochi Prefectural Makino Botanical Garden,,,,,,,MBK,MBK,186648,Specimen,,04:28.0,,,Prunus x sakabae Makino,Makino,Prunus �~sakabae Makino,Plantae,,,,Rosaceae,Prunus,Japan,Japan,Oizumi,Nerima-ku,,Tokyo,Eastern Asia,Japan,,,,,,,,,,,,http://data.gbif.org/occurrences/354282941,http://data.gbif.org/ws/rest/occurrence/get?key=354282941
"National Museum of Nature and Science, Japan",Kochi Prefectural Makino Botanical Garden,,,,,,,MBK,MBK,186878,Specimen,,04:28.0,,,Prunus x sakabae Makino,Makino,Prunus �~sakabae Makino,Plantae,,,,Rosaceae,Prunus,Japan,Japan,Oizumi,Nerima-ku,,Tokyo,Eastern Asia,Japan,,,,,,,,,,,,http://data.gbif.org/occurrences/354282936,http://data.gbif.org/ws/rest/occurrence/get?key=354282936
"National Museum of Nature and Science, Japan",Kochi Prefectural Makino Botanical Garden,,,,,,,MBK,MBK,3122,Specimen,,12:54.0,,,Prunus x sakabae Makino,Makino,Prunus �~sakabae Makino,Plantae,,,,Rosaceae,Prunus,Japan,Japan,Oizumi,Nerima-ku,,Tokyo,Eastern Asia,Japan,35.7663,139.592,,45319,75,,,,,,,http://data.gbif.org/occurrences/287509730,http://data.gbif.org/ws/rest/occurrence/get?key=287509730
"National Museum of Nature and Science, Japan",Kochi Prefectural Makino Botanical Garden,,,,,,,MBK,MBK,1859,Specimen,,04:28.0,,,Prunus x sakabae Makino,Makino,Prunus �~sakabae Makino,Plantae,,,,Rosaceae,Prunus,Japan,Japan,Oizumi,Nerima-ku,,Tokyo,Eastern Asia,Japan,,,,,,,,,,,,http://data.gbif.org/occurrences/354282832,http://data.gbif.org/ws/rest/occurrence/get?key=354282832
"National Museum of Nature and Science, Japan",Kochi Prefectural Makino Botanical Garden,,,,,,,MBK,MBK,186813,Specimen,,04:28.0,,,Prunus x sakabae Makino,Makino,Prunus �~sakabae Makino,Plantae,,,,Rosaceae,Prunus,Japan,Japan,Oizumi,Nerima-ku,,Tokyo,Eastern Asia,Japan,,,,,,,,,,,,http://data.gbif.org/occurrences/354282933,http://data.gbif.org/ws/rest/occurrence/get?key=354282933
"National Museum of Nature and Science, Japan",Kochi Prefectural Makino Botanical Garden,,,,,,,MBK,MBK,0001888-B,Specimen,,04:28.0,,,Prunus x sakabae Makino,Makino,Prunus �~sakabae Makino,Plantae,,,,Rosaceae,Prunus,Japan,Japan,Oizumi,Nerima-ku,,Tokyo,Eastern Asia,Japan,,,,,,,,,,,,http://data.gbif.org/occurrences/354282829,http://data.gbif.org/ws/rest/occurrence/get?key=354282829
"National Museum of Nature and Science, Japan",Kochi Prefectural Makino Botanical Garden,,,,,,,MBK,MBK,1883,Specimen,,04:28.0,,,Prunus x sakabae Makino,Makino,Prunus �~sakabae Makino,Plantae,,,,Rosaceae,Prunus,Japan,Japan,Oizumi,Nerima-ku,,Tokyo,Eastern Asia,Japan,,,,,,,,,,,,http://data.gbif.org/occurrences/354282825,http://data.gbif.org/ws/rest/occurrence/get?key=354282825
"National Museum of Nature and Science, Japan",Kochi Prefectural Makino Botanical Garden,,,,,,,MBK,MBK,452,Specimen,,12:50.0,,,Prunus x sakabae Makino,Makino,Prunus �~sakabae Makino,Plantae,,,,Rosaceae,Prunus,Japan,Japan,Oizumi,Nerima-ku,,Tokyo,Eastern Asia,Japan,35.7663,139.592,,45319,75,,,,,,,http://data.gbif.org/occurrences/287509493,http://data.gbif.org/ws/rest/occurrence/get?key=287509493
"National Museum of Nature and Science, Japan",Kochi Prefectural Makino Botanical Garden,,,,,,,MBK,MBK,0001864-A,Specimen,,04:28.0,,,Prunus x sakabae Makino,Makino,Prunus �~sakabae Makino,Plantae,,,,Rosaceae,Prunus,Japan,Japan,Oizumi,Nerima-ku,,Tokyo,Eastern Asia,Japan,,,,,,,,,,,,http://data.gbif.org/occurrences/354282821,http://data.gbif.org/ws/rest/occurrence/get?key=354282821
"National Museum of Nature and Science, Japan",Kochi Prefectural Makino Botanical Garden,,,,,,,MBK,MBK,3124,Specimen,,12:54.0,,,Prunus x sakabae Makino,Makino,Prunus �~sakabae Makino,Plantae,,,,Rosaceae,Prunus,Japan,Japan,Oizumi,Nerima-ku,,Tokyo,Eastern Asia,Japan,35.7663,139.592,,45319,75,,,,,,,http://data.gbif.org/occurrences/287509734,http://data.gbif.org/ws/rest/occurrence/get?key=287509734
