Data Publisher,Dataset,Dataset Rights,Collector name,Collector number,Field number,GUID,Date collected,Institution code,Collection code,Catalogue number,Basis of record,Image url,Last indexed,Identifier,Identification date,Scientific name,Author,Scientific name (interpreted),Kingdom,Phylum,Class,Order,Family,Genus,Country,Country (interpreted),Locality,County,Continent or Ocean,State/Province,Region,Publisher country,Latitude,Longitude,Coordinate precision,Cell id,Centi cell id,Min depth,Max depth,Max depth,Min altitude,Max altitude,Altitude precision,GBIF portal url,GBIF webservice url
"National Museum of Nature and Science, Japan","Botanical specimens database of Mr. Jiro Ito collection, Shizuoka Prefecture Museum of Natural History",,,,,,,SPMN,a,SPMN-a-2729,Specimen,,37:44.0,,,Geranium onoei Franch. et Sav. var. onoei f. onoei,,Geranium onoei f. onoei,Plantae,Magnoliophyta,Magnoliopsida,Geraniales,Geraniaceae,Geranium,Japan,Japan,Tokusawa,Matumoto-shi,,Nagano,Eastern Asia,Japan,,,,,,,,,,,,http://data.gbif.org/occurrences/380183725,http://data.gbif.org/ws/rest/occurrence/get?key=380183725
"National Museum of Nature and Science, Japan","Gunma Museum of Natural History, Vascular Plant Specimen",,,,,,,GMNHJ,plant,BS0006946,Specimen,,34:57.0,,,Geranium eriostemon Fisch. ex DC var. reinii (Franch. et Sav.) Maxim.,Fisch. ex DC,Geranium eriostemon var. reinii (Franch. & Sav.) Maxim.,Plantae,Spermatophyta,Dicotyledoneae,,Geraniaceae,Geranium,Japan,Japan,"Yunomaru,Tashiro",Agatsuma-gun Tsumagoimura,,Gunma,Eastern Asia,Japan,,,,,,,,,1650,1650,,http://data.gbif.org/occurrences/394055977,http://data.gbif.org/ws/rest/occurrence/get?key=394055977
"National Museum of Nature and Science, Japan","Gunma Museum of Natural History, Vascular Plant Specimen",,,,,,,GMNHJ,Plant,BS0032355,Specimen,,34:55.0,,,Geranium eriostemon Fisch. ex DC. var. reinii (Franch. et Sav.) Maxim.,Fisch. ex DC.,Geranium eriostemon var. reinii (Franch. & Sav.) Maxim.,Plantae,Spermatophyta,Dicotyledoneae,,Geraniaceae,Geranium,Japan,Japan,"Shinkazawa Spa,Tashiro",Agatsuma-gun Tsumagoimura,,Gunma,Eastern Asia,Japan,36.4733,138.442,,45678,44,,,,,,,http://data.gbif.org/occurrences/234492753,http://data.gbif.org/ws/rest/occurrence/get?key=234492753
"National Museum of Nature and Science, Japan","Gunma Museum of Natural History, Vascular Plant Specimen",,,,,,,GMNHJ,Plant,BS0059877,Specimen,,34:54.0,,,Geranium eriostemon Fisch. ex DC. var. reinii (Franch. et Sav.) Maxim.,Fisch. ex DC.,Geranium eriostemon var. reinii (Franch. & Sav.) Maxim.,Plantae,Spermatophyta,Dicotyledoneae,,Geraniaceae,Geranium,Japan,Japan,"Mt. Sanpoga-mine,Mihari",Tomi-shi,,Nagano,Eastern Asia,Japan,36.4072,138.432,,45678,44,,,,,,,http://data.gbif.org/occurrences/234492657,http://data.gbif.org/ws/rest/occurrence/get?key=234492657
"National Museum of Nature and Science, Japan","Gunma Museum of Natural History, Vascular Plant Specimen",,,,,,,GMNHJ,plant,BS0034834,Specimen,,34:55.0,,,Geranium eriostemon Fisch. ex DC. var. reinii (Franch. et Sav.) Maxim.,Fisch. ex DC.,Geranium eriostemon var. reinii (Franch. & Sav.) Maxim.,Plantae,Spermatophyta,Dicotyledoneae,,Geraniaceae,Geranium,Japan,Japan,"Okushirane, Mt. Nikko-shirane,Higashi-ogawa",Tone-gun Katashinamura,,Gunma,Eastern Asia,Japan,36.7894,139.365,,45679,73,,,,,,,http://data.gbif.org/occurrences/295234634,http://data.gbif.org/ws/rest/occurrence/get?key=295234634
"National Museum of Nature and Science, Japan","Gunma Museum of Natural History, Vascular Plant Specimen",,,,,,,GMNHJ,plant,BS0034519,Specimen,,34:55.0,,,Geranium eriostemon Fisch. ex DC. var. reinii (Franch. et Sav.) Maxim.,Fisch. ex DC.,Geranium eriostemon var. reinii (Franch. & Sav.) Maxim.,Plantae,Spermatophyta,Dicotyledoneae,,Geraniaceae,Geranium,Japan,Japan,"Mt. Kurofu,Kanbara",Agatsuma-gun Tsumagoimura,,Gunma,Eastern Asia,Japan,36.4067,138.488,,45678,44,,,,,,,http://data.gbif.org/occurrences/295234628,http://data.gbif.org/ws/rest/occurrence/get?key=295234628
"National Museum of Nature and Science, Japan",Plant Specimens of Kurashiki Museum of Natural History,,,,,,,KURA,KURA,133641,Specimen,,14:58.0,,,Geranium eriostemon Fisch. ex DC. var. reinii (Franch. et Sav.) Maxim.,Fisch. ex DC.,Geranium eriostemon var. reinii (Franch. & Sav.) Maxim.,Plantae,,,,Geraniaceae,Geranium,Japan,Japan,,,,Nagano,Eastern Asia,Japan,,,,,,,,,,,,http://data.gbif.org/occurrences/43136673,http://data.gbif.org/ws/rest/occurrence/get?key=43136673
"National Museum of Nature and Science, Japan",Plant Specimens of Kurashiki Museum of Natural History,,,,,,,KURA,KURA,133648,Specimen,,14:58.0,,,Geranium eriostemon Fisch. ex DC. var. reinii (Franch. et Sav.) Maxim.,Fisch. ex DC.,Geranium eriostemon var. reinii (Franch. & Sav.) Maxim.,Plantae,,,,Geraniaceae,Geranium,Japan,Japan,,,,Tochigi,Eastern Asia,Japan,,,,,,,,,,,,http://data.gbif.org/occurrences/43136675,http://data.gbif.org/ws/rest/occurrence/get?key=43136675
"National Museum of Nature and Science, Japan",Plant Specimens of Kurashiki Museum of Natural History,,,,,,,KURA,KURA,133646,Specimen,,14:58.0,,,Geranium eriostemon Fisch. ex DC. var. reinii (Franch. et Sav.) Maxim.,Fisch. ex DC.,Geranium eriostemon var. reinii (Franch. & Sav.) Maxim.,Plantae,,,,Geraniaceae,Geranium,Japan,Japan,,,,Nagano,Eastern Asia,Japan,,,,,,,,,,,,http://data.gbif.org/occurrences/43136616,http://data.gbif.org/ws/rest/occurrence/get?key=43136616
"National Museum of Nature and Science, Japan",Plant Specimens of Kurashiki Museum of Natural History,,,,,,,KURA,KURA,133647,Specimen,,14:58.0,,,Geranium eriostemon Fisch. ex DC. var. reinii (Franch. et Sav.) Maxim.,Fisch. ex DC.,Geranium eriostemon var. reinii (Franch. & Sav.) Maxim.,Plantae,,,,Geraniaceae,Geranium,Japan,Japan,,,,Nagano,Eastern Asia,Japan,,,,,,,,,,,,http://data.gbif.org/occurrences/43136630,http://data.gbif.org/ws/rest/occurrence/get?key=43136630
"National Museum of Nature and Science, Japan",Plant Specimens of Kurashiki Museum of Natural History,,,,,,,KURA,KURA,133642,Specimen,,14:58.0,,,Geranium eriostemon Fisch. ex DC. var. reinii (Franch. et Sav.) Maxim.,Fisch. ex DC.,Geranium eriostemon var. reinii (Franch. & Sav.) Maxim.,Plantae,,,,Geraniaceae,Geranium,Japan,Japan,,,,Nagano,Eastern Asia,Japan,,,,,,,,,,,,http://data.gbif.org/occurrences/43136644,http://data.gbif.org/ws/rest/occurrence/get?key=43136644
"National Museum of Nature and Science, Japan",Plant Specimens of Kurashiki Museum of Natural History,,,,,,,KURA,KURA,133645,Specimen,,14:58.0,,,Geranium eriostemon Fisch. ex DC. var. reinii (Franch. et Sav.) Maxim.,Fisch. ex DC.,Geranium eriostemon var. reinii (Franch. & Sav.) Maxim.,Plantae,,,,Geraniaceae,Geranium,Japan,Japan,,,,Shiga,Eastern Asia,Japan,,,,,,,,,,,,http://data.gbif.org/occurrences/43136600,http://data.gbif.org/ws/rest/occurrence/get?key=43136600
"National Museum of Nature and Science, Japan",Plant Specimens of Kurashiki Museum of Natural History,,,,,,,KURA,KURA,133651,Specimen,,14:58.0,,,Geranium eriostemon Fisch. ex DC. var. reinii (Franch. et Sav.) Maxim.,Fisch. ex DC.,Geranium eriostemon var. reinii (Franch. & Sav.) Maxim.,Plantae,,,,Geraniaceae,Geranium,Japan,Japan,,,,Nagano,Eastern Asia,Japan,,,,,,,,,,,,http://data.gbif.org/occurrences/43136635,http://data.gbif.org/ws/rest/occurrence/get?key=43136635
"National Museum of Nature and Science, Japan",Plant Specimens of Kurashiki Museum of Natural History,,,,,,,KURA,KURA,133640,Specimen,,14:58.0,,,Geranium eriostemon Fisch. ex DC. var. reinii (Franch. et Sav.) Maxim.,Fisch. ex DC.,Geranium eriostemon var. reinii (Franch. & Sav.) Maxim.,Plantae,,,,Geraniaceae,Geranium,Japan,Japan,,,,Tochigi,Eastern Asia,Japan,,,,,,,,,,,,http://data.gbif.org/occurrences/43136683,http://data.gbif.org/ws/rest/occurrence/get?key=43136683
"National Museum of Nature and Science, Japan",Plant Specimens of Kurashiki Museum of Natural History,,,,,,,KURA,KURA,133643,Specimen,,14:58.0,,,Geranium eriostemon Fisch. ex DC. var. reinii (Franch. et Sav.) Maxim.,Fisch. ex DC.,Geranium eriostemon var. reinii (Franch. & Sav.) Maxim.,Plantae,,,,Geraniaceae,Geranium,Japan,Japan,,,,Nagano,Eastern Asia,Japan,,,,,,,,,,,,http://data.gbif.org/occurrences/43136651,http://data.gbif.org/ws/rest/occurrence/get?key=43136651
"National Museum of Nature and Science, Japan",Plant Specimens of Kurashiki Museum of Natural History,,,,,,,KURA,KURA,133649,Specimen,,14:58.0,,,Geranium eriostemon Fisch. ex DC. var. reinii (Franch. et Sav.) Maxim.,Fisch. ex DC.,Geranium eriostemon var. reinii (Franch. & Sav.) Maxim.,Plantae,,,,Geraniaceae,Geranium,Japan,Japan,,,,Nagano,Eastern Asia,Japan,,,,,,,,,,,,http://data.gbif.org/occurrences/43136667,http://data.gbif.org/ws/rest/occurrence/get?key=43136667
"National Museum of Nature and Science, Japan",Plant Specimens of Kurashiki Museum of Natural History,,,,,,,KURA,KURA,133644,Specimen,,14:58.0,,,Geranium eriostemon Fisch. ex DC. var. reinii (Franch. et Sav.) Maxim.,Fisch. ex DC.,Geranium eriostemon var. reinii (Franch. & Sav.) Maxim.,Plantae,,,,Geraniaceae,Geranium,Japan,Japan,,,,Nagano,Eastern Asia,Japan,,,,,,,,,,,,http://data.gbif.org/occurrences/43136610,http://data.gbif.org/ws/rest/occurrence/get?key=43136610
"National Museum of Nature and Science, Japan","Plant specimens depodited in Osaka Museum of Natural History, Japan.",,,,,,,OSA,C,OSA40979,Specimen,,19:42.0,,,Geranium eriostemon Fisch. var. reinii (F. et S.) Maxim.,Fisch.,Geranium eriostemon var. reinii (F. & S.) Maxim.,Plantae,,,,Geraniaceae,Geranium,Japan,Japan,Kiri-ga-mine Highland,,,Nagano Prefecture,Eastern Asia,Japan,,,,,,,,,,,,http://data.gbif.org/occurrences/295136950,http://data.gbif.org/ws/rest/occurrence/get?key=295136950
"National Museum of Nature and Science, Japan","Plant specimens depodited in Osaka Museum of Natural History, Japan.",,,,,,,OSA,C,OSA22005,Specimen,,19:41.0,,,Geranium eriostemon Fisch. var. reinii (F. et S.) Maxim.,Fisch.,Geranium eriostemon var. reinii (F. & S.) Maxim.,Plantae,,,,Geraniaceae,Geranium,Japan,Japan,Mt. Ibuki-san,,,Shiga Prefecture,Eastern Asia,Japan,,,,,,,,,,,,http://data.gbif.org/occurrences/295136777,http://data.gbif.org/ws/rest/occurrence/get?key=295136777
"National Museum of Nature and Science, Japan","Plant specimens depodited in Osaka Museum of Natural History, Japan.",,,,,,,OSA,C,OSA71496,Specimen,,19:44.0,,,Geranium eriostemon Fisch. var. reinii (F. et S.) Maxim.,,Geranium eriostemon var. reinii (F. & S.) Maxim.,Plantae,,,,Geraniaceae,Geranium,Japan,Japan,Mikuni-toge Mountain pass to jumonji-toge mountain pass,Minamisaku-gun Kawakami-mura,,Nagano,Eastern Asia,Japan,,,,,,,,,,,,http://data.gbif.org/occurrences/295137173,http://data.gbif.org/ws/rest/occurrence/get?key=295137173
"National Museum of Nature and Science, Japan","Plant specimens depodited in Osaka Museum of Natural History, Japan.",,,,,,,OSA,C,OSA71497,Specimen,,19:44.0,,,Geranium eriostemon Fisch. var. reinii (F. et S.) Maxim.,,Geranium eriostemon var. reinii (F. & S.) Maxim.,Plantae,,,,Geraniaceae,Geranium,Japan,Japan,Mikuni-toge Mountain pass to jumonji-toge mountain pass,Minamisaku-gun Kawakami-mura,,Nagano,Eastern Asia,Japan,,,,,,,,,,,,http://data.gbif.org/occurrences/295137174,http://data.gbif.org/ws/rest/occurrence/get?key=295137174
"National Museum of Nature and Science, Japan","Plant specimens depodited in Osaka Museum of Natural History, Japan.",,,,,,,OSA,C,OSA35399,Specimen,,19:42.0,,,Geranium eriostemon Fisch. var. reinii (F. et S.) Maxim.,Fisch.,Geranium eriostemon var. reinii (F. & S.) Maxim.,Plantae,,,,Geraniaceae,Geranium,Japan,Japan,,Minamikoma-gun Masuhocho,,Yamanashi Prefecture,Eastern Asia,Japan,,,,,,,,,,,,http://data.gbif.org/occurrences/295136904,http://data.gbif.org/ws/rest/occurrence/get?key=295136904
"National Museum of Nature and Science, Japan","Plant specimens depodited in Osaka Museum of Natural History, Japan.",,,,,,,OSA,C,OSA71498,Specimen,,19:44.0,,,Geranium eriostemon Fisch. var. reinii (F. et S.) Maxim.,,Geranium eriostemon var. reinii (F. & S.) Maxim.,Plantae,,,,Geraniaceae,Geranium,Japan,Japan,Mikuni-toge Mountain pass to jumonji-toge mountain pass,Minamisaku-gun Kawakami-mura,,Nagano,Eastern Asia,Japan,,,,,,,,,,,,http://data.gbif.org/occurrences/295137175,http://data.gbif.org/ws/rest/occurrence/get?key=295137175
"National Museum of Nature and Science, Japan","Plant specimens depodited in Osaka Museum of Natural History, Japan.",,,,,,,OSA,C,OSA10367,Specimen,,19:41.0,,,Geranium eriostemon Fisch. var. reinii (F. et S.) Maxim.,Fisch.,Geranium eriostemon var. reinii (F. & S.) Maxim.,Plantae,,,,Geraniaceae,Geranium,Japan,Japan,Jumonji-toge pass to Mt.Mikuni-Yama,Minami-saku-gun,,Nagano Prefecture,Eastern Asia,Japan,,,,,,,,,,,,http://data.gbif.org/occurrences/295136687,http://data.gbif.org/ws/rest/occurrence/get?key=295136687
"National Museum of Nature and Science, Japan","Plant specimens depodited in Osaka Museum of Natural History, Japan.",,,,,,,OSA,C,OSA7757,Specimen,,19:41.0,,,Geranium eriostemon Fisch. var. reinii (F. et. S.) Maxim.,Fisch.,Geranium eriostemon var. reinii,Plantae,,,,Geraniaceae,Geranium,Japan,Japan,Kadoma-onsen spa,Chiisagata-gun Sanada-cho,,Nagano Prefecture,Eastern Asia,Japan,,,,,,,,,,,,http://data.gbif.org/occurrences/295136667,http://data.gbif.org/ws/rest/occurrence/get?key=295136667
"National Museum of Nature and Science, Japan",Angiospermatatophytina Collection of Saitama Museum of Natural History,,,,,,,SMNH,As,1901,Specimen,,52:50.0,,,Geranium eriostemon Fisch. var. reinii (Franch. et Savat.) Maxim.,(Franch. et Savat.) Maxim.,Geranium eriostemon var. reinii (Franch. & Savat.) Maxim.,Plantae,Angiospermae,Dicotyledoneae,Geraniales,Geraniaceae,Geranium,Japan,Japan,,Chichibu-gun Otakimura,,Saitama,Eastern Asia,Japan,,,,,,,,,,,,http://data.gbif.org/occurrences/353564849,http://data.gbif.org/ws/rest/occurrence/get?key=353564849
"National Museum of Nature and Science, Japan",Angiospermatatophytina Collection of Saitama Museum of Natural History,,,,,,,SMNH,As,1898,Specimen,,52:50.0,,,Geranium eriostemon Fisch. var. reinii (Franch. et Savat.) Maxim.,(Franch. et Savat.) Maxim.,Geranium eriostemon var. reinii (Franch. & Savat.) Maxim.,Plantae,Angiospermae,Dicotyledoneae,Geraniales,Geraniaceae,Geranium,Japan,Japan,,Chichibu-gun Otakimura,,Saitama,Eastern Asia,Japan,,,,,,,,,,,,http://data.gbif.org/occurrences/353564846,http://data.gbif.org/ws/rest/occurrence/get?key=353564846
"National Museum of Nature and Science, Japan",Angiospermatatophytina Collection of Saitama Museum of Natural History,,,,,,,SMNH,As,11371,Specimen,,52:51.0,,,Geranium eriostemon Fisch. var. reinii (Franch. et Savat.) Maxim.,(Franch. et Savat.) Maxim.,Geranium eriostemon var. reinii (Franch. & Savat.) Maxim.,Plantae,Angiospermae,Dicotyledoneae,Geraniales,Geraniaceae,Geranium,Japan,Japan,,Chichibu-gun Otakimura,,Saitama,Eastern Asia,Japan,,,,,,,,,,,,http://data.gbif.org/occurrences/393099501,http://data.gbif.org/ws/rest/occurrence/get?key=393099501
"National Museum of Nature and Science, Japan",Angiospermatatophytina Collection of Saitama Museum of Natural History,,,,,,,SMNH,As,23299,Specimen,,52:53.0,,,Geranium eriostemon Fisch. var. reinii (Franch. et Savat.) Maxim.,(Franch. et Savat.) Maxim.,Geranium eriostemon var. reinii (Franch. & Savat.) Maxim.,Plantae,Angiospermae,Dicotyledoneae,Geraniales,Geraniaceae,Geranium,Japan,Japan,,Komoro-shi,,Nagano,Eastern Asia,Japan,,,,,,,,,,,,http://data.gbif.org/occurrences/393100010,http://data.gbif.org/ws/rest/occurrence/get?key=393100010
"National Museum of Nature and Science, Japan",Angiospermatatophytina Collection of Saitama Museum of Natural History,,,,,,,SMNH,As,1900,Specimen,,52:50.0,,,Geranium eriostemon Fisch. var. reinii (Franch. et Savat.) Maxim.,(Franch. et Savat.) Maxim.,Geranium eriostemon var. reinii (Franch. & Savat.) Maxim.,Plantae,Angiospermae,Dicotyledoneae,Geraniales,Geraniaceae,Geranium,Japan,Japan,,Minamisaku-gun Kawakamimura,,Nagano,Eastern Asia,Japan,,,,,,,,,,,,http://data.gbif.org/occurrences/353564848,http://data.gbif.org/ws/rest/occurrence/get?key=353564848
"National Museum of Nature and Science, Japan",Angiospermatatophytina Collection of Saitama Museum of Natural History,,,,,,,SMNH,As,1902,Specimen,,52:50.0,,,Geranium eriostemon Fisch. var. reinii (Franch. et Savat.) Maxim.,(Franch. et Savat.) Maxim.,Geranium eriostemon var. reinii (Franch. & Savat.) Maxim.,Plantae,Angiospermae,Dicotyledoneae,Geraniales,Geraniaceae,Geranium,Japan,Japan,,Chichibu-gun Otakimura,,Saitama,Eastern Asia,Japan,,,,,,,,,,,,http://data.gbif.org/occurrences/353564850,http://data.gbif.org/ws/rest/occurrence/get?key=353564850
"National Museum of Nature and Science, Japan",Angiospermatatophytina Collection of Saitama Museum of Natural History,,,,,,,SMNH,As,1895,Specimen,,52:50.0,,,Geranium eriostemon Fisch. var. reinii (Franch. et Savat.) Maxim.,(Franch. et Savat.) Maxim.,Geranium eriostemon var. reinii (Franch. & Savat.) Maxim.,Plantae,Angiospermae,Dicotyledoneae,Geraniales,Geraniaceae,Geranium,Japan,Japan,,Chichibu-gun Otakimura,,Saitama,Eastern Asia,Japan,,,,,,,,,,,,http://data.gbif.org/occurrences/353564843,http://data.gbif.org/ws/rest/occurrence/get?key=353564843
"National Museum of Nature and Science, Japan",Angiospermatatophytina Collection of Saitama Museum of Natural History,,,,,,,SMNH,As,1899,Specimen,,52:50.0,,,Geranium eriostemon Fisch. var. reinii (Franch. et Savat.) Maxim.,(Franch. et Savat.) Maxim.,Geranium eriostemon var. reinii (Franch. & Savat.) Maxim.,Plantae,Angiospermae,Dicotyledoneae,Geraniales,Geraniaceae,Geranium,Japan,Japan,,Minamisaku-gun Kawakamimura,,Nagano,Eastern Asia,Japan,,,,,,,,,,,,http://data.gbif.org/occurrences/353564847,http://data.gbif.org/ws/rest/occurrence/get?key=353564847
"National Museum of Nature and Science, Japan",Angiospermatatophytina Collection of Saitama Museum of Natural History,,,,,,,SMNH,As,1896,Specimen,,52:50.0,,,Geranium eriostemon Fisch. var. reinii (Franch. et Savat.) Maxim.,(Franch. et Savat.) Maxim.,Geranium eriostemon var. reinii (Franch. & Savat.) Maxim.,Plantae,Angiospermae,Dicotyledoneae,Geraniales,Geraniaceae,Geranium,Japan,Japan,,Chichibu-gun Otakimura,,Saitama,Eastern Asia,Japan,,,,,,,,,,,,http://data.gbif.org/occurrences/353564844,http://data.gbif.org/ws/rest/occurrence/get?key=353564844
"National Museum of Nature and Science, Japan",Angiospermatatophytina Collection of Saitama Museum of Natural History,,,,,,,SMNH,As,1897,Specimen,,52:50.0,,,Geranium eriostemon Fisch. var. reinii (Franch. et Savat.) Maxim.,(Franch. et Savat.) Maxim.,Geranium eriostemon var. reinii (Franch. & Savat.) Maxim.,Plantae,Angiospermae,Dicotyledoneae,Geraniales,Geraniaceae,Geranium,Japan,Japan,,Chichibu-gun Otakimura,,Saitama,Eastern Asia,Japan,,,,,,,,,,,,http://data.gbif.org/occurrences/353564845,http://data.gbif.org/ws/rest/occurrence/get?key=353564845
"National Museum of Nature and Science, Japan","Herbarium Specimens of Museum of Nature and Human Activities, Hyogo Prefecture, Japan",,,,,,,HYO,HYO-C,C1-067231,Specimen,,26:12.0,,,Geranium eriostemon Fisch. var. reinii (Franch. et Savat.) Maxim.,Fisch.,Geranium eriostemon var. reinii (Franch. & Savat.) Maxim.,Plantae,Magnoliophyta,Magnoliopsida,Geraniales,Geraniaceae,Geranium,Japan,Japan,,,,Fukui,Eastern Asia,Japan,,,,,,,,,1500,2000,,http://data.gbif.org/occurrences/177358887,http://data.gbif.org/ws/rest/occurrence/get?key=177358887
"National Museum of Nature and Science, Japan","Herbarium Specimens of Museum of Nature and Human Activities, Hyogo Prefecture, Japan",,,,,,,HYO,HYO-C,C1-106390,Specimen,,26:12.0,,,Geranium eriostemon Fisch. var. reinii (Franch. et Savat.) Maxim.,Fisch.,Geranium eriostemon var. reinii (Franch. & Savat.) Maxim.,Plantae,Magnoliophyta,Magnoliopsida,Geraniales,Geraniaceae,Geranium,Japan,Japan,,,,Shiga,Eastern Asia,Japan,,,,,,,,,,,,http://data.gbif.org/occurrences/177358891,http://data.gbif.org/ws/rest/occurrence/get?key=177358891
"National Museum of Nature and Science, Japan","Herbarium Specimens of Museum of Nature and Human Activities, Hyogo Prefecture, Japan",,,,,,,HYO,HYO-C,C1-080490,Specimen,,26:12.0,,,Geranium eriostemon Fisch. var. reinii (Franch. et Savat.) Maxim.,Fisch.,Geranium eriostemon var. reinii (Franch. & Savat.) Maxim.,Plantae,Magnoliophyta,Magnoliopsida,Geraniales,Geraniaceae,Geranium,Japan,Japan,,,,Ishikawa,Eastern Asia,Japan,,,,,,,,,2000,1800,,http://data.gbif.org/occurrences/177358890,http://data.gbif.org/ws/rest/occurrence/get?key=177358890
"National Museum of Nature and Science, Japan","Herbarium Specimens of Museum of Nature and Human Activities, Hyogo Prefecture, Japan",,,,,,,HYO,HYO-C,C1-067892,Specimen,,26:12.0,,,Geranium eriostemon Fisch. var. reinii (Franch. et Savat.) Maxim.,Fisch.,Geranium eriostemon var. reinii (Franch. & Savat.) Maxim.,Plantae,Magnoliophyta,Magnoliopsida,Geraniales,Geraniaceae,Geranium,Japan,Japan,,,,Fukui,Eastern Asia,Japan,,,,,,,,,1800,2000,,http://data.gbif.org/occurrences/177358889,http://data.gbif.org/ws/rest/occurrence/get?key=177358889
"National Museum of Nature and Science, Japan","Herbarium Specimens of Museum of Nature and Human Activities, Hyogo Prefecture, Japan",,,,,,,HYO,HYO-C,C1-067532,Specimen,,26:12.0,,,Geranium eriostemon Fisch. var. reinii (Franch. et Savat.) Maxim.,Fisch.,Geranium eriostemon var. reinii (Franch. & Savat.) Maxim.,Plantae,Magnoliophyta,Magnoliopsida,Geraniales,Geraniaceae,Geranium,Japan,Japan,,,,Ishikawa,Eastern Asia,Japan,,,,,,,,,2300,,,http://data.gbif.org/occurrences/177358888,http://data.gbif.org/ws/rest/occurrence/get?key=177358888
"National Museum of Nature and Science, Japan","Herbarium Specimens of Museum of Nature and Human Activities, Hyogo Prefecture, Japan",,,,,,,HYO,HYO-C,C1-066889,Specimen,,26:12.0,,,Geranium eriostemon Fisch. var. reinii (Franch. et Savat.) Maxim.,Fisch.,Geranium eriostemon var. reinii (Franch. & Savat.) Maxim.,Plantae,Magnoliophyta,Magnoliopsida,Geraniales,Geraniaceae,Geranium,Japan,Japan,,,,Ishikawa,Eastern Asia,Japan,,,,,,,,,2000,2400,,http://data.gbif.org/occurrences/177358884,http://data.gbif.org/ws/rest/occurrence/get?key=177358884
"National Museum of Nature and Science, Japan","Herbarium Specimens of Museum of Nature and Human Activities, Hyogo Prefecture, Japan",,,,,,,HYO,HYO-C,C1-067078,Specimen,,26:12.0,,,Geranium eriostemon Fisch. var. reinii (Franch. et Savat.) Maxim.,Fisch.,Geranium eriostemon var. reinii (Franch. & Savat.) Maxim.,Plantae,Magnoliophyta,Magnoliopsida,Geraniales,Geraniaceae,Geranium,Japan,Japan,,,,Ishikawa,Eastern Asia,Japan,,,,,,,,,2200,2400,,http://data.gbif.org/occurrences/177358886,http://data.gbif.org/ws/rest/occurrence/get?key=177358886
"National Museum of Nature and Science, Japan","Herbarium Specimens of Museum of Nature and Human Activities, Hyogo Prefecture, Japan",,,,,,,HYO,HYO-C,C1-047342,Specimen,,26:12.0,,,Geranium eriostemon Fisch. var. reinii (Franch. et Savat.) Maxim.,Fisch.,Geranium eriostemon var. reinii (Franch. & Savat.) Maxim.,Plantae,Magnoliophyta,Magnoliopsida,Geraniales,Geraniaceae,Geranium,Japan,Japan,,,,Gifu,Eastern Asia,Japan,,,,,,,,,,,,http://data.gbif.org/occurrences/177358883,http://data.gbif.org/ws/rest/occurrence/get?key=177358883
"National Museum of Nature and Science, Japan","Herbarium Specimens of Museum of Nature and Human Activities, Hyogo Prefecture, Japan",,,,,,,HYO,HYO-C,C1-067077,Specimen,,26:12.0,,,Geranium eriostemon Fisch. var. reinii (Franch. et Savat.) Maxim.,Fisch.,Geranium eriostemon var. reinii (Franch. & Savat.) Maxim.,Plantae,Magnoliophyta,Magnoliopsida,Geraniales,Geraniaceae,Geranium,Japan,Japan,,,,Ishikawa,Eastern Asia,Japan,,,,,,,,,2200,2400,,http://data.gbif.org/occurrences/177358885,http://data.gbif.org/ws/rest/occurrence/get?key=177358885