Data Publisher,Dataset,Dataset Rights,Collector name,Collector number,Field number,GUID,Date collected,Institution code,Collection code,Catalogue number,Basis of record,Image url,Last indexed,Identifier,Identification date,Scientific name,Author,Scientific name (interpreted),Kingdom,Phylum,Class,Order,Family,Genus,Country,Country (interpreted),Locality,County,Continent or Ocean,State/Province,Region,Publisher country,Latitude,Longitude,Coordinate precision,Cell id,Centi cell id,Min depth,Max depth,Max depth,Min altitude,Max altitude,Altitude precision,GBIF portal url,GBIF webservice url
"National Museum of Nature and Science, Japan",Angiosperm specimens of Iwate Prefectural Museum,,,,,,,IPMM,PA,74918,Specimen,,59:36.0,,,Daphne koreana Nakai,Nakai,Daphne koreana Nakai,Plantae,Angiospermae,Dicotyledoneae,,Thymelaeaceae,Daphne,Japan,Japan,,,,Shizuoka,Eastern Asia,Japan,,,,,,,,,,,,http://data.gbif.org/occurrences/93883188,http://data.gbif.org/ws/rest/occurrence/get?key=93883188
"National Museum of Nature and Science, Japan",Kochi Prefectural Makino Botanical Garden,,,,,,,MBK,MBK,174230,Specimen,,03:21.0,,,Daphne koreana Nakai,,Daphne koreana Nakai,Plantae,,,Thymelaeales,Thymelaeaceae,Daphne,Japan,Japan,,,,Pref. Kochi,Eastern Asia,Japan,,,,,,,,,,,,http://data.gbif.org/occurrences/143962408,http://data.gbif.org/ws/rest/occurrence/get?key=143962408
"National Museum of Nature and Science, Japan",Kochi Prefectural Makino Botanical Garden,,,,,,,MBK,MBK,174232,Specimen,,03:21.0,,,Daphne koreana Nakai,,Daphne koreana Nakai,Plantae,,,Thymelaeales,Thymelaeaceae,Daphne,Japan,Japan,,,,Pref. Kochi,Eastern Asia,Japan,,,,,,,,,,,,http://data.gbif.org/occurrences/143962409,http://data.gbif.org/ws/rest/occurrence/get?key=143962409
"National Museum of Nature and Science, Japan",Kochi Prefectural Makino Botanical Garden,,,,,,,MBK,MBK,149547,Specimen,,03:21.0,,,Daphne koreana Nakai,,Daphne koreana Nakai,Plantae,,,Thymelaeales,Thymelaeaceae,Daphne,Japan,Japan,,,,Pref. Kochi,Eastern Asia,Japan,,,,,,,,,,,,http://data.gbif.org/occurrences/143962279,http://data.gbif.org/ws/rest/occurrence/get?key=143962279
"National Museum of Nature and Science, Japan",Kochi Prefectural Makino Botanical Garden,,,,,,,MBK,MBK,10459,Specimen,,03:18.0,,,Daphne koreana Nakai,,Daphne koreana Nakai,Plantae,,,Thymelaeales,Thymelaeaceae,Daphne,Japan,Japan,,,,Pref. Kochi,Eastern Asia,Japan,,,,,,,,,,,,http://data.gbif.org/occurrences/143961536,http://data.gbif.org/ws/rest/occurrence/get?key=143961536
"National Museum of Nature and Science, Japan","Plant specimens depodited in Osaka Museum of Natural History, Japan.",,,,,,,OSA,OSA,241266,Specimen,,18:04.0,,,Daphne koreana Nakai,Nakai,Daphne koreana Nakai,Plantae,,,,Thymelaeaceae,Daphne,Japan,Japan,,Yoshino-gun Kawakamimura,,Nara,Eastern Asia,Japan,34.4069,135.798,,44955,47,,,,,,,http://data.gbif.org/occurrences/204374338,http://data.gbif.org/ws/rest/occurrence/get?key=204374338
"National Museum of Nature and Science, Japan","Plant specimens depodited in Osaka Museum of Natural History, Japan.",,,,,,,OSA,OSA,242775,Specimen,,18:04.0,,,Daphne koreana Nakai,Nakai,Daphne koreana Nakai,Plantae,,,,Thymelaeaceae,Daphne,Japan,Japan,,Yoshino-gun Tenkawamura,,Nara,Eastern Asia,Japan,34.4069,135.798,,44955,47,,,,,,,http://data.gbif.org/occurrences/204374340,http://data.gbif.org/ws/rest/occurrence/get?key=204374340
"National Museum of Nature and Science, Japan","Plant specimens depodited in Osaka Museum of Natural History, Japan.",,,,,,,OSA,OSA,251739,Specimen,,18:03.0,,,Daphne koreana Nakai,Nakai,Daphne koreana Nakai,Plantae,,,,Thymelaeaceae,Daphne,Japan,Japan,,Yoshino-gun Tenkawamura,,Nara,Eastern Asia,Japan,34.4069,135.798,,44955,47,,,,,,,http://data.gbif.org/occurrences/204374263,http://data.gbif.org/ws/rest/occurrence/get?key=204374263
"National Museum of Nature and Science, Japan","Plant specimens depodited in Osaka Museum of Natural History, Japan.",,,,,,,OSA,OSA,251736,Specimen,,18:03.0,,,Daphne koreana Nakai,Nakai,Daphne koreana Nakai,Plantae,,,,Thymelaeaceae,Daphne,Japan,Japan,,Yoshino-gun Tenkawamura,,Nara,Eastern Asia,Japan,34.4069,135.798,,44955,47,,,,,,,http://data.gbif.org/occurrences/204374265,http://data.gbif.org/ws/rest/occurrence/get?key=204374265
"National Museum of Nature and Science, Japan","Plant specimens depodited in Osaka Museum of Natural History, Japan.",,,,,,,OSA,OSA,251738,Specimen,,18:03.0,,,Daphne koreana Nakai,Nakai,Daphne koreana Nakai,Plantae,,,,Thymelaeaceae,Daphne,Japan,Japan,,Yoshino-gun Tenkawamura,,Nara,Eastern Asia,Japan,34.4069,135.798,,44955,47,,,,,,,http://data.gbif.org/occurrences/204374266,http://data.gbif.org/ws/rest/occurrence/get?key=204374266
"National Museum of Nature and Science, Japan","Plant specimens depodited in Osaka Museum of Natural History, Japan.",,,,,,,OSA,OSA,251737,Specimen,,18:03.0,,,Daphne koreana Nakai,Nakai,Daphne koreana Nakai,Plantae,,,,Thymelaeaceae,Daphne,Japan,Japan,,Yoshino-gun Kawakamimura,,Nara,Eastern Asia,Japan,34.4069,135.798,,44955,47,,,,,,,http://data.gbif.org/occurrences/204374267,http://data.gbif.org/ws/rest/occurrence/get?key=204374267
"National Museum of Nature and Science, Japan","Plant specimens depodited in Osaka Museum of Natural History, Japan.",,,,,,,OSA,OSA,243023,Specimen,,18:04.0,,,Daphne koreana Nakai,Nakai,Daphne koreana Nakai,Plantae,,,,Thymelaeaceae,Daphne,Japan,Japan,,Yoshino-gun Tenkawamura,,Nara,Eastern Asia,Japan,34.4069,135.798,,44955,47,,,,,,,http://data.gbif.org/occurrences/204374341,http://data.gbif.org/ws/rest/occurrence/get?key=204374341
"National Museum of Nature and Science, Japan","Plant specimens depodited in Osaka Museum of Natural History, Japan.",,,,,,,OSA,OSA,241592,Specimen,,18:04.0,,,Daphne koreana Nakai,Nakai,Daphne koreana Nakai,Plantae,,,,Thymelaeaceae,Daphne,Japan,Japan,,Yoshino-gun Kawakamimura,,Nara,Eastern Asia,Japan,34.4069,135.798,,44955,47,,,,,,,http://data.gbif.org/occurrences/204374339,http://data.gbif.org/ws/rest/occurrence/get?key=204374339
"National Museum of Nature and Science, Japan","Plant specimens depodited in Osaka Museum of Natural History, Japan.",,,,,,,OSA,OSA,241265,Specimen,,18:04.0,,,Daphne koreana Nakai,Nakai,Daphne koreana Nakai,Plantae,,,,Thymelaeaceae,Daphne,Japan,Japan,,Yoshino-gun Kawakamimura,,Nara,Eastern Asia,Japan,34.4069,135.798,,44955,47,,,,,,,http://data.gbif.org/occurrences/204374337,http://data.gbif.org/ws/rest/occurrence/get?key=204374337
"National Museum of Nature and Science, Japan","Plant specimens depodited in Osaka Museum of Natural History, Japan.",,,,,,,OSA,OSA,251735,Specimen,,18:03.0,,,Daphne koreana Nakai,Nakai,Daphne koreana Nakai,Plantae,,,,Thymelaeaceae,Daphne,Japan,Japan,,Yoshino-gun Tenkawamura,,Nara,Eastern Asia,Japan,34.4069,135.798,,44955,47,,,,,,,http://data.gbif.org/occurrences/204374264,http://data.gbif.org/ws/rest/occurrence/get?key=204374264
"National Museum of Nature and Science, Japan","Plant specimens depodited in Osaka Museum of Natural History, Japan.",,,,,,,OSA,OSA,251734,Specimen,,18:03.0,,,Daphne koreana Nakai,Nakai,Daphne koreana Nakai,Plantae,,,,Thymelaeaceae,Daphne,Japan,Japan,,Yoshino-gun Tenkawamura,,Nara,Eastern Asia,Japan,34.4069,135.798,,44955,47,,,,,,,http://data.gbif.org/occurrences/204374268,http://data.gbif.org/ws/rest/occurrence/get?key=204374268
