Data Publisher,Dataset,Dataset Rights,Collector name,Collector number,Field number,GUID,Date collected,Institution code,Collection code,Catalogue number,Basis of record,Image url,Last indexed,Identifier,Identification date,Scientific name,Author,Scientific name (interpreted),Kingdom,Phylum,Class,Order,Family,Genus,Country,Country (interpreted),Locality,County,Continent or Ocean,State/Province,Region,Publisher country,Latitude,Longitude,Coordinate precision,Cell id,Centi cell id,Min depth,Max depth,Max depth,Min altitude,Max altitude,Altitude precision,GBIF portal url,GBIF webservice url
"National Institute of Genetics, ROIS","Herbarium Specimens of Museum of Nature and Human Activities, Hyogo Pref., Japan",,,,,,,HYO,VP,C1-153500,Specimen,,27:37.0,,,Adonis amurensis,,Adonis amurensis,Plantae,Magnoliophyta,,,Ranunculaceae,Adonis,Japan,Japan,"Tokushima Pref.; Miyosi-gun, Nishiiyayama-mura.",,,Tokushima,Eastern Asia,Japan,,,,,,,,,600,800,,http://data.gbif.org/occurrences/323529313,http://data.gbif.org/ws/rest/occurrence/get?key=323529313
"National Institute of Genetics, ROIS","Herbarium Specimens of Museum of Nature and Human Activities, Hyogo Pref., Japan",,,,,,,HYO,VP,C1-047593,Specimen,,22:52.0,,,Adonis amurensis,,Adonis amurensis,Plantae,Magnoliophyta,,,Ranunculaceae,Adonis,Japan,Japan,"Hakucho-dai, Nemuro-shi",,,Hokkaido,Eastern Asia,Japan,,,,,,,,,,,,http://data.gbif.org/occurrences/323502554,http://data.gbif.org/ws/rest/occurrence/get?key=323502554
"National Museum of Nature and Science, Japan",Vascular Plants Collection of National Museum of Nature and Science,,,,,,,TNS,VS,727073,Specimen,,17:20.0,,,Adonis amurensis,,Adonis amurensis,Plantae,,,,Ranunculaceae,Adonis,Japan,Japan,,,,Hyogo,Eastern Asia,Japan,,,,,,,,,,,,http://data.gbif.org/occurrences/42942292,http://data.gbif.org/ws/rest/occurrence/get?key=42942292
"National Museum of Nature and Science, Japan","Plant specimens depodited in Osaka Museum of Natural History, Japan.",,,,,,,OSA,OSA,150735,Specimen,,14:57.0,,,Adonis amurensis Regal et Radde,Regal et Radde,Adonis amurensis Regal & Radde,Plantae,,,,Ranunculaceae,Adonis,Japan,Japan,,Yoshino-gun Tenkawamura,,Nara,Eastern Asia,Japan,34.4069,135.798,,44955,47,,,,,,,http://data.gbif.org/occurrences/204366176,http://data.gbif.org/ws/rest/occurrence/get?key=204366176
"National Museum of Nature and Science, Japan","Plant specimens depodited in Osaka Museum of Natural History, Japan.",,,,,,,OSA,OSA,103011,Specimen,,14:57.0,,,Adonis amurensis Regal et Radde,Regal et Radde,Adonis amurensis Regal & Radde,Plantae,,,,Ranunculaceae,Adonis,Japan,Japan,,Yoshino-gun Tenkawamura,,Nara,Eastern Asia,Japan,34.4069,135.798,,44955,47,,,,,,,http://data.gbif.org/occurrences/204366174,http://data.gbif.org/ws/rest/occurrence/get?key=204366174
"National Museum of Nature and Science, Japan","Plant specimens depodited in Osaka Museum of Natural History, Japan.",,,,,,,OSA,OSA,150728,Specimen,,14:57.0,,,Adonis amurensis Regal et Radde,Regal et Radde,Adonis amurensis Regal & Radde,Plantae,,,,Ranunculaceae,Adonis,Japan,Japan,,Yoshino-gun Nishiyoshinomura,,Nara,Eastern Asia,Japan,34.3502,135.7,,44955,37,,,,,,,http://data.gbif.org/occurrences/204366175,http://data.gbif.org/ws/rest/occurrence/get?key=204366175
GBIF-Sweden,Phanerogamic Botanical Collections (S),,N. Miyoshi,,,,00:00.0,S,S-Vascular,S-PL-20250,Specimen,,12:36.0,,,Adonis amurensis Regel & Radde,Regel & Radde,Adonis amurensis Regel & Radde,Plantae,,,,,Adonis,Japan,Japan,"Japan: Okayama city, Okayama University of Sci.,cult.",,ASIA,,Eastern Asia,Sweden,,,,,,,,,,,,http://data.gbif.org/occurrences/335016596,http://data.gbif.org/ws/rest/occurrence/get?key=335016596
"National Museum of Nature and Science, Japan","Plant specimens depodited in Osaka Museum of Natural History, Japan.",,,,,,,OSA,C,OSA8061,Specimen,,14:59.0,,,Adonis amurensis Regel et Radd.,Regel et Radd.,Adonis amurensis Regel & Radd.,Plantae,,,,Ranunculaceae,Adonis,Japan,Japan,,Inabe-gun,,Mie Prefecture,Eastern Asia,Japan,,,,,,,,,,,,http://data.gbif.org/occurrences/295102546,http://data.gbif.org/ws/rest/occurrence/get?key=295102546
"National Museum of Nature and Science, Japan",Angiospermatatophytina Collection of Saitama Museum of Natural History,,,,,,,SMNH,As,7911,Specimen,,52:01.0,,,Adonis amurensis Regel et Radde,Regel et Radde,Adonis amurensis Regel & Radde,Plantae,Angiospermae,Dicotyledoneae,Ranunculales,Ranunculaceae,Adonis,Japan,Japan,,Chichibu-gun Ryokamimura,,Saitama,Eastern Asia,Japan,,,,,,,,,,,,http://data.gbif.org/occurrences/393089088,http://data.gbif.org/ws/rest/occurrence/get?key=393089088
"National Museum of Nature and Science, Japan",Angiospermatatophytina Collection of Saitama Museum of Natural History,,,,,,,SMNH,As,7912,Specimen,,52:01.0,,,Adonis amurensis Regel et Radde,Regel et Radde,Adonis amurensis Regel & Radde,Plantae,Angiospermae,Dicotyledoneae,Ranunculales,Ranunculaceae,Adonis,Japan,Japan,,Chichibu-shi,,Saitama,Eastern Asia,Japan,,,,,,,,,,,,http://data.gbif.org/occurrences/393089089,http://data.gbif.org/ws/rest/occurrence/get?key=393089089
"National Museum of Nature and Science, Japan",Angiospermatatophytina Collection of Saitama Museum of Natural History,,,,,,,SMNH,As,7910,Specimen,,52:01.0,,,Adonis amurensis Regel et Radde,Regel et Radde,Adonis amurensis Regel & Radde,Plantae,Angiospermae,Dicotyledoneae,Ranunculales,Ranunculaceae,Adonis,Japan,Japan,,Chichibu-gun Ryokamimura,,Saitama,Eastern Asia,Japan,,,,,,,,,,,,http://data.gbif.org/occurrences/393089087,http://data.gbif.org/ws/rest/occurrence/get?key=393089087
"National Museum of Nature and Science, Japan",Angiospermatatophytina Collection of Saitama Museum of Natural History,,,,,,,SMNH,As,7916,Specimen,,52:01.0,,,Adonis amurensis Regel et Radde,Regel et Radde,Adonis amurensis Regel & Radde,Plantae,Angiospermae,Dicotyledoneae,Ranunculales,Ranunculaceae,Adonis,Japan,Japan,,Chichibu-shi,,Saitama,Eastern Asia,Japan,,,,,,,,,,,,http://data.gbif.org/occurrences/393089093,http://data.gbif.org/ws/rest/occurrence/get?key=393089093
"National Museum of Nature and Science, Japan",Angiospermatatophytina Collection of Saitama Museum of Natural History,,,,,,,SMNH,As,7913,Specimen,,52:01.0,,,Adonis amurensis Regel et Radde,Regel et Radde,Adonis amurensis Regel & Radde,Plantae,Angiospermae,Dicotyledoneae,Ranunculales,Ranunculaceae,Adonis,Japan,Japan,,Chichibu-gun Nagatoromachi,,Saitama,Eastern Asia,Japan,,,,,,,,,,,,http://data.gbif.org/occurrences/393089090,http://data.gbif.org/ws/rest/occurrence/get?key=393089090
"National Museum of Nature and Science, Japan",Angiospermatatophytina Collection of Saitama Museum of Natural History,,,,,,,SMNH,As,5325,Specimen,,52:00.0,,,Adonis amurensis Regel et Radde,Regel et Radde,Adonis amurensis Regel & Radde,Plantae,Angiospermae,Dicotyledoneae,Ranunculales,Ranunculaceae,Adonis,Japan,Japan,,Hiki-gun Tokigawamura,,Saitama,Eastern Asia,Japan,,,,,,,,,,,,http://data.gbif.org/occurrences/353563624,http://data.gbif.org/ws/rest/occurrence/get?key=353563624
"National Museum of Nature and Science, Japan",Angiospermatatophytina Collection of Saitama Museum of Natural History,,,,,,,SMNH,As,7914,Specimen,,52:01.0,,,Adonis amurensis Regel et Radde,Regel et Radde,Adonis amurensis Regel & Radde,Plantae,Angiospermae,Dicotyledoneae,Ranunculales,Ranunculaceae,Adonis,Japan,Japan,,Chichibu-gun Yoshidamachi,,Saitama,Eastern Asia,Japan,,,,,,,,,,,,http://data.gbif.org/occurrences/393089091,http://data.gbif.org/ws/rest/occurrence/get?key=393089091
"National Museum of Nature and Science, Japan",Angiospermatatophytina Collection of Saitama Museum of Natural History,,,,,,,SMNH,As,7915,Specimen,,52:01.0,,,Adonis amurensis Regel et Radde,Regel et Radde,Adonis amurensis Regel & Radde,Plantae,Angiospermae,Dicotyledoneae,Ranunculales,Ranunculaceae,Adonis,Japan,Japan,,Chichibu-shi,,Saitama,Eastern Asia,Japan,,,,,,,,,,,,http://data.gbif.org/occurrences/393089092,http://data.gbif.org/ws/rest/occurrence/get?key=393089092
"National Museum of Nature and Science, Japan","Botanical specimens database of Mr. Jiro Ito collection, Shizuoka Prefecture Museum of Natural History",,,,,,,SPMN,a,SPMN-a-383,Specimen,,37:36.0,,,Adonis amurensis Regel et Radde,Regel et Radde,Adonis amurensis Regel & Radde,Plantae,Magnoliophyta,Magnoliopsida,Ranunculales,Ranunculaceae,Adonis,Japan,Japan,,Higashichikuma-gun Shigamura,,Nagano,Eastern Asia,Japan,,,,,,,,,,,,http://data.gbif.org/occurrences/380182075,http://data.gbif.org/ws/rest/occurrence/get?key=380182075
"National Museum of Nature and Science, Japan","Herbarium Specimens of Museum of Nature and Human Activities, Hyogo Prefecture, Japan",,,,,,,HYO,HYO-C,C1-153500,Specimen,,24:02.0,,,Adonis amurensis Regel et Radde,Regel et Radde,Adonis amurensis Regel & Radde,Plantae,Magnoliophyta,Magnoliopsida,Ranunculales,Ranunculaceae,Adonis,Japan,Japan,,,,Tokushima,Eastern Asia,Japan,,,,,,,,,600,800,,http://data.gbif.org/occurrences/177340612,http://data.gbif.org/ws/rest/occurrence/get?key=177340612
"National Museum of Nature and Science, Japan","Herbarium Specimens of Museum of Nature and Human Activities, Hyogo Prefecture, Japan",,,,,,,HYO,HYO-C,C1-202652,Specimen,,24:02.0,,,Adonis amurensis Regel et Radde,Regel et Radde,Adonis amurensis Regel & Radde,Plantae,,,,Ranunculaceae,Adonis,Japan,Japan,,,,Hyogo,Eastern Asia,Japan,,,,,,,,,50,400,,http://data.gbif.org/occurrences/177340613,http://data.gbif.org/ws/rest/occurrence/get?key=177340613
"National Museum of Nature and Science, Japan","Herbarium Specimens of Museum of Nature and Human Activities, Hyogo Prefecture, Japan",,,,,,,HYO,HYO-C,C1-047593,Specimen,,24:02.0,,,Adonis amurensis Regel et Radde,Regel et Radde,Adonis amurensis Regel & Radde,Plantae,Magnoliophyta,Magnoliopsida,Ranunculales,Ranunculaceae,Adonis,Japan,Japan,,,,Hokkaido,Eastern Asia,Japan,,,,,,,,,,,,http://data.gbif.org/occurrences/177340611,http://data.gbif.org/ws/rest/occurrence/get?key=177340611
"National Museum of Nature and Science, Japan","Ibaraki Nature Museum, Vascular Plants collection",,,,,,,INM,Va,109047,Specimen,,47:44.0,,,Adonis amurensis Regel et Radde,Regel et Radde,Adonis amurensis Regel & Radde,Plantae,SPERMATOPHYTAANGIOSPERMAE,DICOTYLEDONEAE,,RANUNCULACEAE,Adonis,Japan,Japan,,Kitaibaraki-shi,,Ibaraki,Eastern Asia,Japan,,,,,,,,,,,,http://data.gbif.org/occurrences/381781049,http://data.gbif.org/ws/rest/occurrence/get?key=381781049
"National Museum of Nature and Science, Japan","Ibaraki Nature Museum, Vascular Plants collection",,,,,,,INM,Va,109049,Specimen,,47:44.0,,,Adonis amurensis Regel et Radde,Regel et Radde,Adonis amurensis Regel & Radde,Plantae,SPERMATOPHYTAANGIOSPERMAE,DICOTYLEDONEAE,,RANUNCULACEAE,Adonis,Japan,Japan,,Kitaibaraki-shi,,Ibaraki,Eastern Asia,Japan,,,,,,,,,,,,http://data.gbif.org/occurrences/381781051,http://data.gbif.org/ws/rest/occurrence/get?key=381781051
"National Museum of Nature and Science, Japan","Ibaraki Nature Museum, Vascular Plants collection",,,,,,,INM,Va,41432,Specimen,,47:41.0,,,Adonis amurensis Regel et Radde,Regel et Radde,Adonis amurensis Regel & Radde,Plantae,ANGIOSPERMAE,DICOTYLEDONEAE,,RANUNCULACEAE,Adonis,Japan,Japan,,,,,Eastern Asia,Japan,,,,,,,,,,,,http://data.gbif.org/occurrences/381780767,http://data.gbif.org/ws/rest/occurrence/get?key=381780767
"National Museum of Nature and Science, Japan","Ibaraki Nature Museum, Vascular Plants collection",,,,,,,INM,Va,41430,Specimen,,47:41.0,,,Adonis amurensis Regel et Radde,Regel et Radde,Adonis amurensis Regel & Radde,Plantae,ANGIOSPERMAE,DICOTYLEDONEAE,,RANUNCULACEAE,Adonis,Japan,Japan,,,,,Eastern Asia,Japan,,,,,,,,,,,,http://data.gbif.org/occurrences/381780765,http://data.gbif.org/ws/rest/occurrence/get?key=381780765
"National Museum of Nature and Science, Japan","Ibaraki Nature Museum, Vascular Plants collection",,,,,,,INM,Va,109048,Specimen,,47:44.0,,,Adonis amurensis Regel et Radde,Regel et Radde,Adonis amurensis Regel & Radde,Plantae,SPERMATOPHYTAANGIOSPERMAE,DICOTYLEDONEAE,,RANUNCULACEAE,Adonis,Japan,Japan,,Kitaibaraki-shi,,Ibaraki,Eastern Asia,Japan,,,,,,,,,,,,http://data.gbif.org/occurrences/381781050,http://data.gbif.org/ws/rest/occurrence/get?key=381781050
"National Museum of Nature and Science, Japan","Ibaraki Nature Museum, Vascular Plants collection",,,,,,,INM,Va,41431,Specimen,,47:41.0,,,Adonis amurensis Regel et Radde,Regel et Radde,Adonis amurensis Regel & Radde,Plantae,ANGIOSPERMAE,DICOTYLEDONEAE,,RANUNCULACEAE,Adonis,Japan,Japan,,,,,Eastern Asia,Japan,,,,,,,,,,,,http://data.gbif.org/occurrences/381780766,http://data.gbif.org/ws/rest/occurrence/get?key=381780766
"National Museum of Nature and Science, Japan",Kochi Prefectural Makino Botanical Garden,,,,,,,MBK,MBK,234,Specimen,,11:26.0,,,Adonis amurensis Regel et Radde,Regel et Radde,Adonis amurensis Regel & Radde,Plantae,,,,Ranunculaceaea,Adonis,Japan,Japan,Oizumi,Nerima-ku,,Tokyo,Eastern Asia,Japan,35.7663,139.592,,45319,75,,,,,,,http://data.gbif.org/occurrences/287486903,http://data.gbif.org/ws/rest/occurrence/get?key=287486903
"National Museum of Nature and Science, Japan",Kochi Prefectural Makino Botanical Garden,,,,,,,MBK,MBK,27,Specimen,,58:38.0,,,Adonis amurensis Regel et Radde,Regel et Radde,Adonis amurensis Regel & Radde,Plantae,,,,Ranunculaceaea,Adonis,Japan,Japan,Oizumi,Nerima-ku,,Tokyo,Eastern Asia,Japan,,,,,,,,,,,,http://data.gbif.org/occurrences/354273495,http://data.gbif.org/ws/rest/occurrence/get?key=354273495
"National Museum of Nature and Science, Japan",Kochi Prefectural Makino Botanical Garden,,,,,,,MBK,MBK,2803,Specimen,,58:38.0,,,Adonis amurensis Regel et Radde,Regel et Radde,Adonis amurensis Regel & Radde,Plantae,,,,Ranunculaceaea,Adonis,Japan,Japan,Oizumi,Nerima-ku,,Tokyo,Eastern Asia,Japan,,,,,,,,,,,,http://data.gbif.org/occurrences/354273573,http://data.gbif.org/ws/rest/occurrence/get?key=354273573
"National Museum of Nature and Science, Japan",Kochi Prefectural Makino Botanical Garden,,,,,,,MBK,MBK,2803,Specimen,,02:42.0,,,Adonis amurensis Regel et Radde,Regel et Radde,Adonis amurensis Regel & Radde,Plantae,,,,Ranunculaceaea,Adonis,Japan,Japan,,Nerima-ku,,Tokyo,Eastern Asia,Japan,,,,,,,,,,,,http://data.gbif.org/occurrences/287506576,http://data.gbif.org/ws/rest/occurrence/get?key=287506576
"National Museum of Nature and Science, Japan",Kochi Prefectural Makino Botanical Garden,,,,,,,MBK,MBK,27,Specimen,,02:41.0,,,Adonis amurensis Regel et Radde,Regel et Radde,Adonis amurensis Regel & Radde,Plantae,,,,Ranunculaceaea,Adonis,Japan,Japan,,Nerima-ku,,Tokyo,Eastern Asia,Japan,,,,,,,,,,,,http://data.gbif.org/occurrences/287516186,http://data.gbif.org/ws/rest/occurrence/get?key=287516186
"National Museum of Nature and Science, Japan","Plant specimens depodited in Osaka Museum of Natural History, Japan.",,,,,,,OSA,C,OSA48309,Specimen,,15:00.0,,,Adonis amurensis Regel et Radde,Regel et Radde,Adonis amurensis Regel & Radde,Plantae,,,,Ranunculaceae,Adonis,Japan,Japan,Sugadaira Highland,Chiisagata-gun Sanada-cho,,Nagano Prefecture,Eastern Asia,Japan,,,,,,,,,,,,http://data.gbif.org/occurrences/295102841,http://data.gbif.org/ws/rest/occurrence/get?key=295102841
"National Museum of Nature and Science, Japan","Plant specimens depodited in Osaka Museum of Natural History, Japan.",,,,,,,OSA,C,OSA68959,Specimen,,15:01.0,,,Adonis amurensis Regel et Radde,,Adonis amurensis Regel & Radde,Plantae,,,,Ranunculaceae,Adonis,Japan,Japan,,Inabe-gun,,Mie,Eastern Asia,Japan,,,,,,,,,,,,http://data.gbif.org/occurrences/295102963,http://data.gbif.org/ws/rest/occurrence/get?key=295102963
"National Museum of Nature and Science, Japan","Plant specimens depodited in Osaka Museum of Natural History, Japan.",,,,,,,OSA,C,OSA45334,Specimen,,15:00.0,,,Adonis amurensis Regel et Radde,Regel et Radde,Adonis amurensis Regel & Radde,Plantae,,,,Ranunculaceae,Adonis,Japan,Japan,,Izumi-shi,,Osaka Prefecture,Eastern Asia,Japan,,,,,,,,,,,,http://data.gbif.org/occurrences/295102816,http://data.gbif.org/ws/rest/occurrence/get?key=295102816
"National Museum of Nature and Science, Japan","Plant specimens depodited in Osaka Museum of Natural History, Japan.",,,,,,,OSA,C,OSA4470,Specimen,,14:59.0,,,Adonis amurensis Regel et Radde,Regel et Radde,Adonis amurensis Regel & Radde,Plantae,,,,Ranunculaceae,Adonis,Japan,Japan,,Inukami-gun,,Shiga Prefecture,Eastern Asia,Japan,,,,,,,,,,,,http://data.gbif.org/occurrences/295102518,http://data.gbif.org/ws/rest/occurrence/get?key=295102518
"National Museum of Nature and Science, Japan","Plant specimens depodited in Osaka Museum of Natural History, Japan.",,,,,,,OSA,C,OSA28194,Specimen,,14:59.0,,,Adonis amurensis Regel et Radde,Regel et Radde,Adonis amurensis Regel & Radde,Plantae,,,,Ranunculaceae,Adonis,Japan,Japan,Mt. Eboshi,"Kuma-gun, Itsuki-mura",,Kumamoto Prefecture,Eastern Asia,Japan,,,,,,,,,,,,http://data.gbif.org/occurrences/295102696,http://data.gbif.org/ws/rest/occurrence/get?key=295102696
"National Museum of Nature and Science, Japan","Plant specimens depodited in Osaka Museum of Natural History, Japan.",,,,,,,OSA,C,OSA970,Specimen,,14:58.0,,,Adonis amurensis Regel et Radde,Regel et Radde,Adonis amurensis Regel & Radde,Plantae,,,,Ranunculaceae,Adonis,Japan,Japan,,Yoshino-gun Nishi-Yoshino-mura,,Nara Prefecture,Eastern Asia,Japan,,,,,,,,,,,,http://data.gbif.org/occurrences/295102500,http://data.gbif.org/ws/rest/occurrence/get?key=295102500
"National Museum of Nature and Science, Japan","Plant specimens depodited in Osaka Museum of Natural History, Japan.",,,,,,,OSA,C,OSA48308,Specimen,,15:00.0,,,Adonis amurensis Regel et Radde,Regel et Radde,Adonis amurensis Regel & Radde,Plantae,,,,Ranunculaceae,Adonis,Japan,Japan,Sugadaira Highland,Chiisagata-gun Sanada-cho,,Nagano Prefecture,Eastern Asia,Japan,,,,,,,,,,,,http://data.gbif.org/occurrences/295102840,http://data.gbif.org/ws/rest/occurrence/get?key=295102840
"National Museum of Nature and Science, Japan","Plant specimens depodited in Osaka Museum of Natural History, Japan.",,,,,,,OSA,C,OSA10696,Specimen,,14:59.0,,,Adonis amurensis Regel et Radde,Regel et Radde,Adonis amurensis Regel & Radde,Plantae,,,,Ranunculaceae,Adonis,Japan,Japan,,Inabe-gun,,Mie Prefecture,Eastern Asia,Japan,,,,,,,,,,,,http://data.gbif.org/occurrences/295102563,http://data.gbif.org/ws/rest/occurrence/get?key=295102563
"National Museum of Nature and Science, Japan","Plant specimens depodited in Osaka Museum of Natural History, Japan.",,,,,,,OSA,C,OSA62164,Specimen,,15:01.0,,,Adonis amurensis Regel et Radde,Regel et Radde,Adonis amurensis Regel & Radde,Plantae,,,,Ranunculaceae,Adonis,Japan,Japan,,Inabe-gun,,Mie Prefecture,Eastern Asia,Japan,,,,,,,,,,,,http://data.gbif.org/occurrences/295102921,http://data.gbif.org/ws/rest/occurrence/get?key=295102921
"National Museum of Nature and Science, Japan","Plant specimens depodited in Osaka Museum of Natural History, Japan.",,,,,,,OSA,OSA,191669,Specimen,,14:57.0,,,Adonis amurensis Regel et Radde,Regel et Radde,Adonis amurensis Regel & Radde,Plantae,,,,Ranunculaceae,Adonis,Japan,Japan,,Yoshino-gun Nishiyoshinomura,,Nara,Eastern Asia,Japan,34.3502,135.7,,44955,37,,,,,,,http://data.gbif.org/occurrences/204366178,http://data.gbif.org/ws/rest/occurrence/get?key=204366178
"National Museum of Nature and Science, Japan","Plant specimens depodited in Osaka Museum of Natural History, Japan.",,,,,,,OSA,OSA,970,Specimen,,14:57.0,,,Adonis amurensis Regel et Radde,Regel et Radde,Adonis amurensis Regel & Radde,Plantae,,,,Ranunculaceae,Adonis,Japan,Japan,,Yoshino-gun Nishiyoshinomura,,Nara,Eastern Asia,Japan,34.3502,135.7,,44955,37,,,,,,,http://data.gbif.org/occurrences/204366177,http://data.gbif.org/ws/rest/occurrence/get?key=204366177
"National Museum of Nature and Science, Japan","Plant specimens depodited in Osaka Museum of Natural History, Japan.",,,,,,,OSA,C,OSA5134,Specimen,,14:59.0,,,Adonis amurensis Regel et Radde,Regel et Radde,Adonis amurensis Regel & Radde,Plantae,,,,Ranunculaceae,Adonis,Japan,Japan,,Toyono-gun nosecho,,Osaka Prefecture,Eastern Asia,Japan,,,,,,,,,,,,http://data.gbif.org/occurrences/295102527,http://data.gbif.org/ws/rest/occurrence/get?key=295102527
"National Museum of Nature and Science, Japan",Plant specimens of Hokkaido University Museum,,,,,,,SAPS,plant,22766,Specimen,,02:07.0,,,Adonis amurensis Regel et Radde,Regel et Radde,Adonis amurensis Regel & Radde,Plantae,Magnoliophyta,Magnoliopsida,Ranunculales,Ranunculaceae,Adonis,Japan,Japan,,Kushiro-shi,,Hokkaido Pref.,Eastern Asia,Japan,,,,,,,,,,,,http://data.gbif.org/occurrences/415411256,http://data.gbif.org/ws/rest/occurrence/get?key=415411256
"National Museum of Nature and Science, Japan",Plant specimens of Hokkaido University Museum,,,,,,,SAPS,plant,22764,Specimen,,02:07.0,,,Adonis amurensis Regel et Radde,Regel et Radde,Adonis amurensis Regel & Radde,Plantae,Magnoliophyta,Magnoliopsida,Ranunculales,Ranunculaceae,Adonis,Japan,Japan,,Teshikaga-cho,,Hokkaido Pref.,Eastern Asia,Japan,,,,,,,,,,,,http://data.gbif.org/occurrences/415411254,http://data.gbif.org/ws/rest/occurrence/get?key=415411254
"National Museum of Nature and Science, Japan",Plant specimens of Hokkaido University Museum,,,,,,,SAPS,plant,22767,Specimen,,02:07.0,,,Adonis amurensis Regel et Radde,Regel et Radde,Adonis amurensis Regel & Radde,Plantae,Magnoliophyta,Magnoliopsida,Ranunculales,Ranunculaceae,Adonis,Japan,Japan,,Teshikaga-cho,,Hokkaido Pref.,Eastern Asia,Japan,,,,,,,,,,,,http://data.gbif.org/occurrences/415411257,http://data.gbif.org/ws/rest/occurrence/get?key=415411257
"National Museum of Nature and Science, Japan",Plant specimens of Hokkaido University Museum,,,,,,,SAPS,plant,22765,Specimen,,02:07.0,,,Adonis amurensis Regel et Radde,Regel et Radde,Adonis amurensis Regel & Radde,Plantae,Magnoliophyta,Magnoliopsida,Ranunculales,Ranunculaceae,Adonis,Japan,Japan,,Kushiro-shi,,Hokkaido Pref.,Eastern Asia,Japan,,,,,,,,,,,,http://data.gbif.org/occurrences/415411255,http://data.gbif.org/ws/rest/occurrence/get?key=415411255
"National Museum of Nature and Science, Japan","Plant specimens depodited in Osaka Museum of Natural History, Japan.",,,,,,,OSA,C,OSA10144,Specimen,,14:59.0,,,Adonis amurensis Regel. et Radd.,Regel. et Radd.,Adonis amurensis Regel. & Radd.,Plantae,,,,Ranunculaceae,Adonis,Japan,Japan,,Inukami-gun Tagacho,,Shiga Prefecture,Eastern Asia,Japan,,,,,,,,,,,,http://data.gbif.org/occurrences/295102557,http://data.gbif.org/ws/rest/occurrence/get?key=295102557
"National Museum of Nature and Science, Japan","Plant specimens depodited in Osaka Museum of Natural History, Japan.",,,,,,,OSA,C,OSA16880,Specimen,,14:59.0,,,Adonis amurensis Regel. et Radde,Regel. et Radde,Adonis amurensis Regel. & Radde,Plantae,,,,Ranunculaceae,Adonis,Japan,Japan,,Inukami-gun Tagacho,,Shiga Prefecture,Eastern Asia,Japan,,,,,,,,,,,,http://data.gbif.org/occurrences/295102620,http://data.gbif.org/ws/rest/occurrence/get?key=295102620
