Data Publisher,Dataset,Dataset Rights,Collector name,Collector number,Field number,GUID,Date collected,Institution code,Collection code,Catalogue number,Basis of record,Image url,Last indexed,Identifier,Identification date,Scientific name,Author,Scientific name (interpreted),Kingdom,Phylum,Class,Order,Family,Genus,Country,Country (interpreted),Locality,County,Continent or Ocean,State/Province,Region,Publisher country,Latitude,Longitude,Coordinate precision,Cell id,Centi cell id,Min depth,Max depth,Max depth,Min altitude,Max altitude,Altitude precision,GBIF portal url,GBIF webservice url
"National Museum of Nature and Science, Japan",Plant Specimens collections of the Kyushu UNniversity Museum,,,,,,,KYUM,FU,NAK01665,Specimen,,16:24.0,,,Sisyrinchium angustifolium Mill.,,Sisyrinchium angustifolium Mill.,Plantae,Magnoliophyta,Liliopsida,Liliales,Iridaceae,Sisyrinchium,Japan,Japan,,Ujiyamada City,,Mie Pref.,Eastern Asia,Japan,,,,,,,,,,,,http://data.gbif.org/occurrences/234572461,http://data.gbif.org/ws/rest/occurrence/get?key=234572461
"National Museum of Nature and Science, Japan",Vascular plants collection of Hiratsuka City Museum,,,,,,,HCM,56,81966,Specimen,,16:39.0,,,Sisyrinchium angustifolium Mill.,Mill.,Sisyrinchium angustifolium Mill.,Plantae,,,,Iridaceae,Sisyrinchium,Japan,Japan,,Fujisawa-shi,,Kanagawa,Eastern Asia,Japan,,,,,,,,,,,,http://data.gbif.org/occurrences/385740566,http://data.gbif.org/ws/rest/occurrence/get?key=385740566
"National Museum of Nature and Science, Japan",Vascular Plants Collection of Sagamihara City Museum,,,,,,,JSCM,VS,11906,Specimen,,44:03.0,,,Sisyrinchium angustifolium Mill.,Mill.,Sisyrinchium angustifolium Mill.,Plantae,Spermatophyta,,,IRIDACEAE,Sisyrinchium,Japan,Japan,,Ayase-shi,,Kanagawa,Eastern Asia,Japan,,,,,,,,,,,,http://data.gbif.org/occurrences/351229455,http://data.gbif.org/ws/rest/occurrence/get?key=351229455
"National Museum of Nature and Science, Japan",Vascular Plants Collection of Sagamihara City Museum,,,,,,,JSCM,VS,25433,Specimen,,44:06.0,,,Sisyrinchium angustifolium Mill.,Mill.,Sisyrinchium angustifolium Mill.,Plantae,Spermatophyta,,,IRIDACEAE,Sisyrinchium,Japan,Japan,"Ogura, Shiroyama Town, Sagamihara City, Kanagawa Pref.",Sagamihara-shi,,Kanagawa,Eastern Asia,Japan,,,,,,,,,130,,,http://data.gbif.org/occurrences/351230005,http://data.gbif.org/ws/rest/occurrence/get?key=351230005
"National Museum of Nature and Science, Japan",Vascular Plants Collection of Sagamihara City Museum,,,,,,,JSCM,VS,20176,Specimen,,44:05.0,,,Sisyrinchium angustifolium Mill.,Mill.,Sisyrinchium angustifolium Mill.,Plantae,Spermatophyta,,,IRIDACEAE,Sisyrinchium,Japan,Japan,,Ayase-shi,,Kanagawa,Eastern Asia,Japan,,,,,,,,,,,,http://data.gbif.org/occurrences/351229825,http://data.gbif.org/ws/rest/occurrence/get?key=351229825
"National Museum of Nature and Science, Japan",Vascular Plants Collection of Sagamihara City Museum,,,,,,,JSCM,VS,33831,Specimen,,44:07.0,,,Sisyrinchium angustifolium Mill.,Mill.,Sisyrinchium angustifolium Mill.,Plantae,Spermatophyta,,,IRIDACEAE,Sisyrinchium,Japan,Japan,"Tana, Sagamihara City, Kanagawa Pref.",Sagamihara-shi,,Kanagawa,Eastern Asia,Japan,,,,,,,,,50,,,http://data.gbif.org/occurrences/387685247,http://data.gbif.org/ws/rest/occurrence/get?key=387685247
"National Museum of Nature and Science, Japan",Vascular plants collection of Hiratsuka City Museum,,,,,,,HCM,56,32219,Specimen,,16:35.0,,,Sisyrinchium angustifolium Mill.,Mill.,Sisyrinchium angustifolium Mill.,Plantae,,,,IRIDACEAE,Sisyrinchium,Japan,Japan,Ishikawa,Fujisawa-shi,,Kanagawa,Eastern Asia,Japan,35.3792,139.456,,45319,34,,,,,,,http://data.gbif.org/occurrences/188248894,http://data.gbif.org/ws/rest/occurrence/get?key=188248894
"National Museum of Nature and Science, Japan",Vascular Plant Specimen Database of Kanagawa Prefectural Museum of Natural History,,,,,,,KPM,NA,KPM-NA0126117,Specimen,,31:13.0,,,Sisyrinchium angustifolium Mill.,,Sisyrinchium angustifolium Mill.,Plantae,Angiospermae,Monocotyledoneae,,IRIDACEAE,Sisyrinchium,Japan,Japan,,"Kawachi-gun,, Kawachi-machi",,Tochigi Prefecture,Eastern Asia,Japan,,,,,,,,,,,,http://data.gbif.org/occurrences/388868750,http://data.gbif.org/ws/rest/occurrence/get?key=388868750
"National Museum of Nature and Science, Japan",Vascular Plant Specimen Database of Kanagawa Prefectural Museum of Natural History,,,,,,,KPM,NA,KPM-NA0119336,Specimen,,31:13.0,,,Sisyrinchium angustifolium Mill.,,Sisyrinchium angustifolium Mill.,Plantae,Angiospermae,Monocotyledoneae,,IRIDACEAE,Sisyrinchium,Japan,Japan,,Fujisawa-shi,,Kanagawa Prefecture,Eastern Asia,Japan,,,,,,,,,,,,http://data.gbif.org/occurrences/388868730,http://data.gbif.org/ws/rest/occurrence/get?key=388868730
"National Museum of Nature and Science, Japan",Vascular Plant Specimen Database of Kanagawa Prefectural Museum of Natural History,,,,,,,KPM,NA,KPM-NA0116441,Specimen,,31:13.0,,,Sisyrinchium angustifolium Mill.,,Sisyrinchium angustifolium Mill.,Plantae,Angiospermae,Monocotyledoneae,,IRIDACEAE,Sisyrinchium,Japan,Japan,,"Yokohama-shi, Nishi-ku",,Kanagawa Prefecture,Eastern Asia,Japan,,,,,,,,,,,,http://data.gbif.org/occurrences/388868717,http://data.gbif.org/ws/rest/occurrence/get?key=388868717
"National Museum of Nature and Science, Japan",Vascular Plant Specimen Database of Kanagawa Prefectural Museum of Natural History,,,,,,,KPM,NA,KPM-NA0159084,Specimen,,31:14.0,,,Sisyrinchium angustifolium Mill.,,Sisyrinchium angustifolium Mill.,Plantae,Angiospermae,Monocotyledoneae,,IRIDACEAE,Sisyrinchium,Japan,Japan,,Sagamihara-shi,,Kanagawa Prefecture,Eastern Asia,Japan,,,,,,,,,380,,,http://data.gbif.org/occurrences/388868796,http://data.gbif.org/ws/rest/occurrence/get?key=388868796
"National Institute of Genetics, ROIS","Herbarium Specimens of Museum of Nature and Human Activities, Hyogo Pref., Japan",,,,,,,HYO,VP,C1-010170,Specimen,,22:01.0,,,Sisyrinchium graminoides,,Sisyrinchium graminoides,Plantae,Magnoliophyta,,,Iridaceae,Sisyrinchium,Japan,Japan,"Hyogo-ken: Asago-gun, Wadayama-cho, Kuseda.",,,Hyogo,Eastern Asia,Japan,,,,,,,,,,,,http://data.gbif.org/occurrences/323496363,http://data.gbif.org/ws/rest/occurrence/get?key=323496363
"National Institute of Genetics, ROIS","Herbarium Specimens of Museum of Nature and Human Activities, Hyogo Pref., Japan",,,,,,,HYO,VP,C1-006019,Specimen,,17:18.0,,,Sisyrinchium graminoides,,Sisyrinchium graminoides,Plantae,Magnoliophyta,,,Iridaceae,Sisyrinchium,Japan,Japan,"Hyogo Pref.; Kakogawa-shi, Kakogawa River bank",,,Hyogo,Eastern Asia,Japan,,,,,,,,,,,,http://data.gbif.org/occurrences/323443779,http://data.gbif.org/ws/rest/occurrence/get?key=323443779
"National Institute of Genetics, ROIS","Herbarium Specimens of Museum of Nature and Human Activities, Hyogo Pref., Japan",,,,,,,HYO,VP,C1-004820,Specimen,,17:36.0,,,Sisyrinchium graminoides,,Sisyrinchium graminoides,Plantae,Magnoliophyta,,,Iridaceae,Sisyrinchium,Japan,Japan,"Hyogo Pref.; Kato-gun, Yashiro-cho, Kamokamogawa.",,,Hyogo,Eastern Asia,Japan,135.05,34.95,,,,,,,,,,http://data.gbif.org/occurrences/323448304,http://data.gbif.org/ws/rest/occurrence/get?key=323448304
"National Institute of Genetics, ROIS","Herbarium Specimens of Museum of Nature and Human Activities, Hyogo Pref., Japan",,,,,,,HYO,VP,C1-007501,Specimen,,25:25.0,,,Sisyrinchium graminoides,,Sisyrinchium graminoides,Plantae,Magnoliophyta,,,Iridaceae,Sisyrinchium,Japan,Japan,"Hyogo Pref.; Yabu-gun, Ohya-cho, Yokoyuki.",,,Hyogo,Eastern Asia,Japan,,,,,,,,,,,,http://data.gbif.org/occurrences/323516360,http://data.gbif.org/ws/rest/occurrence/get?key=323516360
"National Museum of Nature and Science, Japan","Ibaraki Nature Museum, Vascular Plants collection",,,,,,,INM,Va,5524,Specimen,,54:11.0,,,Sisyrinchium graminoides,,Sisyrinchium graminoides,Plantae,ANGIOSPERMAE,MONOCOTYLEDONEAE,,Iridaceae,Sisyrinchium,Japan,Japan,,Kashima-gun Hasakimachi,,Ibaraki,Eastern Asia,Japan,,,,,,,,,10,,,http://data.gbif.org/occurrences/381842956,http://data.gbif.org/ws/rest/occurrence/get?key=381842956
"National Museum of Nature and Science, Japan","Ibaraki Nature Museum, Vascular Plants collection",,,,,,,INM,Va,42491,Specimen,,54:12.0,,,Sisyrinchium graminoides,,Sisyrinchium graminoides,Plantae,ANGIOSPERMAE,MONOCOTYLEDONEAE,,IRIDACEAE,Sisyrinchium,Japan,Japan,,,,,Eastern Asia,Japan,,,,,,,,,,,,http://data.gbif.org/occurrences/381843215,http://data.gbif.org/ws/rest/occurrence/get?key=381843215
"National Museum of Nature and Science, Japan","Ibaraki Nature Museum, Vascular Plants collection",,,,,,,INM,Va,5525,Specimen,,54:11.0,,,Sisyrinchium graminoides,,Sisyrinchium graminoides,Plantae,ANGIOSPERMAE,MONOCOTYLEDONEAE,,Iridaceae,Sisyrinchium,Japan,Japan,,Kashima-gun Hasakimachi,,Ibaraki,Eastern Asia,Japan,,,,,,,,,10,,,http://data.gbif.org/occurrences/381842957,http://data.gbif.org/ws/rest/occurrence/get?key=381842957
"National Museum of Nature and Science, Japan","Herbarium Specimens of Tokushima Prefectural Museum, Japan",,,,,,,TKPM,B,SP141219,Specimen,,23:45.0,,,Sisyrinchium graminoides Bickn.,Bickn.,Sisyrinchium graminoides Bickn.,Plantae,Angiospermae,Monocotyledoneae,Angiospermae,Iridaceae,Sisyrinchium,Japan,Japan,,Otsuki-cho,,Kouchi Pref.,Eastern Asia,Japan,,,,,,,,,,,,http://data.gbif.org/occurrences/150149357,http://data.gbif.org/ws/rest/occurrence/get?key=150149357
"National Museum of Nature and Science, Japan","Herbarium Specimens of Tokushima Prefectural Museum, Japan",,,,,,,TKPM,TKPM-B,SP127218,Specimen,,23:43.0,,,Sisyrinchium graminoides Bickn.,Bickn.,Sisyrinchium graminoides Bickn.,Plantae,Angiospermae,Monocotyledoneae,Liliiflorae,Iridaceae,Sisyrinchium,Japan,Japan,"Kitagawa-mura, Aki-gun",Kitagawa-mura,,Kochi,Eastern Asia,Japan,33.544,134.292,,44594,52,,,,,,,http://data.gbif.org/occurrences/43222960,http://data.gbif.org/ws/rest/occurrence/get?key=43222960
"National Museum of Nature and Science, Japan","Herbarium Specimens of Tokushima Prefectural Museum, Japan",,,,,,,TKPM,TKPM-B,SP121658,Specimen,,23:41.0,,,Sisyrinchium graminoides Bickn.,Bickn.,Sisyrinchium graminoides Bickn.,Plantae,Angiospermae,Monocotyledoneae,Liliiflorae,Iridaceae,Sisyrinchium,Japan,Japan,"Matsushige-cho, Itano-gun",Matsushige-cho,,Tokushima,Eastern Asia,Japan,34.1381,134.578,,44954,15,,,,,,,http://data.gbif.org/occurrences/43222241,http://data.gbif.org/ws/rest/occurrence/get?key=43222241
"National Museum of Nature and Science, Japan","Herbarium Specimens of Tokushima Prefectural Museum, Japan",,,,,,,TKPM,B,SP141215,Specimen,,23:45.0,,,Sisyrinchium graminoides Bickn.,Bickn.,Sisyrinchium graminoides Bickn.,Plantae,Angiospermae,Monocotyledoneae,Angiospermae,Iridaceae,Sisyrinchium,Japan,Japan,,Tokushima City,,Tokushima Pref.,Eastern Asia,Japan,,,,,,,,,,,,http://data.gbif.org/occurrences/150149354,http://data.gbif.org/ws/rest/occurrence/get?key=150149354
"National Museum of Nature and Science, Japan","Herbarium Specimens of Tokushima Prefectural Museum, Japan",,,,,,,TKPM,B,SP037823,Specimen,,23:43.0,,,Sisyrinchium graminoides Bickn.,Bickn.,Sisyrinchium graminoides Bickn.,Plantae,Angiospermae,Monocotyledoneae,Angiospermae,Iridaceae,Sisyrinchium,Japan,Japan,,Ishii-cho,,Tokushima Pref.,Eastern Asia,Japan,,,,,,,,,,,,http://data.gbif.org/occurrences/150149051,http://data.gbif.org/ws/rest/occurrence/get?key=150149051
"National Museum of Nature and Science, Japan","Herbarium Specimens of Tokushima Prefectural Museum, Japan",,,,,,,TKPM,B,SP141213,Specimen,,23:45.0,,,Sisyrinchium graminoides Bickn.,Bickn.,Sisyrinchium graminoides Bickn.,Plantae,Angiospermae,Monocotyledoneae,Angiospermae,Iridaceae,Sisyrinchium,Japan,Japan,,Tokushima City,,Tokushima Pref.,Eastern Asia,Japan,,,,,,,,,,,,http://data.gbif.org/occurrences/150149352,http://data.gbif.org/ws/rest/occurrence/get?key=150149352
"National Museum of Nature and Science, Japan","Herbarium Specimens of Tokushima Prefectural Museum, Japan",,,,,,,TKPM,TKPM-B,SP121791,Specimen,,23:41.0,,,Sisyrinchium graminoides Bickn.,Bickn.,Sisyrinchium graminoides Bickn.,Plantae,Angiospermae,Monocotyledoneae,Liliiflorae,Iridaceae,Sisyrinchium,Japan,Japan,Naruto City,Naruto City,,Tokushima,Eastern Asia,Japan,34.1548,134.618,,44954,16,,,,,,,http://data.gbif.org/occurrences/43222260,http://data.gbif.org/ws/rest/occurrence/get?key=43222260
"National Museum of Nature and Science, Japan","Herbarium Specimens of Tokushima Prefectural Museum, Japan",,,,,,,TKPM,TKPM-B,SP121660,Specimen,,23:41.0,,,Sisyrinchium graminoides Bickn.,Bickn.,Sisyrinchium graminoides Bickn.,Plantae,Angiospermae,Monocotyledoneae,Liliiflorae,Iridaceae,Sisyrinchium,Japan,Japan,Tokushima City,Tokushima City,,Tokushima,Eastern Asia,Japan,34.1026,134.579,,44954,15,,,,,,,http://data.gbif.org/occurrences/43222243,http://data.gbif.org/ws/rest/occurrence/get?key=43222243
"National Museum of Nature and Science, Japan","Herbarium Specimens of Tokushima Prefectural Museum, Japan",,,,,,,TKPM,B,SP141212,Specimen,,23:45.0,,,Sisyrinchium graminoides Bickn.,Bickn.,Sisyrinchium graminoides Bickn.,Plantae,Angiospermae,Monocotyledoneae,Angiospermae,Iridaceae,Sisyrinchium,Japan,Japan,,Tokushima City,,Tokushima Pref.,Eastern Asia,Japan,,,,,,,,,,,,http://data.gbif.org/occurrences/150149351,http://data.gbif.org/ws/rest/occurrence/get?key=150149351
"National Museum of Nature and Science, Japan","Herbarium Specimens of Tokushima Prefectural Museum, Japan",,,,,,,TKPM,B,SP141214,Specimen,,23:45.0,,,Sisyrinchium graminoides Bickn.,Bickn.,Sisyrinchium graminoides Bickn.,Plantae,Angiospermae,Monocotyledoneae,Angiospermae,Iridaceae,Sisyrinchium,Japan,Japan,,Tokushima City,,Tokushima Pref.,Eastern Asia,Japan,,,,,,,,,,,,http://data.gbif.org/occurrences/150149353,http://data.gbif.org/ws/rest/occurrence/get?key=150149353
"National Museum of Nature and Science, Japan","Herbarium Specimens of Museum of Nature and Human Activities, Hyogo Prefecture, Japan",,,,,,,HYO,HYO-C,C1-200079,Specimen,,29:04.0,,,Sisyrinchium graminoides Bickn.,Bickn.,Sisyrinchium graminoides Bickn.,Plantae,,,,Iridaceae,Sisyrinchium,Japan,Japan,"Fukusimaooike, Fukushima, Sanda City.",,,Hyogo,Eastern Asia,Japan,,,,,,,,,,,,http://data.gbif.org/occurrences/177383440,http://data.gbif.org/ws/rest/occurrence/get?key=177383440
"National Museum of Nature and Science, Japan",Plant Specimens of Kurashiki Museum of Natural History,,,,,,,KURA,KURA,39876,Specimen,,18:45.0,,,Sisyrinchium graminoides Bickn.,,Sisyrinchium graminoides Bickn.,Plantae,,,Liliiflorae,Iridaceae,Sisyrinchium,Japan,Japan,Gion,Okayama City,,Okayama Prefecture,Eastern Asia,Japan,,,,,,,,,,,,http://data.gbif.org/occurrences/148847549,http://data.gbif.org/ws/rest/occurrence/get?key=148847549
"National Museum of Nature and Science, Japan","Plant specimens depodited in Osaka Museum of Natural History, Japan.",,,,,,,OSA,C,OSA38891,Specimen,,24:26.0,,,Sisyrinchium graminoides Bickn.,Bickn.,Sisyrinchium graminoides Bickn.,Plantae,,,,Iridaceae,Sisyrinchium,Japan,Japan,,Osaka-shi,,Osaka Prefecture,Eastern Asia,Japan,,,,,,,,,,,,http://data.gbif.org/occurrences/295171467,http://data.gbif.org/ws/rest/occurrence/get?key=295171467
"National Museum of Nature and Science, Japan","Plant specimens depodited in Osaka Museum of Natural History, Japan.",,,,,,,OSA,C,OSA72618,Specimen,,24:27.0,,,Sisyrinchium graminoides Bickn.,,Sisyrinchium graminoides Bickn.,Plantae,,,,Iridaceae,Sisyrinchium,Japan,Japan,Amamo-cho,Kawachinagano-shi,,Osaka,Eastern Asia,Japan,,,,,,,,,,,,http://data.gbif.org/occurrences/295171741,http://data.gbif.org/ws/rest/occurrence/get?key=295171741
"National Museum of Nature and Science, Japan","Plant specimens depodited in Osaka Museum of Natural History, Japan.",,,,,,,OSA,C,OSA72617,Specimen,,24:27.0,,,Sisyrinchium graminoides Bickn.,,Sisyrinchium graminoides Bickn.,Plantae,,,,Iridaceae,Sisyrinchium,Japan,Japan,Amamo-cho,Kawachinagano-shi,,Osaka,Eastern Asia,Japan,,,,,,,,,,,,http://data.gbif.org/occurrences/295171740,http://data.gbif.org/ws/rest/occurrence/get?key=295171740
"National Museum of Nature and Science, Japan","Ibaraki Nature Museum, Vascular Plants collection",,,,,,,INM,Va,22025,Specimen,,54:12.0,,,Sisyrinchium graminoides Bicknell,Bicknell,Sisyrinchium graminoides Bicknell,Plantae,ANGIOSPERMAE,MONOCOTYLEDONEAE,,IRIDACEAE,Sisyrinchium,Japan,Japan,,Itako-shi,,Ibaraki,Eastern Asia,Japan,,,,,,,,,1,,,http://data.gbif.org/occurrences/381843073,http://data.gbif.org/ws/rest/occurrence/get?key=381843073
"National Museum of Nature and Science, Japan","Ibaraki Nature Museum, Vascular Plants collection",,,,,,,INM,Va,22024,Specimen,,54:12.0,,,Sisyrinchium graminoides Bicknell,Bicknell,Sisyrinchium graminoides Bicknell,Plantae,ANGIOSPERMAE,MONOCOTYLEDONEAE,,IRIDACEAE,Sisyrinchium,Japan,Japan,,Itako-shi,,Ibaraki,Eastern Asia,Japan,,,,,,,,,1,,,http://data.gbif.org/occurrences/381843072,http://data.gbif.org/ws/rest/occurrence/get?key=381843072
"National Museum of Nature and Science, Japan","Ibaraki Nature Museum, Vascular Plants collection",,,,,,,INM,Va,22026,Specimen,,54:12.0,,,Sisyrinchium graminoides Bicknell,Bicknell,Sisyrinchium graminoides Bicknell,Plantae,ANGIOSPERMAE,MONOCOTYLEDONEAE,,IRIDACEAE,Sisyrinchium,Japan,Japan,,Itako-shi,,Ibaraki,Eastern Asia,Japan,,,,,,,,,1,,,http://data.gbif.org/occurrences/381843074,http://data.gbif.org/ws/rest/occurrence/get?key=381843074
"National Museum of Nature and Science, Japan","Vascular Plant Collection of Natural History Museum and Institute, Chiba",,,,,,,CBM,BS,38972,Specimen,,58:43.0,,,Sisyrinchium graminoides Bicknell,Bicknell,Sisyrinchium graminoides Bicknell,Plantae,Angiospermae,Monocotyledoneae,Liliiflorae,Iridaceae,Sisyrinchium,Japan,Japan,Yuushu-dai,Ichihara-shi,,Chiba,Eastern Asia,Japan,,,,,,,,,,,,http://data.gbif.org/occurrences/624042564,http://data.gbif.org/ws/rest/occurrence/get?key=624042564
"National Museum of Nature and Science, Japan","Vascular Plant Collection of Natural History Museum and Institute, Chiba",,,,,,,CBM,BS,35903,Specimen,,58:41.0,,,Sisyrinchium graminoides Bicknell,Bicknell,Sisyrinchium graminoides Bicknell,Plantae,Angiospermae,Monocotyledoneae,Liliiflorae,Iridaceae,Sisyrinchium,Japan,Japan,Goi,Ichihara-shi,,Chiba,Eastern Asia,Japan,,,,,,,,,,,,http://data.gbif.org/occurrences/624042256,http://data.gbif.org/ws/rest/occurrence/get?key=624042256
"National Museum of Nature and Science, Japan","Vascular Plant Collection of Natural History Museum and Institute, Chiba",,,,,,,CBM,BS,36220,Specimen,,58:41.0,,,Sisyrinchium graminoides Bicknell,Bicknell,Sisyrinchium graminoides Bicknell,Plantae,Angiospermae,Monocotyledoneae,Liliiflorae,Iridaceae,Sisyrinchium,Japan,Japan,Goi,Ichihara-shi,,Chiba,Eastern Asia,Japan,,,,,,,,,,,,http://data.gbif.org/occurrences/624042257,http://data.gbif.org/ws/rest/occurrence/get?key=624042257
"National Museum of Nature and Science, Japan","Vascular Plant Collection of Natural History Museum and Institute, Chiba",,,,,,,CBM,BS,38929,Specimen,,58:43.0,,,Sisyrinchium graminoides Bicknell,Bicknell,Sisyrinchium graminoides Bicknell,Plantae,Angiospermae,Monocotyledoneae,Liliiflorae,Iridaceae,Sisyrinchium,Japan,Japan,Kikuma near Kikuma Junior High-School,Ichihara-shi,,Chiba,Eastern Asia,Japan,,,,,,,,,,,,http://data.gbif.org/occurrences/624042563,http://data.gbif.org/ws/rest/occurrence/get?key=624042563
"National Museum of Nature and Science, Japan","Vascular Plant Collection of Natural History Museum and Institute, Chiba",,,,,,,CBM,BS,37769,Specimen,,58:43.0,,,Sisyrinchium graminoides Bicknell,Bicknell,Sisyrinchium graminoides Bicknell,Plantae,Angiospermae,Monocotyledoneae,Liliiflorae,Iridaceae,Sisyrinchium,Japan,Japan,Chihara-dai,Ichihara-shi,,Chiba,Eastern Asia,Japan,,,,,,,,,,,,http://data.gbif.org/occurrences/624042562,http://data.gbif.org/ws/rest/occurrence/get?key=624042562
"National Museum of Nature and Science, Japan","FKSE-Herbarium specimens of Faculty of Symbiotic Systems Science, Fukushima University, Japan",,,,,,,FKSE,Plant,7455,Specimen,,53:33.0,,,Sisyrinchium graminoides E.P.Bicknell,E.P.Bicknell,Sisyrinchium graminoides E.P.Bicknell,Plantae,,,,IRIDACEAE,Sisyrinchium,Japan,Japan,"Cultivated; Origin: Japan, Hokkaido, Saroma-machi",,,,Eastern Asia,Japan,,,,,,,,,,,,http://data.gbif.org/occurrences/238100024,http://data.gbif.org/ws/rest/occurrence/get?key=238100024
