Data Publisher,Dataset,Dataset Rights,Collector name,Collector number,Field number,GUID,Date collected,Institution code,Collection code,Catalogue number,Basis of record,Image url,Last indexed,Identifier,Identification date,Scientific name,Author,Scientific name (interpreted),Kingdom,Phylum,Class,Order,Family,Genus,Country,Country (interpreted),Locality,County,Continent or Ocean,State/Province,Region,Publisher country,Latitude,Longitude,Coordinate precision,Cell id,Centi cell id,Min depth,Max depth,Max depth,Min altitude,Max altitude,Altitude precision,GBIF portal url,GBIF webservice url
"National Museum of Nature and Science, Japan","Herbarium Specimens of Tokushima Prefectural Museum, Japan",,,,,,,TKPM,B,SP046692,Specimen,,22:21.0,,,Corydalis incisa (Thunb.) Pers.  f. pallescens Makino,(Thunb.) Pers.,Corydalis incisa f. pallescens Makino,Plantae,,,,Fumariaceae,Corydalis,Japan,Japan,,Kamiyama-cho,,Tokushima Pref.,Eastern Asia,Japan,,,,,,,,,,,,http://data.gbif.org/occurrences/150132394,http://data.gbif.org/ws/rest/occurrence/get?key=150132394
"National Museum of Nature and Science, Japan","Herbarium Specimens of Tokushima Prefectural Museum, Japan",,,,,,,TKPM,B,SP007148,Specimen,,22:20.0,,,Corydalis incisa (Thunb.) Pers.  f. pallescens Makino,(Thunb.) Pers.,Corydalis incisa f. pallescens Makino,Plantae,,,,Fumariaceae,Corydalis,Japan,Japan,,Kamiyama-cho,,Tokushima Pref.,Eastern Asia,Japan,,,,,,,,,,,,http://data.gbif.org/occurrences/150132078,http://data.gbif.org/ws/rest/occurrence/get?key=150132078
"National Museum of Nature and Science, Japan","Herbarium Specimens of Tokushima Prefectural Museum, Japan",,,,,,,TKPM,B,SP040675,Specimen,,22:21.0,,,Corydalis incisa (Thunb.) Pers.  f. pallescens Makino,(Thunb.) Pers.,Corydalis incisa f. pallescens Makino,Plantae,,,,Fumariaceae,Corydalis,Japan,Japan,,Kamiyama-cho,,Tokushima Pref.,Eastern Asia,Japan,,,,,,,,,,,,http://data.gbif.org/occurrences/150132324,http://data.gbif.org/ws/rest/occurrence/get?key=150132324
"National Museum of Nature and Science, Japan","Herbarium Specimens of Tokushima Prefectural Museum, Japan",,,,,,,TKPM,B,SP031659,Specimen,,22:21.0,,,Corydalis incisa (Thunb.) Pers.  f. pallescens Makino,(Thunb.) Pers.,Corydalis incisa f. pallescens Makino,Plantae,,,,Fumariaceae,Corydalis,Japan,Japan,,Kamiyama-cho,,Tokushima Pref.,Eastern Asia,Japan,,,,,,,,,,,,http://data.gbif.org/occurrences/150132269,http://data.gbif.org/ws/rest/occurrence/get?key=150132269
"National Museum of Nature and Science, Japan",Plant Specimens of Kurashiki Museum of Natural History,,,,,,,KURA,KURA,60516,Specimen,,13:26.0,,,Corydalis incisa (Thunb.) Pers. f. pallescens Mak.,(Thunb.) Pers.,Corydalis incisa f. pallescens Mak.,Plantae,,,Papaverales,Papaveraceae,Corydalis,Japan,Japan,,Niimi-shi,,Okayama,Eastern Asia,Japan,,,,,,,,,,,,http://data.gbif.org/occurrences/395751645,http://data.gbif.org/ws/rest/occurrence/get?key=395751645
"National Museum of Nature and Science, Japan",Plant Specimens of Kurashiki Museum of Natural History,,,,,,,KURA,KURA,110665,Specimen,,13:27.0,,,Corydalis incisa (Thunb.) Pers. f. pallescens Mak.,(Thunb.) Pers.,Corydalis incisa f. pallescens Mak.,Plantae,,,Papaverales,Papaveraceae,Corydalis,Japan,Japan,,Nagi-cho,,Okayama,Eastern Asia,Japan,,,,,,,,,,,,http://data.gbif.org/occurrences/395751813,http://data.gbif.org/ws/rest/occurrence/get?key=395751813
"National Museum of Nature and Science, Japan",Plant Specimens of Kurashiki Museum of Natural History,,,,,,,KURA,KURA,105402,Specimen,,13:27.0,,,Corydalis incisa (Thunb.) Pers. f. pallescens Mak.,(Thunb.) Pers.,Corydalis incisa f. pallescens Mak.,Plantae,,,Papaverales,Papaveraceae,Corydalis,Japan,Japan,,Oosa-cho,,Okayama,Eastern Asia,Japan,,,,,,,,,,,,http://data.gbif.org/occurrences/395751797,http://data.gbif.org/ws/rest/occurrence/get?key=395751797
"National Museum of Nature and Science, Japan",Plant Specimens of Kurashiki Museum of Natural History,,,,,,,KURA,KURA,kt25775,Specimen,,13:25.0,,,Corydalis incisa (Thunb.) Pers. f. pallescens Mak.,(Thunb.) Pers.,Corydalis incisa f. pallescens Mak.,Plantae,,,Papaverales,Papaveraceae,Corydalis,Japan,Japan,,Bitchu-cho,,Okayama,Eastern Asia,Japan,,,,,,,,,,,,http://data.gbif.org/occurrences/204268732,http://data.gbif.org/ws/rest/occurrence/get?key=204268732
"National Museum of Nature and Science, Japan",Plant Specimens of Kurashiki Museum of Natural History,,,,,,,KURA,KURA,120321,Specimen,,13:27.0,,,Corydalis incisa (Thunb.) Pers. f. pallescens Mak.,(Thunb.) Pers.,Corydalis incisa f. pallescens Mak.,Plantae,,,Papaverales,Papaveraceae,Corydalis,Japan,Japan,,Shoboku-cho,,Okayama,Eastern Asia,Japan,,,,,,,,,,,,http://data.gbif.org/occurrences/395751835,http://data.gbif.org/ws/rest/occurrence/get?key=395751835
"National Museum of Nature and Science, Japan","Plant specimens depodited in Osaka Museum of Natural History, Japan.",,,,,,,OSA,C,OSA36183,Specimen,,17:43.0,,,Corydalis incisa (Thunb.) Pers. f. pallescens Mak.,(Thunb.) Pers.,Corydalis incisa f. pallescens Mak.,Plantae,,,,Fumariaceae,Corydalis,Japan,Japan,,Yoshida-gun Eiheijicho,,Fukui Prefecture,Eastern Asia,Japan,,,,,,,,,,,,http://data.gbif.org/occurrences/295122064,http://data.gbif.org/ws/rest/occurrence/get?key=295122064
"National Museum of Nature and Science, Japan","Plant specimens depodited in Osaka Museum of Natural History, Japan.",,,,,,,OSA,C,OSA48402,Specimen,,17:44.0,,,Corydalis incisa (Thunb.) Pers. f. pallescens Mak.,(Thunb.) Pers.,Corydalis incisa f. pallescens Mak.,Plantae,,,,Fumariaceae,Corydalis,Japan,Japan,Mt. Yagasaki-yama,Kita-Saku-gun Karuizawa-cho,,Nagano Prefecture,Eastern Asia,Japan,,,,,,,,,,,,http://data.gbif.org/occurrences/295122157,http://data.gbif.org/ws/rest/occurrence/get?key=295122157
"National Museum of Nature and Science, Japan",Angiospermatatophytina Collection of Saitama Museum of Natural History,,,,,,,SMNH,As,8814,Specimen,,52:33.0,,,Corydalis incisa (Thunb.) Pers. f. pallescens Makino,Makino,Corydalis incisa f. pallescens Makino,Plantae,Angiospermae,Dicotyledoneae,Papaverales,Papaveraceae,Corydalis,Japan,Japan,Urayama,Chichibu-shi,,Saitama,Eastern Asia,Japan,,,,,,,,,,,,http://data.gbif.org/occurrences/393095819,http://data.gbif.org/ws/rest/occurrence/get?key=393095819
"National Museum of Nature and Science, Japan",Angiospermatatophytina Collection of Saitama Museum of Natural History,,,,,,,SMNH,As,8812,Specimen,,52:33.0,,,Corydalis incisa (Thunb.) Pers. f. pallescens Makino,Makino,Corydalis incisa f. pallescens Makino,Plantae,Angiospermae,Dicotyledoneae,Papaverales,Papaveraceae,Corydalis,Japan,Japan,Kawauradani,Chichibu-gun Arakawamura,,Saitama,Eastern Asia,Japan,,,,,,,,,,,,http://data.gbif.org/occurrences/393095817,http://data.gbif.org/ws/rest/occurrence/get?key=393095817
"National Museum of Nature and Science, Japan",Angiospermatatophytina Collection of Saitama Museum of Natural History,,,,,,,SMNH,As,8813,Specimen,,52:33.0,,,Corydalis incisa (Thunb.) Pers. f. pallescens Makino,Makino,Corydalis incisa f. pallescens Makino,Plantae,Angiospermae,Dicotyledoneae,Papaverales,Papaveraceae,Corydalis,Japan,Japan,Kawauradani,Chichibu-gun Arakawamura,,Saitama,Eastern Asia,Japan,,,,,,,,,,,,http://data.gbif.org/occurrences/393095818,http://data.gbif.org/ws/rest/occurrence/get?key=393095818
"National Institute of Genetics, ROIS","Plant Specimen Database of Tama Forest Science Garden, Forestry and Forest Products Research Institute, Japan",,,,,,,FFPRI,TFA,8712,Specimen,,21:44.0,,,Corydalis incisa (Thunb.) Pers. f. pallescens Makino,,Corydalis incisa f. pallescens Makino,Plantae,Magnoliophyta,Magnoliopsida,Papaverales,Papaveraceae,Colydalis,Japan,Japan,,Hutyu City,,Tokyo Prefecture,Eastern Asia,Japan,35.6689,139.4776,,45319,64,,,,,,,http://data.gbif.org/occurrences/360252014,http://data.gbif.org/ws/rest/occurrence/get?key=360252014
"National Museum of Nature and Science, Japan",Vascular Plants Collection of Sagamihara City Museum,,,,,,,JSCM,VS,10649,Specimen,,42:33.0,,,Corydalis incisa (Thunb.) Pers. form. pallescens Makino,(Thunb.) Pers,Corydalis incisa f. pallescens Makino,Plantae,Spermatophyta,,,PAPAVERACEAE,Corydalis,Japan,Japan,,Sagamihara-shi,,Kanagawa,Eastern Asia,Japan,,,,,,,,,,,,http://data.gbif.org/occurrences/351215709,http://data.gbif.org/ws/rest/occurrence/get?key=351215709
"National Museum of Nature and Science, Japan",Vascular Plants Collection of Sagamihara City Museum,,,,,,,JSCM,VS,23402,Specimen,,42:35.0,,,Corydalis incisa (Thunb.) Pers. form. pallescens Makino,(Thunb.) Pers.,Corydalis incisa f. pallescens Makino,Plantae,Spermatophyta,,,PAPAVERACEAE,Corydalis,Japan,Japan,"between Akama and Tsukiyomi shrine, chigira, Sagamiko-cho, Sagamihara City, Kanagawa Oref. Japan",Tsukui-gun Sagamikomachi,,Kanagawa,Eastern Asia,Japan,,,,,,,,,,,,http://data.gbif.org/occurrences/351216202,http://data.gbif.org/ws/rest/occurrence/get?key=351216202
"National Museum of Nature and Science, Japan",Vascular Plants Collection of Sagamihara City Museum,,,,,,,JSCM,VS,21750,Specimen,,42:34.0,,,Corydalis incisa (Thunb.) Pers. form. pallescens Makino,(Thunb.) Pers.,Corydalis incisa f. pallescens Makino,Plantae,Spermatophyta,,,PAPAVERACEAE,Corydalis,Japan,Japan,"Tama village,Tokyo",Tama-shi,,Tokyo,Eastern Asia,Japan,,,,,,,,,,,,http://data.gbif.org/occurrences/351216125,http://data.gbif.org/ws/rest/occurrence/get?key=351216125
"National Museum of Nature and Science, Japan",Vascular Plants Collection of Sagamihara City Museum,,,,,,,JSCM,VS,19936,Specimen,,42:34.0,,,Corydalis incisa (Thunb.) Pers. form. pallescens Makino,(Thunb.) Pers.,Corydalis incisa f. pallescens Makino,Plantae,Spermatophyta,,,PAPAVERACEAE,Corydalis,Japan,Japan,,Ome-shi,,Tokyo,Eastern Asia,Japan,,,,,,,,,,,,http://data.gbif.org/occurrences/351216043,http://data.gbif.org/ws/rest/occurrence/get?key=351216043
"National Museum of Nature and Science, Japan",Vascular Plants Collection of Sagamihara City Museum,,,,,,,JSCM,VS,23858,Specimen,,42:35.0,,,Corydalis incisa (Thunb.) Pers. form. pallescens Makino,(Thunb.) Pers.,Corydalis incisa f. pallescens Makino,Plantae,Spermatophyta,,,PAPAVERACEAE,Corydalis,Japan,Japan,"Sawai, Fujino cho, Sagamihara city, Kanagawa Pref.",Tsukui-gun Fujinomachi,,Kanagawa,Eastern Asia,Japan,,,,,,,,,,,,http://data.gbif.org/occurrences/351216222,http://data.gbif.org/ws/rest/occurrence/get?key=351216222
"National Museum of Nature and Science, Japan",Vascular Plants Collection of Sagamihara City Museum,,,,,,,JSCM,VS,27359,Specimen,,42:35.0,,,Corydalis incisa (Thunb.) Pers. form. pallescens Makino,(Thunb.) Pers.,Corydalis incisa f. pallescens Makino,Plantae,Spermatophyta,,,PAPAVERACEAE,Corydalis,Japan,Japan,"Tori , Sanogawa, Fujino Town, Sagamihara City, Kanagawa Pref.",Sagamihara-shi,,Kanagawa,Eastern Asia,Japan,,,,,,,,,560,,,http://data.gbif.org/occurrences/351216350,http://data.gbif.org/ws/rest/occurrence/get?key=351216350
"National Museum of Nature and Science, Japan",Vascular Plants Collection of Sagamihara City Museum,,,,,,,JSCM,VS,15926,Specimen,,42:33.0,,,Corydalis incisa (Thunb.) Pers. form. pallescens Makino,(Thunb.) Pers.,Corydalis incisa f. pallescens Makino,Plantae,Spermatophyta,,,PAPAVERACEAE,Corydalis,Japan,Japan,,Sagamihara-shi,,Kanagawa,Eastern Asia,Japan,,,,,,,,,,,,http://data.gbif.org/occurrences/351215878,http://data.gbif.org/ws/rest/occurrence/get?key=351215878
"National Museum of Nature and Science, Japan",Vascular Plants Collection of Sagamihara City Museum,,,,,,,JSCM,VS,21618,Specimen,,42:34.0,,,Corydalis incisa (Thunb.) Pers. form. pallescens Makino,(Thunb.) Pers.,Corydalis incisa f. pallescens Makino,Plantae,Spermatophyta,,,PAPAVERACEAE,Corydalis,Japan,Japan,"Ura-Takao,Hachioji city, Tokyo",Hachioji-shi,,Tokyo,Eastern Asia,Japan,,,,,,,,,,,,http://data.gbif.org/occurrences/351216120,http://data.gbif.org/ws/rest/occurrence/get?key=351216120
"National Museum of Nature and Science, Japan",Vascular Plants Collection of Sagamihara City Museum,,,,,,,JSCM,VS,24679,Specimen,,42:35.0,,,Corydalis incisa (Thunb.) Pers. form. pallescens Makino,(Thunb.) Pers.,Corydalis incisa f. pallescens Makino,Plantae,Spermatophyta,,,PAPAVERACEAE,Corydalis,Japan,Japan,"Yose, Sagamiko Town, Sagamihara City, Kanagawa Pref.",Sagamihara-shi,,Kanagawa,Eastern Asia,Japan,,,,,,,,,370,,,http://data.gbif.org/occurrences/351216249,http://data.gbif.org/ws/rest/occurrence/get?key=351216249
"National Museum of Nature and Science, Japan",Vascular Plants Collection of Sagamihara City Museum,,,,,,,JSCM,VS,34765,Specimen,,42:36.0,,,Corydalis incisa (Thunb.) Pers. form. pallescens Makino,(Thunb.) Pers.,Corydalis incisa f. pallescens Makino,Plantae,Spermatophyta,,,PAPAVERACEAE,Corydalis,Japan,Japan,"Minami-zawa, Suwarashi, Sagamiko-chou, Sagamihara City, Kanagawa Pref.",Sagamihara-shi,,Kanagawa,Eastern Asia,Japan,,,,,,,,,180,,,http://data.gbif.org/occurrences/387670679,http://data.gbif.org/ws/rest/occurrence/get?key=387670679
"National Museum of Nature and Science, Japan",Vascular Plants Collection of Sagamihara City Museum,,,,,,,JSCM,VS,21676,Specimen,,42:34.0,,,Corydalis incisa (Thunb.) Pers. form. pallescens Makino,(Thunb.) Pers.,Corydalis incisa f. pallescens Makino,Plantae,Spermatophyta,,,PAPAVERACEAE,Corydalis,Japan,Japan,"Kushikawa,Tsukui cho,Sagamihara city Kanagawa pref.",Tsukui-gun Tsukuimachi,,Kanagawa,Eastern Asia,Japan,,,,,,,,,,,,http://data.gbif.org/occurrences/351216122,http://data.gbif.org/ws/rest/occurrence/get?key=351216122
"National Museum of Nature and Science, Japan",Vascular Plants Collection of Sagamihara City Museum,,,,,,,JSCM,VS,35651,Specimen,,42:36.0,,,Corydalis incisa (Thunb.) Pers. form. pallescens Makino,(Thunb.) Pers.,Corydalis incisa f. pallescens Makino,Plantae,Spermatophyta,,,PAPAVERACEAE,Corydalis,Japan,Japan,"Nade, Tsukui-chou, Sagamihara City, Kanagawa Pref.",Sagamihara-shi,,Kanagawa,Eastern Asia,Japan,,,,,,,,,200,,,http://data.gbif.org/occurrences/387670706,http://data.gbif.org/ws/rest/occurrence/get?key=387670706
"National Museum of Nature and Science, Japan",Vascular Plant Specimen Database of Kanagawa Prefectural Museum of Natural History,,,,,,,KPM,NA,KPM-NA0103849,Specimen,,24:32.0,,,Corydalis incisa (Thunb.) Pers. form. pallescens Makino,,Corydalis incisa f. pallescens Makino,Plantae,Angiospermae,Dicotyledoneae,,PAPAVERACEAE,Corydalis,Japan,Japan,,"Kawasaki-shi,, Kawasaki-ku",,Kanagawa Prefecture,Eastern Asia,Japan,,,,,,,,,,,,http://data.gbif.org/occurrences/388812908,http://data.gbif.org/ws/rest/occurrence/get?key=388812908
"National Museum of Nature and Science, Japan",Vascular Plant Specimen Database of Kanagawa Prefectural Museum of Natural History,,,,,,,KPM,NA,KPM-NA0022015,Specimen,,24:32.0,,,Corydalis incisa (Thunb.) Pers. form. pallescens Makino,,Corydalis incisa f. pallescens Makino,Plantae,Angiospermae,Dicotyledoneae,,PAPAVERACEAE,Corydalis,Japan,Japan,,Hachioji-shi,,Tokyo Metropolis,Eastern Asia,Japan,,,,,,,,,,,,http://data.gbif.org/occurrences/388812751,http://data.gbif.org/ws/rest/occurrence/get?key=388812751
"National Museum of Nature and Science, Japan",Vascular Plant Specimen Database of Kanagawa Prefectural Museum of Natural History,,,,,,,KPM,NA,KPM-NA0117571,Specimen,,24:33.0,,,Corydalis incisa (Thunb.) Pers. form. pallescens Makino,,Corydalis incisa f. pallescens Makino,Plantae,Angiospermae,Dicotyledoneae,,PAPAVERACEAE,Corydalis,Japan,Japan,,"Yokohama-shi, Izumi-ku",,Kanagawa Prefecture,Eastern Asia,Japan,,,,,,,,,,,,http://data.gbif.org/occurrences/388812997,http://data.gbif.org/ws/rest/occurrence/get?key=388812997
"National Museum of Nature and Science, Japan",Vascular Plant Specimen Database of Kanagawa Prefectural Museum of Natural History,,,,,,,KPM,NA,KPM-NA0151314,Specimen,,24:33.0,,,Corydalis incisa (Thunb.) Pers. form. pallescens Makino,,Corydalis incisa f. pallescens Makino,Plantae,Angiospermae,Dicotyledoneae,,PAPAVERACEAE,Corydalis,Japan,Japan,,"Tsukui-gun, Fujino-machi",,Kanagawa Prefecture,Eastern Asia,Japan,,,,,,,,,400,,,http://data.gbif.org/occurrences/388813044,http://data.gbif.org/ws/rest/occurrence/get?key=388813044
"National Museum of Nature and Science, Japan",Vascular Plant Specimen Database of Kanagawa Prefectural Museum of Natural History,,,,,,,KPM,NA,KPM-NA0022014,Specimen,,24:32.0,,,Corydalis incisa (Thunb.) Pers. form. pallescens Makino,,Corydalis incisa f. pallescens Makino,Plantae,Angiospermae,Dicotyledoneae,,PAPAVERACEAE,Corydalis,Japan,Japan,,Hachioji-shi,,Tokyo Metropolis,Eastern Asia,Japan,,,,,,,,,,,,http://data.gbif.org/occurrences/388812750,http://data.gbif.org/ws/rest/occurrence/get?key=388812750
"National Museum of Nature and Science, Japan",Vascular Plant Specimen Database of Kanagawa Prefectural Museum of Natural History,,,,,,,KPM,NA,KPM-NA1040144,Specimen,,24:30.0,,,Corydalis incisa (Thunb.) Pers. form. pallescens Makino,,Corydalis incisa f. pallescens Makino,Plantae,Angiospermae,Dicotyledoneae,,PAPAVERACEAE,Corydalis,Japan,Japan,Wada,"Tsukui-gun, Fujino-machi",,Kanagawa Prefecture,Eastern Asia,Japan,35.6574,139.153,,45319,61,,,,,,,http://data.gbif.org/occurrences/234416862,http://data.gbif.org/ws/rest/occurrence/get?key=234416862
"National Museum of Nature and Science, Japan",Vascular Plant Specimen Database of Kanagawa Prefectural Museum of Natural History,,,,,,,KPM,NA,KPM-NA0022023,Specimen,,24:32.0,,,Corydalis incisa (Thunb.) Pers. form. pallescens Makino,,Corydalis incisa f. pallescens Makino,Plantae,Angiospermae,Dicotyledoneae,,PAPAVERACEAE,Corydalis,Japan,Japan,,Urawa-shi,,Saitama Prefecture,Eastern Asia,Japan,,,,,,,,,,,,http://data.gbif.org/occurrences/388812764,http://data.gbif.org/ws/rest/occurrence/get?key=388812764
"National Museum of Nature and Science, Japan",Vascular Plant Specimen Database of Kanagawa Prefectural Museum of Natural History,,,,,,,KPM,NA,KPM-NA1040145,Specimen,,24:30.0,,,Corydalis incisa (Thunb.) Pers. form. pallescens Makino,,Corydalis incisa f. pallescens Makino,Plantae,Angiospermae,Dicotyledoneae,,PAPAVERACEAE,Corydalis,Japan,Japan,,Yamato-shi,,Kanagawa Prefecture,Eastern Asia,Japan,35.4741,139.441,,45319,44,,,,,,,http://data.gbif.org/occurrences/234416863,http://data.gbif.org/ws/rest/occurrence/get?key=234416863
"National Museum of Nature and Science, Japan",Vascular Plant Specimen Database of Kanagawa Prefectural Museum of Natural History,,,,,,,KPM,NA,KPM-NA1040143,Specimen,,24:30.0,,,Corydalis incisa (Thunb.) Pers. form. pallescens Makino,,Corydalis incisa f. pallescens Makino,Plantae,Angiospermae,Dicotyledoneae,,PAPAVERACEAE,Corydalis,Japan,Japan,Kokubu,Ebina-shi,,Kanagawa Prefecture,Eastern Asia,Japan,35.4574,139.403,,45319,44,,,,,,,http://data.gbif.org/occurrences/234416861,http://data.gbif.org/ws/rest/occurrence/get?key=234416861
