Data Publisher,Dataset,Dataset Rights,Collector name,Collector number,Field number,GUID,Date collected,Institution code,Collection code,Catalogue number,Basis of record,Image url,Last indexed,Identifier,Identification date,Scientific name,Author,Scientific name (interpreted),Kingdom,Phylum,Class,Order,Family,Genus,Country,Country (interpreted),Locality,County,Continent or Ocean,State/Province,Region,Publisher country,Latitude,Longitude,Coordinate precision,Cell id,Centi cell id,Min depth,Max depth,Max depth,Min altitude,Max altitude,Altitude precision,GBIF portal url,GBIF webservice url
"National Museum of Nature and Science, Japan","Gunma Museum of Natural History, Vascular Plant Specimen",,,,,,,GMNHJ,plant,BS0002879,Specimen,,35:59.0,,,Vincetoxicum sublanceolatum (Miq.) Maxim.  var. sublanceolatum,,Vincetoxicum sublanceolatum var. sublanceolatum,Plantae,Spermatophyta,,,Asclepiadaceae,Vincetoxicum,Japan,Japan,Ikahomachi-ikaho,Shibukawa-shi,,Gunma,Eastern Asia,Japan,36.4886,138.918,,45678,49,,,,,,,http://data.gbif.org/occurrences/188210696,http://data.gbif.org/ws/rest/occurrence/get?key=188210696
"National Museum of Nature and Science, Japan","FKSE-Herbarium specimens of Faculty of Symbiotic Systems Science, Fukushima University, Japan",,,,,,,FKSE,Plant,60284,Specimen,,54:00.0,,,Vincetoxicum sublanceolatum (Miq.) Maxim.  var. sublanceolatum,(Miq.) Maxim.,Vincetoxicum sublanceolatum var. sublanceolatum,Plantae,,,,ASCLEPIADACEAE,Vincetoxicum,Japan,Japan,"Kabaniwa, Tachikiriminami.",Sohma-shi,,Fukushima,Eastern Asia,Japan,,,,,,,,,,15,,http://data.gbif.org/occurrences/391301626,http://data.gbif.org/ws/rest/occurrence/get?key=391301626
"National Museum of Nature and Science, Japan","Plant specimens depodited in Osaka Museum of Natural History, Japan.",,,,,,,OSA,C,OSA61879,Specimen,,17:57.0,,,Cynanchum sublanceolatum (Miq.) Matsum. var. obtusulum (F. et S.) Matsum.,(Miq.) Matsum.,Cynanchum sublanceolatum var. obtusulum (F. & S.) Matsum.,Plantae,,,,Asclepiadaceae,Cynanchum,Japan,Japan,Ogura-ike Lake,Kyoto-shi,,Kyoto Prefecture,Eastern Asia,Japan,,,,,,,,,,,,http://data.gbif.org/occurrences/295123880,http://data.gbif.org/ws/rest/occurrence/get?key=295123880
"National Museum of Nature and Science, Japan","Plant specimens depodited in Osaka Museum of Natural History, Japan.",,,,,,,OSA,C,OSA61893,Specimen,,17:57.0,,,Cynanchum sublanceolatum (Miq.) Matsum. var. obtusulum (F. et S.) Matsum.,(Miq.) Matsum.,Cynanchum sublanceolatum var. obtusulum (F. & S.) Matsum.,Plantae,,,,Asclepiadaceae,Cynanchum,Japan,Japan,Along Uji-gawa River,Kyoto-shi,,Kyoto Prefecture,Eastern Asia,Japan,,,,,,,,,,,,http://data.gbif.org/occurrences/295123881,http://data.gbif.org/ws/rest/occurrence/get?key=295123881
"National Museum of Nature and Science, Japan","Plant specimens depodited in Osaka Museum of Natural History, Japan.",,,,,,,OSA,C,OSA46696,Specimen,,17:56.0,,,Cynanchum sublanceolatum (Miq.) Matsum. var. obtusulum (Fr. et Sav.) Matsum.,(Miq.) Matsum.,Cynanchum sublanceolatum var. obtusulum (Fr. & Sav.) Matsum.,Plantae,,,,Asclepiadaceae,Cynanchum,Japan,Japan,Urami-no-taki Fall,Nikko-shi,,Tochigi Prefecture,Eastern Asia,Japan,,,,,,,,,,,,http://data.gbif.org/occurrences/295123754,http://data.gbif.org/ws/rest/occurrence/get?key=295123754
"National Museum of Nature and Science, Japan",Vascular plants database of Atugi City Museum,,,,,,,JACM,PL5669,JACM-PL5669,Specimen,,28:39.0,,,Cynanchum sublanceolatum (Miq.) Matsum. var. obtusulum (Franch. et Savat.) Matsum.,,Cynanchum sublanceolatum var. obtusulum (Franch. & Savat.) Matsum.,Plantae,Angiospermae,,,Asclepiadaceae,Cynanchum,Japan,Japan,,Atsugi-shi,,Kanagawa,Eastern Asia,Japan,,,,,,,,,,,,http://data.gbif.org/occurrences/238031517,http://data.gbif.org/ws/rest/occurrence/get?key=238031517
"National Museum of Nature and Science, Japan",Vascular plants database of Atugi City Museum,,,,,,,JACM,PL4809,JACM-PL4809,Specimen,,28:39.0,,,Cynanchum sublanceolatum (Miq.) Matsum. var. obtusulum (Franch. et Savat.) Matsum.,,Cynanchum sublanceolatum var. obtusulum (Franch. & Savat.) Matsum.,Plantae,Angiospermae,,,Asclepiadaceae,Cynanchum,Japan,Japan,,Atsugi-shi,,Kanagawa,Eastern Asia,Japan,,,,,,,,,,,,http://data.gbif.org/occurrences/238031476,http://data.gbif.org/ws/rest/occurrence/get?key=238031476
"National Museum of Nature and Science, Japan",Vascular plants database of Atugi City Museum,,,,,,,JACM,PL20670,JACM-PL20670,Specimen,,28:41.0,,,Cynanchum sublanceolatum (Miq.) Matsum. var. obtusulum (Franch. et Savat.) Matsum.,,Cynanchum sublanceolatum var. obtusulum (Franch. & Savat.) Matsum.,Plantae,Angiospermae,,,Asclepiadaceae,Cynanchum,Japan,Japan,,Atsugi-shi,,Kanagawa,Eastern Asia,Japan,,,,,,,,,,,,http://data.gbif.org/occurrences/238031970,http://data.gbif.org/ws/rest/occurrence/get?key=238031970
"National Museum of Nature and Science, Japan",Vascular plants database of Atugi City Museum,,,,,,,JACM,PL1366,JACM-PL1366,Specimen,,28:38.0,,,Cynanchum sublanceolatum (Miq.) Matsum. var. obtusulum (Franch. et Savat.) Matsum.,,Cynanchum sublanceolatum var. obtusulum (Franch. & Savat.) Matsum.,Plantae,Angiospermae,,,Asclepiadaceae,Cynanchum,Japan,Japan,,Atsugi-shi,,Kanagawa,Eastern Asia,Japan,,,,,,,,,,,,http://data.gbif.org/occurrences/238031286,http://data.gbif.org/ws/rest/occurrence/get?key=238031286
"National Museum of Nature and Science, Japan",Vascular plants database of Atugi City Museum,,,,,,,JACM,PL901,JACM-PL901,Specimen,,28:38.0,,,Cynanchum sublanceolatum (Miq.) Matsum. var. obtusulum (Franch. et Savat.) Matsum.,,Cynanchum sublanceolatum var. obtusulum (Franch. & Savat.) Matsum.,Plantae,Angiospermae,,,Asclepiadaceae,Cynanchum,Japan,Japan,,Atsugi-shi,,Kanagawa,Eastern Asia,Japan,,,,,,,,,,,,http://data.gbif.org/occurrences/238031273,http://data.gbif.org/ws/rest/occurrence/get?key=238031273
"National Museum of Nature and Science, Japan",Vascular plants database of Atugi City Museum,,,,,,,JACM,PL30683,JACM-PL30683,Specimen,,28:43.0,,,Cynanchum sublanceolatum (Miq.) Matsum. var. obtusulum (Franch. et Savat.) Matsum.,,Cynanchum sublanceolatum var. obtusulum (Franch. & Savat.) Matsum.,Plantae,Angiospermae,,,Asclepiadaceae,Cynanchum,Japan,Japan,,Atsugi-shi,,Kanagawa,Eastern Asia,Japan,,,,,,,,,,,,http://data.gbif.org/occurrences/393751522,http://data.gbif.org/ws/rest/occurrence/get?key=393751522
"National Museum of Nature and Science, Japan",Vascular plants database of Atugi City Museum,,,,,,,JACM,PL17670,JACM-PL17670,Specimen,,28:40.0,,,Cynanchum sublanceolatum (Miq.) Matsum. var. obtusulum (Franch. et Savat.) Matsum.,,Cynanchum sublanceolatum var. obtusulum (Franch. & Savat.) Matsum.,Plantae,Angiospermae,,,Asclepiadaceae,Cynanchum,Japan,Japan,,Atsugi-shi,,Kanagawa,Eastern Asia,Japan,,,,,,,,,,,,http://data.gbif.org/occurrences/238031923,http://data.gbif.org/ws/rest/occurrence/get?key=238031923
"National Museum of Nature and Science, Japan",Vascular plants database of Atugi City Museum,,,,,,,JACM,PL902,JACM-PL902,Specimen,,28:38.0,,,Cynanchum sublanceolatum (Miq.) Matsum. var. obtusulum (Franch. et Savat.) Matsum.,,Cynanchum sublanceolatum var. obtusulum (Franch. & Savat.) Matsum.,Plantae,Angiospermae,,,Asclepiadaceae,Cynanchum,Japan,Japan,,Atsugi-shi,,Kanagawa,Eastern Asia,Japan,,,,,,,,,,,,http://data.gbif.org/occurrences/238031274,http://data.gbif.org/ws/rest/occurrence/get?key=238031274
"National Museum of Nature and Science, Japan",Vascular plants database of Atugi City Museum,,,,,,,JACM,PL20676,JACM-PL20676,Specimen,,28:42.0,,,Cynanchum sublanceolatum (Miq.) Matsum. var. obtusulum (Franch. et Savat.) Matsum.,,Cynanchum sublanceolatum var. obtusulum (Franch. & Savat.) Matsum.,Plantae,Angiospermae,,,Asclepiadaceae,Cynanchum,Japan,Japan,,Zama-shi,,Kanagawa,Eastern Asia,Japan,,,,,,,,,,,,http://data.gbif.org/occurrences/393751357,http://data.gbif.org/ws/rest/occurrence/get?key=393751357
"National Museum of Nature and Science, Japan",Vascular plants database of Atugi City Museum,,,,,,,JACM,PL25191,JACM-PL25191,Specimen,,28:42.0,,,Cynanchum sublanceolatum (Miq.) Matsum. var. obtusulum (Franch. et Savat.) Matsum.,,Cynanchum sublanceolatum var. obtusulum (Franch. & Savat.) Matsum.,Plantae,Angiospermae,,,Asclepiadaceae,Cynanchum,Japan,Japan,,Kiyokawa-mura,,Kanagawa,Eastern Asia,Japan,,,,,,,,,,,,http://data.gbif.org/occurrences/393751392,http://data.gbif.org/ws/rest/occurrence/get?key=393751392
"National Museum of Nature and Science, Japan",Vascular plants database of Atugi City Museum,,,,,,,JACM,PL1365,JACM-PL1365,Specimen,,28:38.0,,,Cynanchum sublanceolatum (Miq.) Matsum. var. obtusulum (Franch. et Savat.) Matsum.,,Cynanchum sublanceolatum var. obtusulum (Franch. & Savat.) Matsum.,Plantae,Angiospermae,,,Asclepiadaceae,Cynanchum,Japan,Japan,,Atsugi-shi,,Kanagawa,Eastern Asia,Japan,,,,,,,,,,,,http://data.gbif.org/occurrences/238031285,http://data.gbif.org/ws/rest/occurrence/get?key=238031285
"National Museum of Nature and Science, Japan",Vascular plants database of Atugi City Museum,,,,,,,JACM,PL8633,JACM-PL8633,Specimen,,28:39.0,,,Cynanchum sublanceolatum (Miq.) Matsum. var. obtusulum (Franch. et Savat.) Matsum.,,Cynanchum sublanceolatum var. obtusulum (Franch. & Savat.) Matsum.,Plantae,Angiospermae,,,Asclepiadaceae,Cynanchum,Japan,Japan,,Atsugi-shi,,Kanagawa,Eastern Asia,Japan,,,,,,,,,,,,http://data.gbif.org/occurrences/238031609,http://data.gbif.org/ws/rest/occurrence/get?key=238031609
"National Museum of Nature and Science, Japan",Vascular plants database of Atugi City Museum,,,,,,,JACM,PL20673,JACM-PL20673,Specimen,,28:41.0,,,Cynanchum sublanceolatum (Miq.) Matsum. var. obtusulum (Franch. et Savat.) Matsum.,,Cynanchum sublanceolatum var. obtusulum (Franch. & Savat.) Matsum.,Plantae,Angiospermae,,,Asclepiadaceae,Cynanchum,Japan,Japan,,Atsugi-shi,,Kanagawa,Eastern Asia,Japan,,,,,,,,,,,,http://data.gbif.org/occurrences/238031971,http://data.gbif.org/ws/rest/occurrence/get?key=238031971
"National Museum of Nature and Science, Japan",Vascular plants database of Atugi City Museum,,,,,,,JACM,PL4896,JACM-PL4896,Specimen,,28:39.0,,,Cynanchum sublanceolatum (Miq.) Matsum. var. obtusulum (Franch. et Savat.) Matsum.,,Cynanchum sublanceolatum var. obtusulum (Franch. & Savat.) Matsum.,Plantae,Angiospermae,,,Asclepiadaceae,Cynanchum,Japan,Japan,,Atsugi-shi,,Kanagawa,Eastern Asia,Japan,,,,,,,,,,,,http://data.gbif.org/occurrences/238031481,http://data.gbif.org/ws/rest/occurrence/get?key=238031481
"National Museum of Nature and Science, Japan","Gunma Museum of Natural History, Vascular Plant Specimen",,,,,,,GMNHJ,Plant,BS0033334,Specimen,,34:39.0,,,Cynanchum sublanceolatum (Miq.) Matsum. var. sublanceolatum,(Miq.) Matsum.,Cynanchum sublanceolatum var. sublanceolatum,Plantae,Spermatophyta,Dicotyledoneae,,Asclepiadaceae,Cynanchum,Japan,Japan,Pond Higashi-numa,Tatebayashi-shi,,Gunma,Eastern Asia,Japan,36.225,139.507,,45679,25,,,,20,20,,http://data.gbif.org/occurrences/234491873,http://data.gbif.org/ws/rest/occurrence/get?key=234491873
"National Museum of Nature and Science, Japan","Gunma Museum of Natural History, Vascular Plant Specimen",,,,,,,GMNHJ,plant,BS0010321,Specimen,,34:41.0,,,Cynanchum sublanceolatum (Miq.) Matsum. var. sublanceolatum,(Miq.) Matsum.,Cynanchum sublanceolatum var. sublanceolatum,Plantae,Spermatophyta,Dicotyledoneae,,Asclepiadaceae,Cynanchum,Japan,Japan,"Otani,Hagyu",Agatsuma-gun Higashiagatsumamachi,,Gunma,Eastern Asia,Japan,,,,,,,,,670,670,,http://data.gbif.org/occurrences/394054344,http://data.gbif.org/ws/rest/occurrence/get?key=394054344
"National Museum of Nature and Science, Japan","Gunma Museum of Natural History, Vascular Plant Specimen",,,,,,,GMNHJ,plant,BS0040497,Specimen,,34:39.0,,,Cynanchum sublanceolatum (Miq.) Matsum. var. sublanceolatum,(Miq.) Matsum.,Cynanchum sublanceolatum var. sublanceolatum,Plantae,Spermatophyta,Dicotyledoneae,,Asclepiadaceae,Cynanchum,Japan,Japan,Yatsuka-yama,Takasaki-shi,,Gunma,Eastern Asia,Japan,36.2206,138.971,,45678,29,,,,,,,http://data.gbif.org/occurrences/295233477,http://data.gbif.org/ws/rest/occurrence/get?key=295233477
"National Museum of Nature and Science, Japan","Gunma Museum of Natural History, Vascular Plant Specimen",,,,,,,GMNHJ,Plant,BS0033418,Specimen,,34:38.0,,,Cynanchum sublanceolatum (Miq.) Matsum. var. sublanceolatum,(Miq.) Matsum.,Cynanchum sublanceolatum var. sublanceolatum,Plantae,Spermatophyta,Dicotyledoneae,,Asclepiadaceae,Cynanchum,Japan,Japan,Mt. Akaguna,,,Gunma,Eastern Asia,Japan,36.1439,138.843,,45678,18,,,,,,,http://data.gbif.org/occurrences/234491703,http://data.gbif.org/ws/rest/occurrence/get?key=234491703
"National Museum of Nature and Science, Japan","Gunma Museum of Natural History, Vascular Plant Specimen",,,,,,,GMNHJ,plant,BS0040137,Specimen,,34:39.0,,,Cynanchum sublanceolatum (Miq.) Matsum. var. sublanceolatum,(Miq.) Matsum.,Cynanchum sublanceolatum var. sublanceolatum,Plantae,Spermatophyta,Dicotyledoneae,,Asclepiadaceae,Cynanchum,Japan,Japan,Shiroyama,Takasaki-shi,,Gunma,Eastern Asia,Japan,36.2206,138.971,,45678,29,,,,,,,http://data.gbif.org/occurrences/295233462,http://data.gbif.org/ws/rest/occurrence/get?key=295233462
"National Museum of Nature and Science, Japan","Gunma Museum of Natural History, Vascular Plant Specimen",,,,,,,GMNHJ,plant,BS0050658,Specimen,,34:39.0,,,Cynanchum sublanceolatum (Miq.) Matsum. var. sublanceolatum,(Miq.) Matsum.,Cynanchum sublanceolatum var. sublanceolatum,Plantae,Spermatophyta,Dicotyledoneae,,Asclepiadaceae,Cynanchum,Japan,Japan,Kannon-yama,Takasaki-shi,,Gunma,Eastern Asia,Japan,36.3119,138.982,,45678,39,,,,,,,http://data.gbif.org/occurrences/295233494,http://data.gbif.org/ws/rest/occurrence/get?key=295233494
"National Museum of Nature and Science, Japan",Vascular Plant Specimen Database of Kanagawa Prefectural Museum of Natural History,,,,,,,KPM,NA,KPM-NA0062965,Specimen,,24:45.0,,,Cynanchum sublanceolatum (Miq.) Matsum. var. sublanceolatum,,Cynanchum sublanceolatum var. sublanceolatum,Plantae,Angiospermae,Dicotyledoneae,,ASCLEPIADACEAE,Cynanchum,Japan,Japan,,Hachioji-shi,,Tokyo Metropolis,Eastern Asia,Japan,,,,,,,,,,,,http://data.gbif.org/occurrences/388814846,http://data.gbif.org/ws/rest/occurrence/get?key=388814846
"National Museum of Nature and Science, Japan",Vascular Plant Specimen Database of Kanagawa Prefectural Museum of Natural History,,,,,,,KPM,NA,KPM-NA0118022,Specimen,,24:45.0,,,Cynanchum sublanceolatum (Miq.) Matsum. var. sublanceolatum,,Cynanchum sublanceolatum var. sublanceolatum,Plantae,Angiospermae,Dicotyledoneae,,ASCLEPIADACEAE,Cynanchum,Japan,Japan,,"Tsukui-gun, Shiroyama-machi",,Kanagawa Prefecture,Eastern Asia,Japan,,,,,,,,,,,,http://data.gbif.org/occurrences/388815046,http://data.gbif.org/ws/rest/occurrence/get?key=388815046
"National Museum of Nature and Science, Japan",Vascular Plant Specimen Database of Kanagawa Prefectural Museum of Natural History,,,,,,,KPM,NA,KPM-NA0126256,Specimen,,24:46.0,,,Cynanchum sublanceolatum (Miq.) Matsum. var. sublanceolatum,,Cynanchum sublanceolatum var. sublanceolatum,Plantae,Angiospermae,Dicotyledoneae,,ASCLEPIADACEAE,Cynanchum,Japan,Japan,,"Tsukui-gun, Fujino-machi",,Kanagawa Prefecture,Eastern Asia,Japan,,,,,,,,,850,,,http://data.gbif.org/occurrences/388815107,http://data.gbif.org/ws/rest/occurrence/get?key=388815107
"National Museum of Nature and Science, Japan",Vascular Plant Specimen Database of Kanagawa Prefectural Museum of Natural History,,,,,,,KPM,NA,KPM-NA0104818,Specimen,,24:45.0,,,Cynanchum sublanceolatum (Miq.) Matsum. var. sublanceolatum,,Cynanchum sublanceolatum var. sublanceolatum,Plantae,Angiospermae,Dicotyledoneae,,ASCLEPIADACEAE,Cynanchum,Japan,Japan,,"Yokohama-shi, Kanazawa-ku",,Kanagawa Prefecture,Eastern Asia,Japan,,,,,,,,,,,,http://data.gbif.org/occurrences/388814944,http://data.gbif.org/ws/rest/occurrence/get?key=388814944
"National Museum of Nature and Science, Japan",Vascular Plant Specimen Database of Kanagawa Prefectural Museum of Natural History,,,,,,,KPM,NA,KPM-NA0001764,Specimen,,24:45.0,,,Cynanchum sublanceolatum (Miq.) Matsum. var. sublanceolatum,,Cynanchum sublanceolatum var. sublanceolatum,Plantae,Angiospermae,Dicotyledoneae,,ASCLEPIADACEAE,Cynanchum,Japan,Japan,,"Awa-gun, Amatsukominato-machi",,Chiba Prefecture,Eastern Asia,Japan,,,,,,,,,,,,http://data.gbif.org/occurrences/388814790,http://data.gbif.org/ws/rest/occurrence/get?key=388814790
"National Museum of Nature and Science, Japan",Vascular Plant Specimen Database of Kanagawa Prefectural Museum of Natural History,,,,,,,KPM,NA,KPM-NA0161311,Specimen,,24:46.0,,,Cynanchum sublanceolatum (Miq.) Matsum. var. sublanceolatum,,Cynanchum sublanceolatum var. sublanceolatum,Plantae,Angiospermae,Dicotyledoneae,,ASCLEPIADACEAE,Cynanchum,Japan,Japan,,"Yokohama-shi, Sakae-ku",,Kanagawa Prefecture,Eastern Asia,Japan,,,,,,,,,,,,http://data.gbif.org/occurrences/388815182,http://data.gbif.org/ws/rest/occurrence/get?key=388815182
"National Museum of Nature and Science, Japan",Vascular Plant Specimen Database of Kanagawa Prefectural Museum of Natural History,,,,,,,KPM,NA,KPM-NA0107520,Specimen,,24:45.0,,,Cynanchum sublanceolatum (Miq.) Matsum. var. sublanceolatum,,Cynanchum sublanceolatum var. sublanceolatum,Plantae,Angiospermae,Dicotyledoneae,,ASCLEPIADACEAE,Cynanchum,Japan,Japan,,"Yokohama-shi, Aoba-ku",,Kanagawa Prefecture,Eastern Asia,Japan,,,,,,,,,,,,http://data.gbif.org/occurrences/388814960,http://data.gbif.org/ws/rest/occurrence/get?key=388814960
"National Museum of Nature and Science, Japan",Vascular Plant Specimen Database of Kanagawa Prefectural Museum of Natural History,,,,,,,KPM,NA,KPM-NA0104817,Specimen,,24:45.0,,,Cynanchum sublanceolatum (Miq.) Matsum. var. sublanceolatum,,Cynanchum sublanceolatum var. sublanceolatum,Plantae,Angiospermae,Dicotyledoneae,,ASCLEPIADACEAE,Cynanchum,Japan,Japan,,"Yokohama-shi, Kanazawa-ku",,Kanagawa Prefecture,Eastern Asia,Japan,,,,,,,,,,,,http://data.gbif.org/occurrences/388814942,http://data.gbif.org/ws/rest/occurrence/get?key=388814942
"National Museum of Nature and Science, Japan",Vascular Plant Specimen Database of Kanagawa Prefectural Museum of Natural History,,,,,,,KPM,NA,KPM-NA0007331,Specimen,,24:45.0,,,Cynanchum sublanceolatum (Miq.) Matsum. var. sublanceolatum,,Cynanchum sublanceolatum var. sublanceolatum,Plantae,Angiospermae,Dicotyledoneae,,ASCLEPIADACEAE,Cynanchum,Japan,Japan,,Mobara-shi,,Chiba Prefecture,Eastern Asia,Japan,,,,,,,,,,,,http://data.gbif.org/occurrences/388814793,http://data.gbif.org/ws/rest/occurrence/get?key=388814793
