Data Publisher,Dataset,Dataset Rights,Collector name,Collector number,Field number,GUID,Date collected,Institution code,Collection code,Catalogue number,Basis of record,Image url,Last indexed,Identifier,Identification date,Scientific name,Author,Scientific name (interpreted),Kingdom,Phylum,Class,Order,Family,Genus,Country,Country (interpreted),Locality,County,Continent or Ocean,State/Province,Region,Publisher country,Latitude,Longitude,Coordinate precision,Cell id,Centi cell id,Min depth,Max depth,Max depth,Min altitude,Max altitude,Altitude precision,GBIF portal url,GBIF webservice url
"National Museum of Nature and Science, Japan","Plant Specimens of Taga Town Museum, Shiga Pref., Japan",,,,,,,TG,TG-B,TG-B-000289,Specimen,,25:13.0,,,Adonis ramosa,,Adonis ramosa,Plantae,SPERMATOPHYTA,DICOTYLEDONEAE,Ranunculales,Ranunculaceae,Adonis,Japan,Japan,,"Inukami-gun, Taga-cho",,Shiga,Eastern Asia,Japan,,,,,,,,,,,,http://data.gbif.org/occurrences/126837062,http://data.gbif.org/ws/rest/occurrence/get?key=126837062
"National Museum of Nature and Science, Japan","Plant Specimens of Taga Town Museum, Shiga Pref., Japan",,,,,,,TG,TG-B,TG-B-000288,Specimen,,25:13.0,,,Adonis ramosa,,Adonis ramosa,Plantae,SPERMATOPHYTA,DICOTYLEDONEAE,Ranunculales,Ranunculaceae,Adonis,Japan,Japan,,"Inukami-gun, Taga-cho",,Shiga,Eastern Asia,Japan,,,,,,,,,,,,http://data.gbif.org/occurrences/126837061,http://data.gbif.org/ws/rest/occurrence/get?key=126837061
"National Museum of Nature and Science, Japan",Plant Specimens of Kurashiki Museum of Natural History,,,,,,,KURA,KURA,147951,Specimen,,11:34.0,,,Adonis ramosa Fr.,Fr.,Adonis ramosa Fr.,Plantae,,,Ranunculales,Ranunculaceae,Adonis,Japan,Japan,,Niimi-shi,,Okayama,Eastern Asia,Japan,,,,,,,,,,,,http://data.gbif.org/occurrences/395734774,http://data.gbif.org/ws/rest/occurrence/get?key=395734774
"National Museum of Nature and Science, Japan",Plant Specimens of Kurashiki Museum of Natural History,,,,,,,KURA,KURA,kt97423,Specimen,,11:32.0,,,Adonis ramosa Fr.,Fr.,Adonis ramosa Fr.,Plantae,,,Ranunculales,Ranunculaceae,Adonis,Japan,Japan,,Bitchu-cho,,Okayama,Eastern Asia,Japan,,,,,,,,,,,,http://data.gbif.org/occurrences/204259630,http://data.gbif.org/ws/rest/occurrence/get?key=204259630
"National Museum of Nature and Science, Japan",Angiosperm specimens of Iwate Prefectural Museum,,,,,,,IPMM,PA,72041,Specimen,,59:20.0,,,Adonis ramosa Franch.,Franch.,Adonis ramosa Franch.,Plantae,Angiospermae,Dicotyledoneae,,Ranunculaceae,Adonis,Japan,Japan,,Tono-shi,,Iwate,Eastern Asia,Japan,,,,,,,,,,,,http://data.gbif.org/occurrences/93879595,http://data.gbif.org/ws/rest/occurrence/get?key=93879595
"National Museum of Nature and Science, Japan",Angiosperm specimens of Iwate Prefectural Museum,,,,,,,IPMM,PA,70499,Specimen,,59:20.0,,,Adonis ramosa Franch.,Franch.,Adonis ramosa Franch.,Plantae,Angiospermae,Dicotyledoneae,,Ranunculaceae,Adonis,Japan,Japan,,Kamaishi-shi,,Iwate,Eastern Asia,Japan,,,,,,,,,,,,http://data.gbif.org/occurrences/93879596,http://data.gbif.org/ws/rest/occurrence/get?key=93879596
"National Museum of Nature and Science, Japan",Angiosperm specimens of Iwate Prefectural Museum,,,,,,,IPMM,PA,72042,Specimen,,59:20.0,,,Adonis ramosa Franch.,Franch.,Adonis ramosa Franch.,Plantae,Angiospermae,Dicotyledoneae,,Ranunculaceae,Adonis,Japan,Japan,,Tono-shi,,Iwate,Eastern Asia,Japan,,,,,,,,,,,,http://data.gbif.org/occurrences/93879600,http://data.gbif.org/ws/rest/occurrence/get?key=93879600
"National Museum of Nature and Science, Japan",Kochi Prefectural Makino Botanical Garden,,,,,,,MBK,MBK,4589,Specimen,,02:37.0,,,Adonis ramosa Franch.,,Adonis ramosa Franch.,Plantae,,,Ranunculales,Ranunculaceae,Adonis,Japan,Japan,,,,Pref. Kochi,Eastern Asia,Japan,,,,,,,,,,,,http://data.gbif.org/occurrences/143956437,http://data.gbif.org/ws/rest/occurrence/get?key=143956437
"National Museum of Nature and Science, Japan",Kochi Prefectural Makino Botanical Garden,,,,,,,MBK,MBK,4586,Specimen,,02:37.0,,,Adonis ramosa Franch.,,Adonis ramosa Franch.,Plantae,,,Ranunculales,Ranunculaceae,Adonis,Japan,Japan,,,,Pref. Kochi,Eastern Asia,Japan,,,,,,,,,,,,http://data.gbif.org/occurrences/143956436,http://data.gbif.org/ws/rest/occurrence/get?key=143956436
"National Museum of Nature and Science, Japan",Kochi Prefectural Makino Botanical Garden,,,,,,,MBK,MBK,175766,Specimen,,02:41.0,,,Adonis ramosa Franch.,,Adonis ramosa Franch.,Plantae,,,Ranunculales,Ranunculaceae,Adonis,Japan,Japan,,,,Pref. Kochi,Eastern Asia,Japan,,,,,,,,,,,,http://data.gbif.org/occurrences/143957392,http://data.gbif.org/ws/rest/occurrence/get?key=143957392
"National Museum of Nature and Science, Japan",Kochi Prefectural Makino Botanical Garden,,,,,,,MBK,MBK,174530,Specimen,,02:41.0,,,Adonis ramosa Franch.,,Adonis ramosa Franch.,Plantae,,,Ranunculales,Ranunculaceae,Adonis,Japan,Japan,,,,Pref. Kochi,Eastern Asia,Japan,,,,,,,,,,,,http://data.gbif.org/occurrences/143957349,http://data.gbif.org/ws/rest/occurrence/get?key=143957349
"National Museum of Nature and Science, Japan",Plant specimens of Hokkaido University Museum,,,,,,,SAPS,plant,22755,Specimen,,02:07.0,,,Adonis ramosa Franch.,Franch.,Adonis ramosa Franch.,Plantae,Magnoliophyta,Magnoliopsida,Ranunculales,Ranunculaceae,Adonis,Japan,Japan,,Kamiiso-cho,,Hokkaido Pref.,Eastern Asia,Japan,,,,,,,,,,,,http://data.gbif.org/occurrences/415411248,http://data.gbif.org/ws/rest/occurrence/get?key=415411248
"National Museum of Nature and Science, Japan",Plant specimens of Hokkaido University Museum,,,,,,,SAPS,plant,22779,Specimen,,02:07.0,,,Adonis ramosa Franch.,Franch.,Adonis ramosa Franch.,Plantae,Magnoliophyta,Magnoliopsida,Ranunculales,Ranunculaceae,Adonis,Japan,Japan,,Shizunai-cho,,Hokkaido Pref.,Eastern Asia,Japan,,,,,,,,,,,,http://data.gbif.org/occurrences/415411263,http://data.gbif.org/ws/rest/occurrence/get?key=415411263
"National Museum of Nature and Science, Japan",Plant specimens of Hokkaido University Museum,,,,,,,SAPS,plant,22760,Specimen,,02:07.0,,,Adonis ramosa Franch.,Franch.,Adonis ramosa Franch.,Plantae,Magnoliophyta,Magnoliopsida,Ranunculales,Ranunculaceae,Adonis,Japan,Japan,,Samani-cho,,Hokkaido Pref.,Eastern Asia,Japan,,,,,,,,,,,,http://data.gbif.org/occurrences/415411253,http://data.gbif.org/ws/rest/occurrence/get?key=415411253
"National Museum of Nature and Science, Japan",Plant specimens of Hokkaido University Museum,,,,,,,SAPS,plant,22789,Specimen,,02:07.0,,,Adonis ramosa Franch.,Franch.,Adonis ramosa Franch.,Plantae,Magnoliophyta,Magnoliopsida,Ranunculales,Ranunculaceae,Adonis,Japan,Japan,,Nikko-machi,,Tochigi Pref.,Eastern Asia,Japan,,,,,,,,,,,,http://data.gbif.org/occurrences/415411269,http://data.gbif.org/ws/rest/occurrence/get?key=415411269
"National Museum of Nature and Science, Japan",Plant specimens of Hokkaido University Museum,,,,,,,SAPS,plant,22769,Specimen,,02:07.0,,,Adonis ramosa Franch.,Franch.,Adonis ramosa Franch.,Plantae,Magnoliophyta,Magnoliopsida,Ranunculales,Ranunculaceae,Adonis,Japan,Japan,,Erimo-cho,,Hokkaido Pref.,Eastern Asia,Japan,,,,,,,,,,,,http://data.gbif.org/occurrences/415411259,http://data.gbif.org/ws/rest/occurrence/get?key=415411259
"National Museum of Nature and Science, Japan",Plant specimens of Hokkaido University Museum,,,,,,,SAPS,plant,22781,Specimen,,02:07.0,,,Adonis ramosa Franch.,Franch.,Adonis ramosa Franch.,Plantae,Magnoliophyta,Magnoliopsida,Ranunculales,Ranunculaceae,Adonis,Japan,Japan,,Shizunai-cho,,Hokkaido Pref.,Eastern Asia,Japan,,,,,,,,,,,,http://data.gbif.org/occurrences/415411265,http://data.gbif.org/ws/rest/occurrence/get?key=415411265
"National Museum of Nature and Science, Japan",Plant specimens of Hokkaido University Museum,,,,,,,SAPS,plant,22770,Specimen,,02:07.0,,,Adonis ramosa Franch.,Franch.,Adonis ramosa Franch.,Plantae,Magnoliophyta,Magnoliopsida,Ranunculales,Ranunculaceae,Adonis,Japan,Japan,,Tomakomai-shi,,Hokkaido Pref.,Eastern Asia,Japan,,,,,,,,,,,,http://data.gbif.org/occurrences/415411260,http://data.gbif.org/ws/rest/occurrence/get?key=415411260
"National Museum of Nature and Science, Japan",Plant specimens of Hokkaido University Museum,,,,,,,SAPS,plant,22782,Specimen,,02:07.0,,,Adonis ramosa Franch.,Franch.,Adonis ramosa Franch.,Plantae,Magnoliophyta,Magnoliopsida,Ranunculales,Ranunculaceae,Adonis,Japan,Japan,,Shizunai-cho,,Hokkaido Pref.,Eastern Asia,Japan,,,,,,,,,,,,http://data.gbif.org/occurrences/415411266,http://data.gbif.org/ws/rest/occurrence/get?key=415411266
"National Museum of Nature and Science, Japan",Plant specimens of Hokkaido University Museum,,,,,,,SAPS,plant,22754,Specimen,,02:07.0,,,Adonis ramosa Franch.,Franch.,Adonis ramosa Franch.,Plantae,Magnoliophyta,Magnoliopsida,Ranunculales,Ranunculaceae,Adonis,Japan,Japan,,Sapporo-shi,,Hokkaido Pref.,Eastern Asia,Japan,,,,,,,,,,,,http://data.gbif.org/occurrences/415411247,http://data.gbif.org/ws/rest/occurrence/get?key=415411247
"National Museum of Nature and Science, Japan",Plant specimens of Hokkaido University Museum,,,,,,,SAPS,plant,22772,Specimen,,02:07.0,,,Adonis ramosa Franch.,Franch.,Adonis ramosa Franch.,Plantae,Magnoliophyta,Magnoliopsida,Ranunculales,Ranunculaceae,Adonis,Japan,Japan,Minami-ku,Sapporo-shi,,Hokkaido Pref.,Eastern Asia,Japan,,,,,,,,,,,,http://data.gbif.org/occurrences/415411262,http://data.gbif.org/ws/rest/occurrence/get?key=415411262
"National Museum of Nature and Science, Japan",Plant specimens of Hokkaido University Museum,,,,,,,SAPS,plant,22759,Specimen,,02:07.0,,,Adonis ramosa Franch.,Franch.,Adonis ramosa Franch.,Plantae,Magnoliophyta,Magnoliopsida,Ranunculales,Ranunculaceae,Adonis,Japan,Japan,,Samani-cho,,Hokkaido Pref.,Eastern Asia,Japan,,,,,,,,,,,,http://data.gbif.org/occurrences/415411252,http://data.gbif.org/ws/rest/occurrence/get?key=415411252
"National Museum of Nature and Science, Japan",Plant specimens of Hokkaido University Museum,,,,,,,SAPS,plant,22788,Specimen,,02:07.0,,,Adonis ramosa Franch.,Franch.,Adonis ramosa Franch.,Plantae,Magnoliophyta,Magnoliopsida,Ranunculales,Ranunculaceae,Adonis,Japan,Japan,,Nikko-machi,,Tochigi Pref.,Eastern Asia,Japan,,,,,,,,,,,,http://data.gbif.org/occurrences/415411268,http://data.gbif.org/ws/rest/occurrence/get?key=415411268
"National Museum of Nature and Science, Japan",Plant specimens of Hokkaido University Museum,,,,,,,SAPS,plant,22771,Specimen,,02:07.0,,,Adonis ramosa Franch.,Franch.,Adonis ramosa Franch.,Plantae,Magnoliophyta,Magnoliopsida,Ranunculales,Ranunculaceae,Adonis,Japan,Japan,Minami-ku,Sapporo-shi,,Hokkaido Pref.,Eastern Asia,Japan,,,,,,,,,,,,http://data.gbif.org/occurrences/415411261,http://data.gbif.org/ws/rest/occurrence/get?key=415411261
"National Museum of Nature and Science, Japan",Plant specimens of Hokkaido University Museum,,,,,,,SAPS,plant,22756,Specimen,,02:07.0,,,Adonis ramosa Franch.,Franch.,Adonis ramosa Franch.,Plantae,Magnoliophyta,Magnoliopsida,Ranunculales,Ranunculaceae,Adonis,Japan,Japan,,Sapporo-shi,,Hokkaido Pref.,Eastern Asia,Japan,,,,,,,,,,,,http://data.gbif.org/occurrences/415411249,http://data.gbif.org/ws/rest/occurrence/get?key=415411249
"National Museum of Nature and Science, Japan",Plant specimens of Hokkaido University Museum,,,,,,,SAPS,plant,22790,Specimen,,02:07.0,,,Adonis ramosa Franch.,Franch.,Adonis ramosa Franch.,Plantae,Magnoliophyta,Magnoliopsida,Ranunculales,Ranunculaceae,Adonis,Japan,Japan,,Inokuchi-mura,,Toyama Pref.,Eastern Asia,Japan,,,,,,,,,,,,http://data.gbif.org/occurrences/415411270,http://data.gbif.org/ws/rest/occurrence/get?key=415411270
"National Museum of Nature and Science, Japan",Plant specimens of Hokkaido University Museum,,,,,,,SAPS,plant,22783,Specimen,,02:07.0,,,Adonis ramosa Franch.,Franch.,Adonis ramosa Franch.,Plantae,Magnoliophyta,Magnoliopsida,Ranunculales,Ranunculaceae,Adonis,Japan,Japan,,Shizunai-cho,,Hokkaido Pref.,Eastern Asia,Japan,,,,,,,,,,,,http://data.gbif.org/occurrences/415411267,http://data.gbif.org/ws/rest/occurrence/get?key=415411267
"National Museum of Nature and Science, Japan",Plant specimens of Hokkaido University Museum,,,,,,,SAPS,plant,22757,Specimen,,02:07.0,,,Adonis ramosa Franch.,Franch.,Adonis ramosa Franch.,Plantae,Magnoliophyta,Magnoliopsida,Ranunculales,Ranunculaceae,Adonis,Japan,Japan,,Muroran-shi,,Hokkaido Pref.,Eastern Asia,Japan,,,,,,,,,,,,http://data.gbif.org/occurrences/415411250,http://data.gbif.org/ws/rest/occurrence/get?key=415411250
"National Museum of Nature and Science, Japan",Plant specimens of Hokkaido University Museum,,,,,,,SAPS,plant,22758,Specimen,,02:07.0,,,Adonis ramosa Franch.,Franch.,Adonis ramosa Franch.,Plantae,Magnoliophyta,Magnoliopsida,Ranunculales,Ranunculaceae,Adonis,Japan,Japan,,Mukawa-cho,,Hokkaido Pref.,Eastern Asia,Japan,,,,,,,,,,,,http://data.gbif.org/occurrences/415411251,http://data.gbif.org/ws/rest/occurrence/get?key=415411251
"National Museum of Nature and Science, Japan",Plant specimens of Hokkaido University Museum,,,,,,,SAPS,plant,22768,Specimen,,02:07.0,,,Adonis ramosa Franch.,Franch.,Adonis ramosa Franch.,Plantae,Magnoliophyta,Magnoliopsida,Ranunculales,Ranunculaceae,Adonis,Japan,Japan,,Sapporo-shi,,Hokkaido Pref.,Eastern Asia,Japan,,,,,,,,,,,,http://data.gbif.org/occurrences/415411258,http://data.gbif.org/ws/rest/occurrence/get?key=415411258
"National Museum of Nature and Science, Japan",Plant specimens of Hokkaido University Museum,,,,,,,SAPS,plant,22875,Specimen,,02:07.0,,,Adonis ramosa Franch.,Franch.,Adonis ramosa Franch.,Plantae,Magnoliophyta,Magnoliopsida,Ranunculales,Ranunculaceae,Adonis,Japan,Japan,,Samani-cho,,Hokkaido Pref.,Eastern Asia,Japan,,,,,,,,,,,,http://data.gbif.org/occurrences/415411271,http://data.gbif.org/ws/rest/occurrence/get?key=415411271
"National Museum of Nature and Science, Japan",Plant specimens of Hokkaido University Museum,,,,,,,SAPS,plant,22780,Specimen,,02:07.0,,,Adonis ramosa Franch.,Franch.,Adonis ramosa Franch.,Plantae,Magnoliophyta,Magnoliopsida,Ranunculales,Ranunculaceae,Adonis,Japan,Japan,,Shizunai-cho,,Hokkaido Pref.,Eastern Asia,Japan,,,,,,,,,,,,http://data.gbif.org/occurrences/415411264,http://data.gbif.org/ws/rest/occurrence/get?key=415411264
"National Museum of Nature and Science, Japan",Vascular Plants Collection of Sagamihara City Museum,,,,,,,JSCM,VS,20151,Specimen,,41:49.0,,,Adonis ramosa Franch.,Franch.,Adonis ramosa Franch.,Plantae,Spermatophyta,,,RANUNCULACEAE,Adonis,Japan,Japan,,Tsukui-gun Fujinomachi,,Kanagawa,Eastern Asia,Japan,,,,,,,,,440,,,http://data.gbif.org/occurrences/351210614,http://data.gbif.org/ws/rest/occurrence/get?key=351210614
"National Museum of Nature and Science, Japan",Vascular Plants Collection of Sagamihara City Museum,,,,,,,JSCM,VS,21161,Specimen,,41:49.0,,,Adonis ramosa Franch.,Franch.,Adonis ramosa Franch.,Plantae,Spermatophyta,,,RANUNCULACEAE,Adonis,Japan,Japan,,Tsukui-gun Fujinomachi,,Kanagawa,Eastern Asia,Japan,,,,,,,,,400,,,http://data.gbif.org/occurrences/351210655,http://data.gbif.org/ws/rest/occurrence/get?key=351210655
"National Museum of Nature and Science, Japan",Vascular Plants Collection of Sagamihara City Museum,,,,,,,JSCM,VS,20150,Specimen,,41:49.0,,,Adonis ramosa Franch.,Franch.,Adonis ramosa Franch.,Plantae,Spermatophyta,,,RANUNCULACEAE,Adonis,Japan,Japan,,Tsukui-gun Fujinomachi,,Kanagawa,Eastern Asia,Japan,,,,,,,,,440,,,http://data.gbif.org/occurrences/351210613,http://data.gbif.org/ws/rest/occurrence/get?key=351210613
"National Museum of Nature and Science, Japan",Vascular Plants Collection of Sagamihara City Museum,,,,,,,JSCM,VS,24618,Specimen,,41:49.0,,,Adonis ramosa Franch.,Franch.,Adonis ramosa Franch.,Plantae,Spermatophyta,,,RANUNCULACEAE,Adonis,Japan,Japan,,Sagamihara-shi,,Kanagawa,Eastern Asia,Japan,,,,,,,,,330,,,http://data.gbif.org/occurrences/351210763,http://data.gbif.org/ws/rest/occurrence/get?key=351210763
"National Museum of Nature and Science, Japan",Vascular Plants Collection of Sagamihara City Museum,,,,,,,JSCM,VS,25454,Specimen,,41:49.0,,,Adonis ramosa Franch.,Franch.,Adonis ramosa Franch.,Plantae,Spermatophyta,,,RANUNCULACEAE,Adonis,Japan,Japan,,Sagamihara-shi,,Kanagawa,Eastern Asia,Japan,,,,,,,,,330,,,http://data.gbif.org/occurrences/351210798,http://data.gbif.org/ws/rest/occurrence/get?key=351210798
"National Museum of Nature and Science, Japan",Vascular Plants Collection of Sagamihara City Museum,,,,,,,JSCM,VS,20152,Specimen,,41:49.0,,,Adonis ramosa Franch.,Franch.,Adonis ramosa Franch.,Plantae,Spermatophyta,,,RANUNCULACEAE,Adonis,Japan,Japan,,Tsukui-gun Fujinomachi,,Kanagawa,Eastern Asia,Japan,,,,,,,,,440,,,http://data.gbif.org/occurrences/351210615,http://data.gbif.org/ws/rest/occurrence/get?key=351210615
"National Museum of Nature and Science, Japan",Vascular Plant Specimen Database of Kanagawa Prefectural Museum of Natural History,,,,,,,KPM,NA,KPM-NA0198247,Specimen,,21:39.0,,,Adonis ramosa Franch.,,Adonis ramosa Franch.,Plantae,Angiospermae,Dicotyledoneae,,RANUNCULACEAE,Adonis,Japan,Japan,,Tochigi-shi,,Tochigi Prefecture,Eastern Asia,Japan,,,,,,,,,70,,,http://data.gbif.org/occurrences/388788015,http://data.gbif.org/ws/rest/occurrence/get?key=388788015
"National Museum of Nature and Science, Japan",Vascular Plant Specimen Database of Kanagawa Prefectural Museum of Natural History,,,,,,,KPM,NA,KPM-NA0074971,Specimen,,21:38.0,,,Adonis ramosa Franch.,,Adonis ramosa Franch.,Plantae,Angiospermae,Dicotyledoneae,,RANUNCULACEAE,Adonis,Japan,Japan,,"Saru-gun, Monbetsu-cho",,Hokkaido,Eastern Asia,Japan,,,,,,,,,,,,http://data.gbif.org/occurrences/388787815,http://data.gbif.org/ws/rest/occurrence/get?key=388787815
"National Museum of Nature and Science, Japan",Vascular Plant Specimen Database of Kanagawa Prefectural Museum of Natural History,,,,,,,KPM,NA,KPM-NA0198245,Specimen,,21:39.0,,,Adonis ramosa Franch.,,Adonis ramosa Franch.,Plantae,Angiospermae,Dicotyledoneae,,RANUNCULACEAE,Adonis,Japan,Japan,,Tochigi-shi,,Tochigi Prefecture,Eastern Asia,Japan,,,,,,,,,70,,,http://data.gbif.org/occurrences/388788013,http://data.gbif.org/ws/rest/occurrence/get?key=388788013
"National Museum of Nature and Science, Japan",Vascular Plant Specimen Database of Kanagawa Prefectural Museum of Natural History,,,,,,,KPM,NA,KPM-NA0198246,Specimen,,21:39.0,,,Adonis ramosa Franch.,,Adonis ramosa Franch.,Plantae,Angiospermae,Dicotyledoneae,,RANUNCULACEAE,Adonis,Japan,Japan,,Tochigi-shi,,Tochigi Prefecture,Eastern Asia,Japan,,,,,,,,,70,,,http://data.gbif.org/occurrences/388788014,http://data.gbif.org/ws/rest/occurrence/get?key=388788014
"National Museum of Nature and Science, Japan",Vascular plant specimens of Akita Prefectural Museum,,,,,,,AKPM,vs,9836,Specimen,,38:51.0,,,Adonis ramosa Franch.,Franch.,Adonis ramosa Franch.,Plantae,Spermatophyta,Dicotyledoneae,,Ranunculaceae,Adonis,Japan,Japan,,Yuri-gun Konouramachi,,Akita,Eastern Asia,Japan,,,,,,,,,,,,http://data.gbif.org/occurrences/296208148,http://data.gbif.org/ws/rest/occurrence/get?key=296208148
"National Museum of Nature and Science, Japan",Vascular plant specimens of Akita Prefectural Museum,,,,,,,AKPM,vs,23459,Specimen,,38:51.0,,,Adonis ramosa Franch.,Franch.,Adonis ramosa Franch.,Plantae,Spermatophyta,Dicotyledoneae,,Ranunculaceae,Adonis,Japan,Japan,,Semboku-gun Kyowamachi,,Akita,Eastern Asia,Japan,,,,,,,,,,,,http://data.gbif.org/occurrences/296208153,http://data.gbif.org/ws/rest/occurrence/get?key=296208153
"National Museum of Nature and Science, Japan",Vascular plant specimens of Akita Prefectural Museum,,,,,,,AKPM,vs,42811,Specimen,,38:52.0,,,Adonis ramosa Franch.,Franch.,Adonis ramosa Franch.,Plantae,Spermatophyta,Dicotyledoneae,,Ranunculaceae,Adonis,Japan,Japan,,Semboku-gun Kyowamachi,,Akita,Eastern Asia,Japan,,,,,,,,,,,,http://data.gbif.org/occurrences/296208186,http://data.gbif.org/ws/rest/occurrence/get?key=296208186
"National Museum of Nature and Science, Japan",Vascular plant specimens of Akita Prefectural Museum,,,,,,,AKPM,vs,37649,Specimen,,38:51.0,,,Adonis ramosa Franch.,Franch.,Adonis ramosa Franch.,Plantae,Spermatophyta,Dicotyledoneae,,Ranunculaceae,Adonis,Japan,Japan,,Yuri-gun Chokaimachi,,Akita,Eastern Asia,Japan,,,,,,,,,,,,http://data.gbif.org/occurrences/296208171,http://data.gbif.org/ws/rest/occurrence/get?key=296208171
"National Museum of Nature and Science, Japan",Vascular plant specimens of Akita Prefectural Museum,,,,,,,AKPM,vs,9835,Specimen,,38:51.0,,,Adonis ramosa Franch.,Franch.,Adonis ramosa Franch.,Plantae,Spermatophyta,Dicotyledoneae,,Ranunculaceae,Adonis,Japan,Japan,,Oga-shi,,Akita,Eastern Asia,Japan,,,,,,,,,,,,http://data.gbif.org/occurrences/296208147,http://data.gbif.org/ws/rest/occurrence/get?key=296208147
"National Museum of Nature and Science, Japan",Vascular plant specimens of Akita Prefectural Museum,,,,,,,AKPM,vs,9833,Specimen,,38:51.0,,,Adonis ramosa Franch.,Franch.,Adonis ramosa Franch.,Plantae,Spermatophyta,Dicotyledoneae,,Ranunculaceae,Adonis,Japan,Japan,,Oga-shi,,Akita,Eastern Asia,Japan,,,,,,,,,,,,http://data.gbif.org/occurrences/296208145,http://data.gbif.org/ws/rest/occurrence/get?key=296208145
"National Museum of Nature and Science, Japan",Vascular plant specimens of Akita Prefectural Museum,,,,,,,AKPM,vs,45460,Specimen,,38:52.0,,,Adonis ramosa Franch.,Franch.,Adonis ramosa Franch.,Plantae,Spermatophyta,Dicotyledoneae,,Ranunculaceae,Adonis,Japan,Japan,,Kitaakita-gun Takanosumachi,,Akita,Eastern Asia,Japan,,,,,,,,,,,,http://data.gbif.org/occurrences/296208199,http://data.gbif.org/ws/rest/occurrence/get?key=296208199
"National Museum of Nature and Science, Japan",Vascular plant specimens of Akita Prefectural Museum,,,,,,,AKPM,vs,37651,Specimen,,38:51.0,,,Adonis ramosa Franch.,Franch.,Adonis ramosa Franch.,Plantae,Spermatophyta,Dicotyledoneae,,Ranunculaceae,Adonis,Japan,Japan,,Kazuno-shi,,Akita,Eastern Asia,Japan,,,,,,,,,,,,http://data.gbif.org/occurrences/296208173,http://data.gbif.org/ws/rest/occurrence/get?key=296208173
"National Museum of Nature and Science, Japan",Vascular plant specimens of Akita Prefectural Museum,,,,,,,AKPM,vs,45458,Specimen,,38:52.0,,,Adonis ramosa Franch.,Franch.,Adonis ramosa Franch.,Plantae,Spermatophyta,Dicotyledoneae,,Ranunculaceae,Adonis,Japan,Japan,,Kawabe-gun Kawabemachi,,Akita,Eastern Asia,Japan,,,,,,,,,,,,http://data.gbif.org/occurrences/296208197,http://data.gbif.org/ws/rest/occurrence/get?key=296208197
"National Museum of Nature and Science, Japan",Vascular plant specimens of Akita Prefectural Museum,,,,,,,AKPM,vs,55383,Specimen,,38:53.0,,,Adonis ramosa Franch.,Franch.,Adonis ramosa Franch.,Plantae,Angiospermae,Dicotyledoneae,,Ranunculaceae,Adonis,Japan,Japan,,Tayamamura,,Iwate,Eastern Asia,Japan,,,,,,,,,,,,http://data.gbif.org/occurrences/624028088,http://data.gbif.org/ws/rest/occurrence/get?key=624028088
"National Museum of Nature and Science, Japan",Vascular plant specimens of Akita Prefectural Museum,,,,,,,AKPM,vs,37650,Specimen,,38:51.0,,,Adonis ramosa Franch.,Franch.,Adonis ramosa Franch.,Plantae,Spermatophyta,Dicotyledoneae,,Ranunculaceae,Adonis,Japan,Japan,,Hiraka-gun Masudamachi,,Akita,Eastern Asia,Japan,,,,,,,,,,,,http://data.gbif.org/occurrences/296208172,http://data.gbif.org/ws/rest/occurrence/get?key=296208172
"National Museum of Nature and Science, Japan",Vascular plant specimens of Akita Prefectural Museum,,,,,,,AKPM,vs,9834,Specimen,,38:51.0,,,Adonis ramosa Franch.,Franch.,Adonis ramosa Franch.,Plantae,Spermatophyta,Dicotyledoneae,,Ranunculaceae,Adonis,Japan,Japan,,Oga-shi,,Akita,Eastern Asia,Japan,,,,,,,,,,,,http://data.gbif.org/occurrences/296208146,http://data.gbif.org/ws/rest/occurrence/get?key=296208146
"National Museum of Nature and Science, Japan",Vascular plant specimens of Akita Prefectural Museum,,,,,,,AKPM,vs,37652,Specimen,,38:52.0,,,Adonis ramosa Franch.,Franch.,Adonis ramosa Franch.,Plantae,Spermatophyta,Dicotyledoneae,,Ranunculaceae,Adonis,Japan,Japan,,Kazuno-shi,,Akita,Eastern Asia,Japan,,,,,,,,,,,,http://data.gbif.org/occurrences/296208174,http://data.gbif.org/ws/rest/occurrence/get?key=296208174