Data Publisher,Dataset,Dataset Rights,Collector name,Collector number,Field number,GUID,Date collected,Institution code,Collection code,Catalogue number,Basis of record,Image url,Last indexed,Identifier,Identification date,Scientific name,Author,Scientific name (interpreted),Kingdom,Phylum,Class,Order,Family,Genus,Country,Country (interpreted),Locality,County,Continent or Ocean,State/Province,Region,Publisher country,Latitude,Longitude,Coordinate precision,Cell id,Centi cell id,Min depth,Max depth,Max depth,Min altitude,Max altitude,Altitude precision,GBIF portal url,GBIF webservice url
"National Institute of Genetics, ROIS","Plant Specimen Database of Tama Forest Science Garden, Forestry and Forest Products Research Institute, Japan",,,,,,,FFPRI,TFA,29597,Specimen,,25:32.0,,,Aconitum japonicum Thunb. subsp. napiforme (H.Lev. et Vaniot) Kadota,,Aconitum japonicum subsp. napiforme (H.Lev. & Vaniot) Kadota,Plantae,Magnoliophyta,Magnoliopsida,Ranunculales,Ranunculaceae,Aconitum,Japan,Japan,,,,Hirosima Prefecture,Eastern Asia,Japan,,,,,,,,,,,,http://data.gbif.org/occurrences/360272897,http://data.gbif.org/ws/rest/occurrence/get?key=360272897
"National Museum of Nature and Science, Japan",Angiospermatatophytina Collection of Saitama Museum of Natural History,,,,,,,SMNH,As,22851,Specimen,,52:03.0,,,Aconitum napiforme Lev. et Van.,Lev. et Van.,Aconitum napiforme Lev. & Van.,Plantae,Angiospermae,Dicotyledoneae,Ranunculales,Ranunculaceae,Aconitum,Japan,Japan,Mt. Kuju-san,Naoiri-gun Kujuumachi,,Ooita,Eastern Asia,Japan,,,,,,,,,,,,http://data.gbif.org/occurrences/393089550,http://data.gbif.org/ws/rest/occurrence/get?key=393089550
"National Museum of Nature and Science, Japan",Angiospermatatophytina Collection of Saitama Museum of Natural History,,,,,,,SMNH,As,22850,Specimen,,52:03.0,,,Aconitum napiforme Lev. et Van.,Lev. et Van.,Aconitum napiforme Lev. & Van.,Plantae,Angiospermae,Dicotyledoneae,Ranunculales,Ranunculaceae,Aconitum,Japan,Japan,Mt. Kuju-san,Naoiri-gun Kujuumachi,,Ooita,Eastern Asia,Japan,,,,,,,,,,,,http://data.gbif.org/occurrences/393089549,http://data.gbif.org/ws/rest/occurrence/get?key=393089549
"National Museum of Nature and Science, Japan","Herbarium Specimens of Tokushima Prefectural Museum, Japan",,,,,,,TKPM,B,SP040307,Specimen,,21:41.0,,,Aconitum napiforme Lev. et Van.,Lev. et Van.,Aconitum napiforme Lev. & Van.,Plantae,Angiospermae,Dicotyledoneae,Angiospermae,Ranunculaceae,Aconitum,Japan,Japan,,Mikamo-cho,,Tokushima Pref.,Eastern Asia,Japan,,,,,,,,,,,,http://data.gbif.org/occurrences/150123055,http://data.gbif.org/ws/rest/occurrence/get?key=150123055
"National Museum of Nature and Science, Japan","Herbarium Specimens of Tokushima Prefectural Museum, Japan",,,,,,,TKPM,TKPM-B,SP119105,Specimen,,21:38.0,,,Aconitum napiforme Lev. et Van.,Lev. et Van.,Aconitum napiforme Lev. & Van.,Plantae,Angiospermae,Dicotyledoneae,Ranunculales,Ranunculaceae,Aconitum,Japan,Japan,"Yamakawa-cho, Oe-gun",Yamakawa-cho,,Tokushima,Eastern Asia,Japan,34.0658,134.366,,44954,3,,,,,,,http://data.gbif.org/occurrences/43192422,http://data.gbif.org/ws/rest/occurrence/get?key=43192422
"National Museum of Nature and Science, Japan","Herbarium Specimens of Tokushima Prefectural Museum, Japan",,,,,,,TKPM,B,SP040308,Specimen,,21:41.0,,,Aconitum napiforme Lev. et Van.,Lev. et Van.,Aconitum napiforme Lev. & Van.,Plantae,Angiospermae,Dicotyledoneae,Angiospermae,Ranunculaceae,Aconitum,Japan,Japan,,Yamakawa-cho,,Tokushima Pref.,Eastern Asia,Japan,,,,,,,,,,,,http://data.gbif.org/occurrences/150123054,http://data.gbif.org/ws/rest/occurrence/get?key=150123054
"National Museum of Nature and Science, Japan","Herbarium Specimens of Tokushima Prefectural Museum, Japan",,,,,,,TKPM,B,SP006700,Specimen,,21:39.0,,,Aconitum napiforme Lev. et Van.,Lev. et Van.,Aconitum napiforme Lev. & Van.,Plantae,Angiospermae,Dicotyledoneae,Angiospermae,Ranunculaceae,Aconitum,Japan,Japan,,Ikeda-cho,,Tokushima Pref.,Eastern Asia,Japan,,,,,,,,,,,,http://data.gbif.org/occurrences/150122727,http://data.gbif.org/ws/rest/occurrence/get?key=150122727
"National Museum of Nature and Science, Japan","Herbarium Specimens of Tokushima Prefectural Museum, Japan",,,,,,,TKPM,B,SP040311,Specimen,,21:41.0,,,Aconitum napiforme Lev. et Van.,Lev. et Van.,Aconitum napiforme Lev. & Van.,Plantae,Angiospermae,Dicotyledoneae,Angiospermae,Ranunculaceae,Aconitum,Japan,Japan,,Mino-cho,,Tokushima Pref.,Eastern Asia,Japan,,,,,,,,,,,,http://data.gbif.org/occurrences/150123052,http://data.gbif.org/ws/rest/occurrence/get?key=150123052
"National Museum of Nature and Science, Japan","Herbarium Specimens of Tokushima Prefectural Museum, Japan",,,,,,,TKPM,B,SP040309,Specimen,,21:41.0,,,Aconitum napiforme Lev. et Van.,Lev. et Van.,Aconitum napiforme Lev. & Van.,Plantae,Angiospermae,Dicotyledoneae,Angiospermae,Ranunculaceae,Aconitum,Japan,Japan,,Kamiyama-cho,,Tokushima Pref.,Eastern Asia,Japan,,,,,,,,,,,,http://data.gbif.org/occurrences/150123053,http://data.gbif.org/ws/rest/occurrence/get?key=150123053
"National Museum of Nature and Science, Japan","Herbarium Specimens of Tokushima Prefectural Museum, Japan",,,,,,,TKPM,B,SP031594,Specimen,,21:40.0,,,Aconitum napiforme Lev. et Van.,Lev. et Van.,Aconitum napiforme Lev. & Van.,Plantae,Angiospermae,Dicotyledoneae,Angiospermae,Ranunculaceae,Aconitum,Japan,Japan,,Kamiyama-cho,,Tokushima Pref.,Eastern Asia,Japan,,,,,,,,,,,,http://data.gbif.org/occurrences/150123003,http://data.gbif.org/ws/rest/occurrence/get?key=150123003
"National Museum of Nature and Science, Japan","Herbarium Specimens of Tokushima Prefectural Museum, Japan",,,,,,,TKPM,B,SP140461,Specimen,,21:42.0,,,Aconitum napiforme Lev. et Van.,Lev. et Van.,Aconitum napiforme Lev. & Van.,Plantae,Angiospermae,Dicotyledoneae,Angiospermae,Ranunculaceae,Aconitum,Japan,Japan,,Mima-gun,,Tokushima Pref.,Eastern Asia,Japan,,,,,,,,,,,,http://data.gbif.org/occurrences/150123338,http://data.gbif.org/ws/rest/occurrence/get?key=150123338
"National Museum of Nature and Science, Japan",Plant Specimens of Kurashiki Museum of Natural History,,,,,,,KURA,KURA,64709,Specimen,,11:29.0,,,Aconitum napiforme Lev. et Van.,Lev. et Van.,Aconitum napiforme Lev. & Van.,Plantae,,,Ranunculales,Ranunculaceae,Aconitum,Japan,Japan,,Oohara-cho,,Okayama,Eastern Asia,Japan,,,,,,,,,,,,http://data.gbif.org/occurrences/395733888,http://data.gbif.org/ws/rest/occurrence/get?key=395733888
"National Museum of Nature and Science, Japan",Plant Specimens of Kurashiki Museum of Natural History,,,,,,,KURA,KURA,56010,Specimen,,11:28.0,,,Aconitum napiforme Lev. et Van.,Lev. et Van.,Aconitum napiforme Lev. & Van.,Plantae,,,Ranunculales,Ranunculaceae,Aconitum,Japan,Japan,,Shinjo-son,,Okayama,Eastern Asia,Japan,,,,,,,,,,,,http://data.gbif.org/occurrences/395733844,http://data.gbif.org/ws/rest/occurrence/get?key=395733844
"National Museum of Nature and Science, Japan",Plant Specimens of Kurashiki Museum of Natural History,,,,,,,KURA,KURA,kt108132,Specimen,,11:27.0,,,Aconitum napiforme Lev. et Van.,Lev. et Van.,Aconitum napiforme Lev. & Van.,Plantae,,,Ranunculales,Ranunculaceae,Aconitum,Japan,Japan,,Kawakami-cho,,Okayama,Eastern Asia,Japan,,,,,,,,,,,,http://data.gbif.org/occurrences/204259637,http://data.gbif.org/ws/rest/occurrence/get?key=204259637
"National Museum of Nature and Science, Japan",Plant Specimens of Kurashiki Museum of Natural History,,,,,,,KURA,KURA,159335,Specimen,,11:30.0,,,Aconitum napiforme Lev. et Van.,Lev. et Van.,Aconitum napiforme Lev. & Van.,Plantae,,,Ranunculales,Ranunculaceae,Aconitum,Japan,Japan,,Niimi-shi,,Okayama,Eastern Asia,Japan,,,,,,,,,,,,http://data.gbif.org/occurrences/395734214,http://data.gbif.org/ws/rest/occurrence/get?key=395734214
"National Museum of Nature and Science, Japan",Plant Specimens of Kurashiki Museum of Natural History,,,,,,,KURA,KURA,105170,Specimen,,11:29.0,,,Aconitum napiforme Lev. et Van.,Lev. et Van.,Aconitum napiforme Lev. & Van.,Plantae,,,Ranunculales,Ranunculaceae,Aconitum,Japan,Japan,,Shinjo-son,,Okayama,Eastern Asia,Japan,,,,,,,,,,,,http://data.gbif.org/occurrences/395734028,http://data.gbif.org/ws/rest/occurrence/get?key=395734028
"National Museum of Nature and Science, Japan",Plant Specimens of Kurashiki Museum of Natural History,,,,,,,KURA,KURA,62641,Specimen,,11:28.0,,,Aconitum napiforme Lev. et Van.,Lev. et Van.,Aconitum napiforme Lev. & Van.,Plantae,,,Ranunculales,Ranunculaceae,Aconitum,Japan,Japan,,Shinjo-son,,Okayama,Eastern Asia,Japan,,,,,,,,,,,,http://data.gbif.org/occurrences/395733860,http://data.gbif.org/ws/rest/occurrence/get?key=395733860
"National Museum of Nature and Science, Japan",Plant Specimens of Kurashiki Museum of Natural History,,,,,,,KURA,KURA,43442,Specimen,,11:28.0,,,Aconitum napiforme Lev. et Van.,Lev. et Van.,Aconitum napiforme Lev. & Van.,Plantae,,,Ranunculales,Ranunculaceae,Aconitum,Japan,Japan,,Niimi-shi,,Okayama,Eastern Asia,Japan,,,,,,,,,,,,http://data.gbif.org/occurrences/395733824,http://data.gbif.org/ws/rest/occurrence/get?key=395733824
"National Museum of Nature and Science, Japan",Plant Specimens of Kurashiki Museum of Natural History,,,,,,,KURA,KURA,95862,Specimen,,11:29.0,,,Aconitum napiforme Lev. et Van.,Lev. et Van.,Aconitum napiforme Lev. & Van.,Plantae,,,Ranunculales,Ranunculaceae,Aconitum,Japan,Japan,,Chuo-cho,,Okayama,Eastern Asia,Japan,,,,,,,,,,,,http://data.gbif.org/occurrences/395734002,http://data.gbif.org/ws/rest/occurrence/get?key=395734002
"National Museum of Nature and Science, Japan",Plant Specimens of Kurashiki Museum of Natural History,,,,,,,KURA,KURA,105174,Specimen,,11:29.0,,,Aconitum napiforme Lev. et Van.,Lev. et Van.,Aconitum napiforme Lev. & Van.,Plantae,,,Ranunculales,Ranunculaceae,Aconitum,Japan,Japan,,Shinjo-son,,Okayama,Eastern Asia,Japan,,,,,,,,,,,,http://data.gbif.org/occurrences/395734029,http://data.gbif.org/ws/rest/occurrence/get?key=395734029
"National Museum of Nature and Science, Japan",Plant Specimens of Kurashiki Museum of Natural History,,,,,,,KURA,KURA,25343,Specimen,,11:28.0,,,Aconitum napiforme Lev. et Van.,Lev. et Van.,Aconitum napiforme Lev. & Van.,Plantae,,,Ranunculales,Ranunculaceae,Aconitum,Japan,Japan,,Niimi-shi,,Okayama,Eastern Asia,Japan,,,,,,,,,,,,http://data.gbif.org/occurrences/395733781,http://data.gbif.org/ws/rest/occurrence/get?key=395733781
"National Museum of Nature and Science, Japan",Plant Specimens of Kurashiki Museum of Natural History,,,,,,,KURA,KURA,120292,Specimen,,11:29.0,,,Aconitum napiforme Lev. et Van.,Lev. et Van.,Aconitum napiforme Lev. & Van.,Plantae,,,Ranunculales,Ranunculaceae,Aconitum,Japan,Japan,,Shoboku-cho,,Okayama,Eastern Asia,Japan,,,,,,,,,,,,http://data.gbif.org/occurrences/395734090,http://data.gbif.org/ws/rest/occurrence/get?key=395734090
"National Museum of Nature and Science, Japan",Plant Specimens of Kurashiki Museum of Natural History,,,,,,,KURA,KURA,105196,Specimen,,11:29.0,,,Aconitum napiforme Lev. et Van.,Lev. et Van.,Aconitum napiforme Lev. & Van.,Plantae,,,Ranunculales,Ranunculaceae,Aconitum,Japan,Japan,,Shinjo-son,,Okayama,Eastern Asia,Japan,,,,,,,,,,,,http://data.gbif.org/occurrences/395734030,http://data.gbif.org/ws/rest/occurrence/get?key=395734030
"National Museum of Nature and Science, Japan",Plant Specimens of Kurashiki Museum of Natural History,,,,,,,KURA,KURA,65006,Specimen,,11:29.0,,,Aconitum napiforme Lev. et Van.,Lev. et Van.,Aconitum napiforme Lev. & Van.,Plantae,,,Ranunculales,Ranunculaceae,Aconitum,Japan,Japan,,Shinjo-son,,Okayama,Eastern Asia,Japan,,,,,,,,,,,,http://data.gbif.org/occurrences/395733892,http://data.gbif.org/ws/rest/occurrence/get?key=395733892
"National Museum of Nature and Science, Japan",Plant Specimens of Kurashiki Museum of Natural History,,,,,,,KURA,KURA,3410,Specimen,,11:28.0,,,Aconitum napiforme Lev. et Van.,Lev. et Van.,Aconitum napiforme Lev. & Van.,Plantae,,,Ranunculales,Ranunculaceae,Aconitum,Japan,Japan,,Niimi-shi,,Okayama,Eastern Asia,Japan,,,,,,,,,,,,http://data.gbif.org/occurrences/395733756,http://data.gbif.org/ws/rest/occurrence/get?key=395733756
"National Museum of Nature and Science, Japan",Plant Specimens of Kurashiki Museum of Natural History,,,,,,,KURA,KURA,105514,Specimen,,11:29.0,,,Aconitum napiforme Lev. et Van.,Lev. et Van.,Aconitum napiforme Lev. & Van.,Plantae,,,Ranunculales,Ranunculaceae,Aconitum,Japan,Japan,,Chuo-cho,,Okayama,Eastern Asia,Japan,,,,,,,,,,,,http://data.gbif.org/occurrences/395734038,http://data.gbif.org/ws/rest/occurrence/get?key=395734038
"National Museum of Nature and Science, Japan",Plant Specimens of Kurashiki Museum of Natural History,,,,,,,KURA,KURA,64710,Specimen,,11:29.0,,,Aconitum napiforme Lev. et Van.,Lev. et Van.,Aconitum napiforme Lev. & Van.,Plantae,,,Ranunculales,Ranunculaceae,Aconitum,Japan,Japan,,Nishiawakura-son,,Okayama,Eastern Asia,Japan,,,,,,,,,,,,http://data.gbif.org/occurrences/395733890,http://data.gbif.org/ws/rest/occurrence/get?key=395733890
"National Museum of Nature and Science, Japan",Plant Specimens of Kurashiki Museum of Natural History,,,,,,,KURA,KURA,72564,Specimen,,11:29.0,,,Aconitum napiforme Lev. et Van.,Lev. et Van.,Aconitum napiforme Lev. & Van.,Plantae,,,Ranunculales,Ranunculaceae,Aconitum,Japan,Japan,,Shinjo-son,,Okayama,Eastern Asia,Japan,,,,,,,,,,,,http://data.gbif.org/occurrences/395733939,http://data.gbif.org/ws/rest/occurrence/get?key=395733939
"National Museum of Nature and Science, Japan",Plant Specimens of Kurashiki Museum of Natural History,,,,,,,KURA,KURA,102119,Specimen,,11:29.0,,,Aconitum napiforme Lev. et Van.,Lev. et Van.,Aconitum napiforme Lev. & Van.,Plantae,,,Ranunculales,Ranunculaceae,Aconitum,Japan,Japan,,Shoboku-cho,,Okayama,Eastern Asia,Japan,,,,,,,,,,,,http://data.gbif.org/occurrences/395734023,http://data.gbif.org/ws/rest/occurrence/get?key=395734023
"National Museum of Nature and Science, Japan",Plant Specimens of Kurashiki Museum of Natural History,,,,,,,KURA,KURA,157992,Specimen,,11:30.0,,,Aconitum napiforme Lev. et Van.,Lev. et Van.,Aconitum napiforme Lev. & Van.,Plantae,,,Ranunculales,Ranunculaceae,Aconitum,Japan,Japan,,Nagi-cho,,Okayama,Eastern Asia,Japan,,,,,,,,,,,,http://data.gbif.org/occurrences/395734211,http://data.gbif.org/ws/rest/occurrence/get?key=395734211
"National Museum of Nature and Science, Japan",Plant Specimens of Kurashiki Museum of Natural History,,,,,,,KURA,KURA,62642,Specimen,,11:28.0,,,Aconitum napiforme Lev. et Van.,Lev. et Van.,Aconitum napiforme Lev. & Van.,Plantae,,,Ranunculales,Ranunculaceae,Aconitum,Japan,Japan,,Shinjo-son,,Okayama,Eastern Asia,Japan,,,,,,,,,,,,http://data.gbif.org/occurrences/395733861,http://data.gbif.org/ws/rest/occurrence/get?key=395733861
"National Museum of Nature and Science, Japan",Plant Specimens of Kurashiki Museum of Natural History,,,,,,,KURA,KURA,kt157755,Specimen,,11:27.0,,,Aconitum napiforme Lev. et Van.,Lev. et Van.,Aconitum napiforme Lev. & Van.,Plantae,,,Ranunculales,Ranunculaceae,Aconitum,Japan,Japan,,Soja-shi,,Okayama,Eastern Asia,Japan,,,,,,,,,,,,http://data.gbif.org/occurrences/204259501,http://data.gbif.org/ws/rest/occurrence/get?key=204259501
"National Museum of Nature and Science, Japan",Plant Specimens of Kurashiki Museum of Natural History,,,,,,,KURA,KURA,68029,Specimen,,11:29.0,,,Aconitum napiforme Lev. et Van.,Lev. et Van.,Aconitum napiforme Lev. & Van.,Plantae,,,Ranunculales,Ranunculaceae,Aconitum,Japan,Japan,,Niimi-shi,,Okayama,Eastern Asia,Japan,,,,,,,,,,,,http://data.gbif.org/occurrences/395733914,http://data.gbif.org/ws/rest/occurrence/get?key=395733914
"National Museum of Nature and Science, Japan",Plant Specimens of Kurashiki Museum of Natural History,,,,,,,KURA,KURA,115370,Specimen,,11:29.0,,,Aconitum napiforme Lev. et Van.,Lev. et Van.,Aconitum napiforme Lev. & Van.,Plantae,,,Ranunculales,Ranunculaceae,Aconitum,Japan,Japan,,Tsuyama-shi,,Okayama,Eastern Asia,Japan,,,,,,,,,,,,http://data.gbif.org/occurrences/395734065,http://data.gbif.org/ws/rest/occurrence/get?key=395734065
"National Museum of Nature and Science, Japan","Plant specimens depodited in Osaka Museum of Natural History, Japan.",,,,,,,OSA,C,OSA19324,Specimen,,14:55.0,,,Aconitum napiforme Lev. et Vant.,Lev. et Vant.,Aconitum napiforme Lev. & Vant.,Plantae,,,,Ranunculaeae,Aconitum,Japan,Japan,Hokkein-Chojagahara,,,Oita Prefecture,Eastern Asia,Japan,,,,,,,,,,,,http://data.gbif.org/occurrences/295102091,http://data.gbif.org/ws/rest/occurrence/get?key=295102091
"National Museum of Nature and Science, Japan",Plant Specimens of The Shimane Nature Museum of Mt. Sanbe,,,,,,,SNMS,P,1243,Specimen,,45:12.0,,,Aconitum napiforme Lev. et Van't.,,Aconitum napiforme Lev. & Vant.,Plantae,,,Ranunculales,Ranunculaceae,Aconitum,Japan,Japan,"Mt. Makuragi, Makuragi-cho",Matsue-shi,,Shimane Pref.,Eastern Asia,Japan,,,,,,,,,,,,http://data.gbif.org/occurrences/143954841,http://data.gbif.org/ws/rest/occurrence/get?key=143954841
"National Museum of Nature and Science, Japan",Plant Specimens of The Shimane Nature Museum of Mt. Sanbe,,,,,,,SNMS,P,3149,Specimen,,45:13.0,,,Aconitum napiforme Lev. et Van't.,Lev. et Van't.,Aconitum napiforme Lev. & Vant.,Plantae,,,Ranunculales,Ranunculaceae,Aconitum,Japan,Japan,"Mt. Nekoyama, Misaka, Saijyou-cho",Shoubara-shi,,Hiroshima Pref.,Eastern Asia,Japan,,,,,,,,,,,,http://data.gbif.org/occurrences/204396594,http://data.gbif.org/ws/rest/occurrence/get?key=204396594
"National Museum of Nature and Science, Japan",Plant Specimens of The Shimane Nature Museum of Mt. Sanbe,,,,,,,SNMS,P,5523,Specimen,,45:14.0,,,Aconitum napiforme Lev. et Van't.,Lev. et Van't.,Aconitum napiforme Lev. & Vant.,Plantae,,,Ranunculales,Ranunculaceae,Aconitum,Japan,Japan,Nonami,"Shimane-cho, Yatsuka-gun",,Shimane Pref.,Eastern Asia,Japan,,,,,,,,,,,,http://data.gbif.org/occurrences/204396965,http://data.gbif.org/ws/rest/occurrence/get?key=204396965
"National Museum of Nature and Science, Japan",Plant Specimens of The Shimane Nature Museum of Mt. Sanbe,,,,,,,SNMS,P,1246,Specimen,,45:12.0,,,Aconitum napiforme Lev. et Van't.,,Aconitum napiforme Lev. & Vant.,Plantae,,,Ranunculales,Ranunculaceae,Aconitum,Japan,Japan,"Mt. Makuragi, Makuragi-cho",Matsue-shi,,Shimane Pref.,Eastern Asia,Japan,,,,,,,,,,,,http://data.gbif.org/occurrences/143954844,http://data.gbif.org/ws/rest/occurrence/get?key=143954844
"National Museum of Nature and Science, Japan",Plant Specimens of The Shimane Nature Museum of Mt. Sanbe,,,,,,,SNMS,P,1242,Specimen,,45:12.0,,,Aconitum napiforme Lev. et Van't.,,Aconitum napiforme Lev. & Vant.,Plantae,,,Ranunculales,Ranunculaceae,Aconitum,Japan,Japan,"Mt. Makuragi, Makuragi-cho",Matsue-shi,,Shimane Pref.,Eastern Asia,Japan,,,,,,,,,,,,http://data.gbif.org/occurrences/143954840,http://data.gbif.org/ws/rest/occurrence/get?key=143954840
"National Museum of Nature and Science, Japan",Plant Specimens of The Shimane Nature Museum of Mt. Sanbe,,,,,,,SNMS,P,4638,Specimen,,45:13.0,,,Aconitum napiforme Lev. et Van't.,Lev. et Van't.,Aconitum napiforme Lev. & Vant.,Plantae,,,Ranunculales,Ranunculaceae,Aconitum,Japan,Japan,"Mt. Sarumasa, Kamiai","Nita-cho, Nita-gun",,Shimane Pref.,Eastern Asia,Japan,,,,,,,,,,,,http://data.gbif.org/occurrences/204396825,http://data.gbif.org/ws/rest/occurrence/get?key=204396825
"National Museum of Nature and Science, Japan",Plant Specimens of The Shimane Nature Museum of Mt. Sanbe,,,,,,,SNMS,P,822,Specimen,,45:12.0,,,Aconitum napiforme Lev. et Van't.,,Aconitum napiforme Lev. & Vant.,Plantae,,,Ranunculales,Ranunculaceae,Aconitum,Japan,Japan,Kijima,"Akagi-cho, Iishi-gun",,Shimane Pref.,Eastern Asia,Japan,,,,,,,,,,,,http://data.gbif.org/occurrences/143954660,http://data.gbif.org/ws/rest/occurrence/get?key=143954660
"National Museum of Nature and Science, Japan",Plant Specimens of The Shimane Nature Museum of Mt. Sanbe,,,,,,,SNMS,P,3148,Specimen,,45:13.0,,,Aconitum napiforme Lev. et Van't.,Lev. et Van't.,Aconitum napiforme Lev. & Vant.,Plantae,,,Ranunculales,Ranunculaceae,Aconitum,Japan,Japan,"Mt. Nekoyama, Misaka, Saijyou-cho",Shoubara-shi,,Hiroshima Pref.,Eastern Asia,Japan,,,,,,,,,,,,http://data.gbif.org/occurrences/204396593,http://data.gbif.org/ws/rest/occurrence/get?key=204396593
"National Museum of Nature and Science, Japan",Plant Specimens of The Shimane Nature Museum of Mt. Sanbe,,,,,,,SNMS,P,1245,Specimen,,45:12.0,,,Aconitum napiforme Lev. et Van't.,,Aconitum napiforme Lev. & Vant.,Plantae,,,Ranunculales,Ranunculaceae,Aconitum,Japan,Japan,"Mt. Makuragi, Makuragi-cho",Matsue-shi,,Shimane Pref.,Eastern Asia,Japan,,,,,,,,,,,,http://data.gbif.org/occurrences/143954843,http://data.gbif.org/ws/rest/occurrence/get?key=143954843
"National Museum of Nature and Science, Japan",Plant Specimens of The Shimane Nature Museum of Mt. Sanbe,,,,,,,SNMS,P,15539,Specimen,,45:15.0,,,Aconitum napiforme Lev. et Van't.,Lev. et Van't.,Aconitum napiforme Lev. & Vant.,Plantae,,,Ranunculales,Ranunculaceae,Aconitum,Japan,Japan,"Mt. Misaka, Kamihonjo-cho",Matsue-shi,,Shimane Pref.,Eastern Asia,Japan,,,,,,,,,,,,http://data.gbif.org/occurrences/390980216,http://data.gbif.org/ws/rest/occurrence/get?key=390980216
"National Museum of Nature and Science, Japan",Plant Specimens of The Shimane Nature Museum of Mt. Sanbe,,,,,,,SNMS,P,4633,Specimen,,45:13.0,,,Aconitum napiforme Lev. et Van't.,Lev. et Van't.,Aconitum napiforme Lev. & Vant.,Plantae,,,Ranunculales,Ranunculaceae,Aconitum,Japan,Japan,"Mt. Sarumasa, Kamiai","Nita-cho, Nita-gun",,Shimane Pref.,Eastern Asia,Japan,,,,,,,,,,,,http://data.gbif.org/occurrences/204396820,http://data.gbif.org/ws/rest/occurrence/get?key=204396820
"National Museum of Nature and Science, Japan",Plant Specimens of The Shimane Nature Museum of Mt. Sanbe,,,,,,,SNMS,P,18022,Specimen,,45:16.0,,,Aconitum napiforme Lev. et Van't.,Lev. et Van't.,Aconitum napiforme Lev. & Vant.,Plantae,,,Ranunculales,Ranunculaceae,Aconitum,Japan,Japan,Kunidomi-cho,Hirata-shi,,Shimane Pref.,Eastern Asia,Japan,,,,,,,,,,,,http://data.gbif.org/occurrences/390980454,http://data.gbif.org/ws/rest/occurrence/get?key=390980454
"National Museum of Nature and Science, Japan",Plant Specimens of The Shimane Nature Museum of Mt. Sanbe,,,,,,,SNMS,P,15538,Specimen,,45:15.0,,,Aconitum napiforme Lev. et Van't.,Lev. et Van't.,Aconitum napiforme Lev. & Vant.,Plantae,,,Ranunculales,Ranunculaceae,Aconitum,Japan,Japan,"Mt. Misaka, Kamihonjo-cho",Matsue-shi,,Shimane Pref.,Eastern Asia,Japan,,,,,,,,,,,,http://data.gbif.org/occurrences/390980214,http://data.gbif.org/ws/rest/occurrence/get?key=390980214
"National Museum of Nature and Science, Japan",Plant Specimens of The Shimane Nature Museum of Mt. Sanbe,,,,,,,SNMS,P,4635,Specimen,,45:13.0,,,Aconitum napiforme Lev. et Van't.,Lev. et Van't.,Aconitum napiforme Lev. & Vant.,Plantae,,,Ranunculales,Ranunculaceae,Aconitum,Japan,Japan,"Mt. Sarumasa, Kamiai","Nita-cho, Nita-gun",,Shimane Pref.,Eastern Asia,Japan,,,,,,,,,,,,http://data.gbif.org/occurrences/204396822,http://data.gbif.org/ws/rest/occurrence/get?key=204396822
"National Museum of Nature and Science, Japan",Plant Specimens of The Shimane Nature Museum of Mt. Sanbe,,,,,,,SNMS,P,4637,Specimen,,45:13.0,,,Aconitum napiforme Lev. et Van't.,Lev. et Van't.,Aconitum napiforme Lev. & Vant.,Plantae,,,Ranunculales,Ranunculaceae,Aconitum,Japan,Japan,"Mt. Sarumasa, Kamiai","Nita-cho, Nita-gun",,Shimane Pref.,Eastern Asia,Japan,,,,,,,,,,,,http://data.gbif.org/occurrences/204396824,http://data.gbif.org/ws/rest/occurrence/get?key=204396824
"National Museum of Nature and Science, Japan",Plant Specimens of The Shimane Nature Museum of Mt. Sanbe,,,,,,,SNMS,P,1244,Specimen,,45:12.0,,,Aconitum napiforme Lev. et Van't.,,Aconitum napiforme Lev. & Vant.,Plantae,,,Ranunculales,Ranunculaceae,Aconitum,Japan,Japan,"Mt. Makuragi, Makuragi-cho",Matsue-shi,,Shimane Pref.,Eastern Asia,Japan,,,,,,,,,,,,http://data.gbif.org/occurrences/143954842,http://data.gbif.org/ws/rest/occurrence/get?key=143954842