Data Publisher,Dataset,Dataset Rights,Collector name,Collector number,Field number,GUID,Date collected,Institution code,Collection code,Catalogue number,Basis of record,Image url,Last indexed,Identifier,Identification date,Scientific name,Author,Scientific name (interpreted),Kingdom,Phylum,Class,Order,Family,Genus,Country,Country (interpreted),Locality,County,Continent or Ocean,State/Province,Region,Publisher country,Latitude,Longitude,Coordinate precision,Cell id,Centi cell id,Min depth,Max depth,Max depth,Min altitude,Max altitude,Altitude precision,GBIF portal url,GBIF webservice url
"National Museum of Nature and Science, Japan",Angiosperm specimens of Iwate Prefectural Museum,,,,,,,IPMM,PA,22667,Specimen,,59:21.0,,,Aconitum jaluense Kom.  subsp. iwatekense (Nakai) Kadota,Kom.,Aconitum jaluense subsp. iwatekense (Nakai) Kadota,Plantae,Angiospermae,Dicotyledoneae,Ranunculales,Ranunculaceae,Aconitum,Japan,Japan,,Kamaishi-shi,,Iwate,Eastern Asia,Japan,,,,,,,,,,,,http://data.gbif.org/occurrences/204230551,http://data.gbif.org/ws/rest/occurrence/get?key=204230551
"National Museum of Nature and Science, Japan",Angiosperm specimens of Iwate Prefectural Museum,,,,,,,IPMM,PA,41287,Specimen,,59:23.0,,,Aconitum jaluense Kom.  subsp. iwatekense (Nakai) Kadota,Kom.,Aconitum jaluense subsp. iwatekense (Nakai) Kadota,Plantae,Angiospermae,Dicotyledoneae,Ranunculales,Ranunculaceae,Aconitum,Japan,Japan,,Hachimantai-shi,,Iwate,Eastern Asia,Japan,,,,,,,,,,,,http://data.gbif.org/occurrences/204230995,http://data.gbif.org/ws/rest/occurrence/get?key=204230995
"National Museum of Nature and Science, Japan",Angiosperm specimens of Iwate Prefectural Museum,,,,,,,IPMM,PA,71315,Specimen,,59:19.0,,,Aconitum jaluense Kom.  subsp. iwatekense (Nakai) Kadota,Kom.,Aconitum jaluense subsp. iwatekense (Nakai) Kadota,Plantae,Angiospermae,Dicotyledoneae,,Ranunculaceae,Aconitum,Japan,Japan,,Ichinoseki-shi,,Iwate,Eastern Asia,Japan,,,,,,,,,,,,http://data.gbif.org/occurrences/93879509,http://data.gbif.org/ws/rest/occurrence/get?key=93879509
"National Museum of Nature and Science, Japan",Angiosperm specimens of Iwate Prefectural Museum,,,,,,,IPMM,PA,41286,Specimen,,59:23.0,,,Aconitum jaluense Kom.  subsp. iwatekense (Nakai) Kadota,Kom.,Aconitum jaluense subsp. iwatekense (Nakai) Kadota,Plantae,Angiospermae,Dicotyledoneae,Ranunculales,Ranunculaceae,Aconitum,Japan,Japan,,Ichinoseki-shi,,Iwate,Eastern Asia,Japan,,,,,,,,,,,,http://data.gbif.org/occurrences/204230994,http://data.gbif.org/ws/rest/occurrence/get?key=204230994
"National Museum of Nature and Science, Japan",Angiosperm specimens of Iwate Prefectural Museum,,,,,,,IPMM,PA,22669,Specimen,,59:21.0,,,Aconitum jaluense Kom.  subsp. iwatekense (Nakai) Kadota,Kom.,Aconitum jaluense subsp. iwatekense (Nakai) Kadota,Plantae,Angiospermae,Dicotyledoneae,Ranunculales,Ranunculaceae,Aconitum,Japan,Japan,,Shimohei-gun Iwaizumicho,,Iwate,Eastern Asia,Japan,,,,,,,,,,,,http://data.gbif.org/occurrences/204230553,http://data.gbif.org/ws/rest/occurrence/get?key=204230553
"National Museum of Nature and Science, Japan",Angiosperm specimens of Iwate Prefectural Museum,,,,,,,IPMM,PA,22668,Specimen,,59:21.0,,,Aconitum jaluense Kom.  subsp. iwatekense (Nakai) Kadota,Kom.,Aconitum jaluense subsp. iwatekense (Nakai) Kadota,Plantae,Angiospermae,Dicotyledoneae,Ranunculales,Ranunculaceae,Aconitum,Japan,Japan,,Shimohei-gun Iwaizumicho,,Iwate,Eastern Asia,Japan,,,,,,,,,,,,http://data.gbif.org/occurrences/204230552,http://data.gbif.org/ws/rest/occurrence/get?key=204230552
"National Museum of Nature and Science, Japan",Angiosperm specimens of Iwate Prefectural Museum,,,,,,,IPMM,PA,22666,Specimen,,59:21.0,,,Aconitum jaluense Kom.  subsp. iwatekense (Nakai) Kadota,Kom.,Aconitum jaluense subsp. iwatekense (Nakai) Kadota,Plantae,Angiospermae,Dicotyledoneae,Ranunculales,Ranunculaceae,Aconitum,Japan,Japan,,Ichinoseki-shi,,Iwate,Eastern Asia,Japan,,,,,,,,,,,,http://data.gbif.org/occurrences/204230550,http://data.gbif.org/ws/rest/occurrence/get?key=204230550
"National Museum of Nature and Science, Japan",Angiosperm specimens of Iwate Prefectural Museum,,,,,,,IPMM,PA,41285,Specimen,,59:23.0,,,Aconitum jaluense Kom.  subsp. iwatekense (Nakai) Kadota,Kom.,Aconitum jaluense subsp. iwatekense (Nakai) Kadota,Plantae,Angiospermae,Dicotyledoneae,Ranunculales,Ranunculaceae,Aconitum,Japan,Japan,,Hachimantai-shi,,Iwate,Eastern Asia,Japan,,,,,,,,,,,,http://data.gbif.org/occurrences/204230993,http://data.gbif.org/ws/rest/occurrence/get?key=204230993
"National Museum of Nature and Science, Japan","Gunma Museum of Natural History, Vascular Plant Specimen",,,,,,,GMNHJ,plant,BS0070372,Specimen,,34:00.0,,,Aconitum jaluense Kom.  subsp. iwatekense (Nakai) Kadota,,Aconitum jaluense subsp. iwatekense (Nakai) Kadota,Plantae,Spermatophyta,,,Ranunculaceae,Aconitum,Japan,Japan,"Hoshimata,Agatsuma Mine",Agatsuma-gun Tsumagoimura,,Gunma,Eastern Asia,Japan,,,,,,,,,,,,http://data.gbif.org/occurrences/188200181,http://data.gbif.org/ws/rest/occurrence/get?key=188200181
"National Museum of Nature and Science, Japan","Gunma Museum of Natural History, Vascular Plant Specimen",,,,,,,GMNHJ,plant,BS0066778,Specimen,,34:00.0,,,Aconitum jaluense Kom.  subsp. iwatekense (Nakai) Kadota,,Aconitum jaluense subsp. iwatekense (Nakai) Kadota,Plantae,Spermatophyta,,,Ranunculaceae,Aconitum,Japan,Japan,"Akagisan,Northern side of Lake Ono, Mt. Akagi",Seta-gun Fujimimura,,Gunma,Eastern Asia,Japan,,,,,,,,,,,,http://data.gbif.org/occurrences/188200293,http://data.gbif.org/ws/rest/occurrence/get?key=188200293
"National Museum of Nature and Science, Japan","Gunma Museum of Natural History, Vascular Plant Specimen",,,,,,,GMNHJ,plant,BS0056966,Specimen,,34:00.0,,,Aconitum jaluense Kom. subsp. iwatekense (Nakai) Kadota,Kom.,Aconitum jaluense subsp. iwatekense (Nakai) Kadota,Plantae,Spermatophyta,Dicotyledoneae,,Ranunculaceae,Aconitum,Japan,Japan,,Annaka-shi,,Gunma,Eastern Asia,Japan,,,,,,,,,,,,http://data.gbif.org/occurrences/234489069,http://data.gbif.org/ws/rest/occurrence/get?key=234489069
"National Museum of Nature and Science, Japan","Gunma Museum of Natural History, Vascular Plant Specimen",,,,,,,GMNHJ,Plant,BS0057371,Specimen,,34:00.0,,,Aconitum jaluense Kom. subsp. iwatekense (Nakai) Kadota,Kom.,Aconitum jaluense subsp. iwatekense (Nakai) Kadota,Plantae,Spermatophyta,Dicotyledoneae,,Ranunculaceae,Aconitum,Japan,Japan,,,,Gunma,Eastern Asia,Japan,,,,,,,,,,,,http://data.gbif.org/occurrences/234489142,http://data.gbif.org/ws/rest/occurrence/get?key=234489142
"National Museum of Nature and Science, Japan","Gunma Museum of Natural History, Vascular Plant Specimen",,,,,,,GMNHJ,plant,BS0006704,Specimen,,34:03.0,,,Aconitum jaluense Kom. subsp. iwatekense (Nakai) Kadota,Kom.,Aconitum jaluense subsp. iwatekense (Nakai) Kadota,Plantae,Spermatophyta,Dicotyledoneae,,Ranunculaceae,Aconitum,Japan,Japan,"Torii Pass,Tashiro",Agatsuma-gun Tsumagoimura,,Gunma,Eastern Asia,Japan,,,,,,,,,1370,1370,,http://data.gbif.org/occurrences/394050183,http://data.gbif.org/ws/rest/occurrence/get?key=394050183
"National Museum of Nature and Science, Japan","Gunma Museum of Natural History, Vascular Plant Specimen",,,,,,,GMNHJ,plant,BS0011112,Specimen,,34:03.0,,,Aconitum jaluense Kom. subsp. iwatekense (Nakai) Kadota,Kom.,Aconitum jaluense subsp. iwatekense (Nakai) Kadota,Plantae,Spermatophyta,Dicotyledoneae,,Ranunculaceae,Aconitum,Japan,Japan,"Midway Otani to Oishi,Hagyu",Agatsuma-gun Higashiagatsumamachi,,Gunma,Eastern Asia,Japan,,,,,,,,,695,695,,http://data.gbif.org/occurrences/394050204,http://data.gbif.org/ws/rest/occurrence/get?key=394050204
"National Museum of Nature and Science, Japan",Angiosperm specimens of Iwate Prefectural Museum,,,,,,,IPMM,PA,117916,Specimen,,59:23.0,,,Aconitum metajaponicum Nakai var. iwatense (Nakai) Tamura et Namba,Nakai,Aconitum metajaponicum var. iwatense (Nakai) Tamura & Namba,Plantae,Angiospermae,Dicotyledoneae,,Ranunculaceae,Aconitum,Japan,Japan,,Kamaishi-shi,,Iwate,Eastern Asia,Japan,,,,,,,,,,,,http://data.gbif.org/occurrences/204231067,http://data.gbif.org/ws/rest/occurrence/get?key=204231067
