Data Publisher,Dataset,Dataset Rights,Collector name,Collector number,Field number,GUID,Date collected,Institution code,Collection code,Catalogue number,Basis of record,Image url,Last indexed,Identifier,Identification date,Scientific name,Author,Scientific name (interpreted),Kingdom,Phylum,Class,Order,Family,Genus,Country,Country (interpreted),Locality,County,Continent or Ocean,State/Province,Region,Publisher country,Latitude,Longitude,Coordinate precision,Cell id,Centi cell id,Min depth,Max depth,Max depth,Min altitude,Max altitude,Altitude precision,GBIF portal url,GBIF webservice url
"National Museum of Nature and Science, Japan",Angiosperm specimens of Iwate Prefectural Museum,,,,,,,IPMM,PA,74668,Specimen,,59:24.0,,,Asarum fauriei Franch.,Franch.,Asarum fauriei Franch.,Plantae,Angiospermae,Dicotyledoneae,,Aristolochiaceae,Asarum,Japan,Japan,,Tono-shi,,Iwate,Eastern Asia,Japan,,,,,,,,,,,,http://data.gbif.org/occurrences/93881242,http://data.gbif.org/ws/rest/occurrence/get?key=93881242
"National Museum of Nature and Science, Japan",Angiosperm specimens of Iwate Prefectural Museum,,,,,,,IPMM,PA,70558,Specimen,,59:24.0,,,Asarum fauriei Franch.,Franch.,Asarum fauriei Franch.,Plantae,Angiospermae,Dicotyledoneae,,Aristolochiaceae,Asarum,Japan,Japan,,Ichinoseki-shi,,Iwate,Eastern Asia,Japan,,,,,,,,,,,,http://data.gbif.org/occurrences/93881256,http://data.gbif.org/ws/rest/occurrence/get?key=93881256
"National Museum of Nature and Science, Japan",Angiosperm specimens of Iwate Prefectural Museum,,,,,,,IPMM,PA,70559,Specimen,,59:24.0,,,Asarum fauriei Franch.,Franch.,Asarum fauriei Franch.,Plantae,Angiospermae,Dicotyledoneae,,Aristolochiaceae,Asarum,Japan,Japan,,Waga-gun Nishiwagamachi,,Iwate,Eastern Asia,Japan,,,,,,,,,,,,http://data.gbif.org/occurrences/93881240,http://data.gbif.org/ws/rest/occurrence/get?key=93881240
"National Museum of Nature and Science, Japan","FKSE-Herbarium specimens of Faculty of Symbiotic Systems Science, Fukushima University, Japan",,,,,,,FKSE,Plant,62373,Specimen,,51:03.0,,,Asarum fauriei Franch.,Franch.,Asarum fauriei Franch.,Plantae,,,,ARISTOLOCHIACEAE,Asarum,Japan,Japan,,Fukushima-shi,,Fukushima,Eastern Asia,Japan,,,,,,,,,,,,http://data.gbif.org/occurrences/391286831,http://data.gbif.org/ws/rest/occurrence/get?key=391286831
"National Museum of Nature and Science, Japan","FKSE-Herbarium specimens of Faculty of Symbiotic Systems Science, Fukushima University, Japan",,,,,,,FKSE,Plant,14942,Specimen,,50:59.0,,,Asarum fauriei Franch.,Franch.,Asarum fauriei Franch.,Plantae,,,,ARISTOLOCHIACEAE,Asarum,Japan,Japan,,Fukushima-shi,,Fukushima,Eastern Asia,Japan,,,,,,,,,,,,http://data.gbif.org/occurrences/238088378,http://data.gbif.org/ws/rest/occurrence/get?key=238088378
"Royal Botanic Gardens, Kew","Royal Botanic Gardens, Kew",http://www.kew.org/aboutus/legal.html,Faurie,2027,,,,K,Herbarium,K000634518,Specimen,,55:14.0,,,Asarum fauriei Franch.,Franch.,Asarum fauriei Franch.,Plantae,,,,ARISTOLOCHIACEAE,Asarum,Japan,Japan,environs de Hirosaki village de Kamegaska,,,,Eastern Asia,United Kingdom,,,,,,,,,,,,http://data.gbif.org/occurrences/234364584,http://data.gbif.org/ws/rest/occurrence/get?key=234364584
"National Museum of Nature and Science, Japan",Vascular plant specimens of Akita Prefectural Museum,,,,,,,AKPM,vs,45825,Specimen,,39:09.0,,,Asarum fauriei Franch.,Franch.,Asarum fauriei Franch.,Plantae,Spermatophyta,Dicotyledoneae,,Aristolochiaceae,Asarum,Japan,Japan,,Semboku-gun Kakunodatemachi,,Akita,Eastern Asia,Japan,,,,,,,,,,,,http://data.gbif.org/occurrences/296209085,http://data.gbif.org/ws/rest/occurrence/get?key=296209085
"National Museum of Nature and Science, Japan",Vascular plant specimens of Akita Prefectural Museum,,,,,,,AKPM,vs,13569,Specimen,,39:09.0,,,Asarum fauriei Franch.,Franch.,Asarum fauriei Franch.,Plantae,Spermatophyta,Dicotyledoneae,,Aristolochiaceae,Asarum,Japan,Japan,,Semboku-gun Nishikimura,,Akita,Eastern Asia,Japan,,,,,,,,,,,,http://data.gbif.org/occurrences/296209074,http://data.gbif.org/ws/rest/occurrence/get?key=296209074
"National Museum of Nature and Science, Japan",Vascular plant specimens of Akita Prefectural Museum,,,,,,,AKPM,vs,45826,Specimen,,39:09.0,,,Asarum fauriei Franch.,Franch.,Asarum fauriei Franch.,Plantae,Spermatophyta,Dicotyledoneae,,Aristolochiaceae,Asarum,Japan,Japan,,Semboku-gun Nishisembokumachi,,Akita,Eastern Asia,Japan,,,,,,,,,,,,http://data.gbif.org/occurrences/296209086,http://data.gbif.org/ws/rest/occurrence/get?key=296209086
"National Museum of Nature and Science, Japan",Vascular plant specimens of Akita Prefectural Museum,,,,,,,AKPM,vs,38541,Specimen,,39:09.0,,,Asarum fauriei Franch.,Franch.,Asarum fauriei Franch.,Plantae,Spermatophyta,Dicotyledoneae,,Aristolochiaceae,Asarum,Japan,Japan,,Semboku-gun Kyowamachi,,Akita,Eastern Asia,Japan,,,,,,,,,,,,http://data.gbif.org/occurrences/296209079,http://data.gbif.org/ws/rest/occurrence/get?key=296209079
"National Museum of Nature and Science, Japan",Vascular plant specimens of Akita Prefectural Museum,,,,,,,AKPM,vs,38542,Specimen,,39:09.0,,,Asarum fauriei Franch.,Franch.,Asarum fauriei Franch.,Plantae,Spermatophyta,Dicotyledoneae,,Aristolochiaceae,Asarum,Japan,Japan,,Kawabe-gun Yuwamachi,,Akita,Eastern Asia,Japan,,,,,,,,,,,,http://data.gbif.org/occurrences/296209080,http://data.gbif.org/ws/rest/occurrence/get?key=296209080
"National Museum of Nature and Science, Japan",Vascular plant specimens of Akita Prefectural Museum,,,,,,,AKPM,vs,13566,Specimen,,39:09.0,,,Asarum fauriei Franch.,Franch.,Asarum fauriei Franch.,Plantae,Spermatophyta,Dicotyledoneae,,Aristolochiaceae,Asarum,Japan,Japan,,Kawabe-gun Kawabemachi,,Akita,Eastern Asia,Japan,,,,,,,,,,,,http://data.gbif.org/occurrences/296209071,http://data.gbif.org/ws/rest/occurrence/get?key=296209071
"National Museum of Nature and Science, Japan",Vascular plant specimens of Akita Prefectural Museum,,,,,,,AKPM,vs,38540,Specimen,,39:09.0,,,Asarum fauriei Franch.,Franch.,Asarum fauriei Franch.,Plantae,Spermatophyta,Dicotyledoneae,,Aristolochiaceae,Asarum,Japan,Japan,,Semboku-gun Sembokumachi,,Akita,Eastern Asia,Japan,,,,,,,,,,,,http://data.gbif.org/occurrences/296209078,http://data.gbif.org/ws/rest/occurrence/get?key=296209078
"National Museum of Nature and Science, Japan",Vascular plant specimens of Akita Prefectural Museum,,,,,,,AKPM,vs,53324,Specimen,,39:09.0,,,Asarum fauriei Franch.,Franch.,Asarum fauriei Franch.,Plantae,Spermatophyta,Dicotyledoneae,,Aristolochiaceae,Asarum,Japan,Japan,,Semboku-gun Kyowamachi,,Akita,Eastern Asia,Japan,,,,,,,,,,,,http://data.gbif.org/occurrences/296209088,http://data.gbif.org/ws/rest/occurrence/get?key=296209088
"National Museum of Nature and Science, Japan",Vascular plant specimens of Akita Prefectural Museum,,,,,,,AKPM,vs,45827,Specimen,,39:11.0,,,Asarum fauriei Franch.,Franch.,Asarum fauriei Franch.,Plantae,Angiospermae,Dicotyledoneae,,Aristolochiaceae,Asarum,Japan,Japan,,Shinjo-shi,,Yamagata,Eastern Asia,Japan,,,,,,,,,,,,http://data.gbif.org/occurrences/624028505,http://data.gbif.org/ws/rest/occurrence/get?key=624028505
"National Museum of Nature and Science, Japan",Vascular plant specimens of Akita Prefectural Museum,,,,,,,AKPM,vs,13568,Specimen,,39:09.0,,,Asarum fauriei Franch.,Franch.,Asarum fauriei Franch.,Plantae,Spermatophyta,Dicotyledoneae,,Aristolochiaceae,Asarum,Japan,Japan,,Kitaakita-gun Takanosumachi,,Akita,Eastern Asia,Japan,,,,,,,,,,,,http://data.gbif.org/occurrences/296209073,http://data.gbif.org/ws/rest/occurrence/get?key=296209073
"National Museum of Nature and Science, Japan",Vascular plant specimens of Akita Prefectural Museum,,,,,,,AKPM,vs,42577,Specimen,,39:09.0,,,Asarum fauriei Franch.,Franch.,Asarum fauriei Franch.,Plantae,Spermatophyta,Dicotyledoneae,,Aristolochiaceae,Asarum,Japan,Japan,,Semboku-gun Tazawakomachi,,Akita,Eastern Asia,Japan,,,,,,,,,,,,http://data.gbif.org/occurrences/296209082,http://data.gbif.org/ws/rest/occurrence/get?key=296209082
"National Museum of Nature and Science, Japan",Vascular plant specimens of Akita Prefectural Museum,,,,,,,AKPM,vs,42578,Specimen,,39:09.0,,,Asarum fauriei Franch.,Franch.,Asarum fauriei Franch.,Plantae,Spermatophyta,Dicotyledoneae,,Aristolochiaceae,Asarum,Japan,Japan,,Yamamoto-gun Futatsuimachi,,Akita,Eastern Asia,Japan,,,,,,,,,,,,http://data.gbif.org/occurrences/296209083,http://data.gbif.org/ws/rest/occurrence/get?key=296209083
"National Museum of Nature and Science, Japan",Vascular plant specimens of Akita Prefectural Museum,,,,,,,AKPM,vs,53327,Specimen,,39:09.0,,,Asarum fauriei Franch.,Franch.,Asarum fauriei Franch.,Plantae,Spermatophyta,Dicotyledoneae,,Aristolochiaceae,Asarum,Japan,Japan,,Semboku-gun Kyowamachi,,Akita,Eastern Asia,Japan,,,,,,,,,,,,http://data.gbif.org/occurrences/296209091,http://data.gbif.org/ws/rest/occurrence/get?key=296209091
"National Museum of Nature and Science, Japan",Vascular plant specimens of Akita Prefectural Museum,,,,,,,AKPM,vs,45828,Specimen,,39:09.0,,,Asarum fauriei Franch.,Franch.,Asarum fauriei Franch.,Plantae,Spermatophyta,Dicotyledoneae,,Aristolochiaceae,Asarum,Japan,Japan,,Semboku-gun Kyowamachi,,Akita,Eastern Asia,Japan,,,,,,,,,,,,http://data.gbif.org/occurrences/296209087,http://data.gbif.org/ws/rest/occurrence/get?key=296209087
"National Museum of Nature and Science, Japan",Vascular plant specimens of Akita Prefectural Museum,,,,,,,AKPM,vs,33505,Specimen,,39:09.0,,,Asarum fauriei Franch.,Franch.,Asarum fauriei Franch.,Plantae,Spermatophyta,Dicotyledoneae,,Aristolochiaceae,Asarum,Japan,Japan,,Semboku-gun Tazawakomachi,,Akita,Eastern Asia,Japan,,,,,,,,,,,,http://data.gbif.org/occurrences/296209075,http://data.gbif.org/ws/rest/occurrence/get?key=296209075
"National Museum of Nature and Science, Japan",Vascular plant specimens of Akita Prefectural Museum,,,,,,,AKPM,vs,13567,Specimen,,39:09.0,,,Asarum fauriei Franch.,Franch.,Asarum fauriei Franch.,Plantae,Spermatophyta,Dicotyledoneae,,Aristolochiaceae,Asarum,Japan,Japan,,Semboku-gun Nishikimura,,Akita,Eastern Asia,Japan,,,,,,,,,,,,http://data.gbif.org/occurrences/296209072,http://data.gbif.org/ws/rest/occurrence/get?key=296209072
"National Museum of Nature and Science, Japan",Vascular plant specimens of Akita Prefectural Museum,,,,,,,AKPM,vs,38538,Specimen,,39:09.0,,,Asarum fauriei Franch.,Franch.,Asarum fauriei Franch.,Plantae,Spermatophyta,Dicotyledoneae,,Aristolochiaceae,Asarum,Japan,Japan,,Kazuno-shi,,Akita,Eastern Asia,Japan,,,,,,,,,,,,http://data.gbif.org/occurrences/296209076,http://data.gbif.org/ws/rest/occurrence/get?key=296209076
"National Museum of Nature and Science, Japan",Vascular plant specimens of Akita Prefectural Museum,,,,,,,AKPM,vs,53325,Specimen,,39:09.0,,,Asarum fauriei Franch.,Franch.,Asarum fauriei Franch.,Plantae,Spermatophyta,Dicotyledoneae,,Aristolochiaceae,Asarum,Japan,Japan,,Semboku-gun Kyowamachi,,Akita,Eastern Asia,Japan,,,,,,,,,,,,http://data.gbif.org/occurrences/296209089,http://data.gbif.org/ws/rest/occurrence/get?key=296209089
"National Museum of Nature and Science, Japan",Vascular plant specimens of Akita Prefectural Museum,,,,,,,AKPM,vs,53328,Specimen,,39:09.0,,,Asarum fauriei Franch.,Franch.,Asarum fauriei Franch.,Plantae,Spermatophyta,Dicotyledoneae,,Aristolochiaceae,Asarum,Japan,Japan,,Semboku-gun Kyowamachi,,Akita,Eastern Asia,Japan,,,,,,,,,,,,http://data.gbif.org/occurrences/296209092,http://data.gbif.org/ws/rest/occurrence/get?key=296209092
"National Museum of Nature and Science, Japan",Vascular plant specimens of Akita Prefectural Museum,,,,,,,AKPM,vs,53326,Specimen,,39:09.0,,,Asarum fauriei Franch.,Franch.,Asarum fauriei Franch.,Plantae,Spermatophyta,Dicotyledoneae,,Aristolochiaceae,Asarum,Japan,Japan,,Semboku-gun Kyowamachi,,Akita,Eastern Asia,Japan,,,,,,,,,,,,http://data.gbif.org/occurrences/296209090,http://data.gbif.org/ws/rest/occurrence/get?key=296209090
"National Museum of Nature and Science, Japan",Vascular plant specimens of Akita Prefectural Museum,,,,,,,AKPM,vs,42576,Specimen,,39:09.0,,,Asarum fauriei Franch.,Franch.,Asarum fauriei Franch.,Plantae,Spermatophyta,Dicotyledoneae,,Aristolochiaceae,Asarum,Japan,Japan,,Semboku-gun Kyowamachi,,Akita,Eastern Asia,Japan,,,,,,,,,,,,http://data.gbif.org/occurrences/296209081,http://data.gbif.org/ws/rest/occurrence/get?key=296209081
"National Museum of Nature and Science, Japan",Vascular plant specimens of Akita Prefectural Museum,,,,,,,AKPM,vs,38539,Specimen,,39:09.0,,,Asarum fauriei Franch.,Franch.,Asarum fauriei Franch.,Plantae,Spermatophyta,Dicotyledoneae,,Aristolochiaceae,Asarum,Japan,Japan,,Semboku-gun Sembokumachi,,Akita,Eastern Asia,Japan,,,,,,,,,,,,http://data.gbif.org/occurrences/296209077,http://data.gbif.org/ws/rest/occurrence/get?key=296209077
"National Museum of Nature and Science, Japan",Vascular plant specimens of Akita Prefectural Museum,,,,,,,AKPM,vs,45824,Specimen,,39:09.0,,,Asarum fauriei Franch.,Franch.,Asarum fauriei Franch.,Plantae,Spermatophyta,Dicotyledoneae,,Aristolochiaceae,Asarum,Japan,Japan,,Kitaakita-gun Takanosumachi,,Akita,Eastern Asia,Japan,,,,,,,,,,,,http://data.gbif.org/occurrences/296209084,http://data.gbif.org/ws/rest/occurrence/get?key=296209084
"National Institute of Genetics, ROIS","Herbarium Specimens of Museum of Nature and Human Activities, Hyogo Pref., Japan",,,,,,,HYO,VP,C1-080170,Specimen,,22:54.0,,,Heterotropa fauriei,,Heterotropa fauriei,Plantae,Magnoliophyta,,,Aristolochiaceae,Heterotropa,Japan,Japan,"Hirugano, Gujo-gun, Hirugano",,,Gifu,Eastern Asia,Japan,,,,,,,,,,,,http://data.gbif.org/occurrences/323502749,http://data.gbif.org/ws/rest/occurrence/get?key=323502749
"National Museum of Nature and Science, Japan","Herbarium Specimens of Museum of Nature and Human Activities, Hyogo Prefecture, Japan",,,,,,,HYO,HYO-C,C1-080170,Specimen,,26:22.0,,,Heterotropa fauriei (Franch.) F.Maek.,(Franch.) F.Maek.,Heterotropa fauriei (Franch.) F.Maek.,Plantae,Magnoliophyta,Magnoliopsida,Aristolochiales,Aristolochiaceae,Heterotropa,Japan,Japan,,,,Gifu,Eastern Asia,Japan,,,,,,,,,,,,http://data.gbif.org/occurrences/177360827,http://data.gbif.org/ws/rest/occurrence/get?key=177360827
