Data Publisher,Dataset,Dataset Rights,Collector name,Collector number,Field number,GUID,Date collected,Institution code,Collection code,Catalogue number,Basis of record,Image url,Last indexed,Identifier,Identification date,Scientific name,Author,Scientific name (interpreted),Kingdom,Phylum,Class,Order,Family,Genus,Country,Country (interpreted),Locality,County,Continent or Ocean,State/Province,Region,Publisher country,Latitude,Longitude,Coordinate precision,Cell id,Centi cell id,Min depth,Max depth,Max depth,Min altitude,Max altitude,Altitude precision,GBIF portal url,GBIF webservice url
"National Institute of Genetics, ROIS",Herbarium Specimens of Bonin and Ryukyu Islands,,,,,,,MAK,ISP,390047,Specimen,,19:04.0,,,Physalis grisea (Waterf.) M.Martinez,,Physalis grisea (Waterf.) M.Martinez,Plantae,,,,Solanaceae,Physalis,Japan,Japan,,,,,Eastern Asia,Japan,24.7762,141.325,,41361,73,,,,85,85,,http://data.gbif.org/occurrences/690761608,http://data.gbif.org/ws/rest/occurrence/get?key=690761608
"National Museum of Nature and Science, Japan","Ibaraki Nature Museum, Vascular Plants collection",,,,,,,INM,Va,50300,Specimen,,53:04.0,,,Physalis grisea (Waterf.) M.Martinez,(Waterf.) M.Martinez,Physalis grisea (Waterf.) M.Martinez,Plantae,ANGIOSPERMAE,DICOTYLEDONEAE,,SOLANACEAE,Physalis,Japan,Japan,,Musashino-shi,,Tokyo,Eastern Asia,Japan,,,,,,,,,,,,http://data.gbif.org/occurrences/381829475,http://data.gbif.org/ws/rest/occurrence/get?key=381829475
"National Museum of Nature and Science, Japan","Ibaraki Nature Museum, Vascular Plants collection",,,,,,,INM,Va,50301,Specimen,,53:04.0,,,Physalis grisea (Waterf.) M.Martinez,(Waterf.) M.Martinez,Physalis grisea (Waterf.) M.Martinez,Plantae,ANGIOSPERMAE,DICOTYLEDONEAE,,SOLANACEAE,Physalis,Japan,Japan,,Musashino-shi,,Tokyo,Eastern Asia,Japan,,,,,,,,,,,,http://data.gbif.org/occurrences/381829476,http://data.gbif.org/ws/rest/occurrence/get?key=381829476
"National Museum of Nature and Science, Japan","Ibaraki Nature Museum, Vascular Plants collection",,,,,,,INM,Va,50299,Specimen,,53:04.0,,,Physalis grisea (Waterf.) M.Martinez,(Waterf.) M.Martinez,Physalis grisea (Waterf.) M.Martinez,Plantae,ANGIOSPERMAE,DICOTYLEDONEAE,,SOLANACEAE,Physalis,Japan,Japan,,Musashino-shi,,Tokyo,Eastern Asia,Japan,,,,,,,,,,,,http://data.gbif.org/occurrences/381829474,http://data.gbif.org/ws/rest/occurrence/get?key=381829474
"National Museum of Nature and Science, Japan","Plant specimens depodited in Osaka Museum of Natural History, Japan.",,,,,,,OSA,OSA,103508,Specimen,,21:52.0,,,Physalis pruinosa L.,L.,Physalis pruinosa L.,Plantae,,,,Solanaceae,Physalis,Japan,Japan,,Yamabe-gun Yamazoemura,,Nara,Eastern Asia,Japan,34.6814,135.822,,44955,68,,,,,,,http://data.gbif.org/occurrences/204385843,http://data.gbif.org/ws/rest/occurrence/get?key=204385843
"National Museum of Nature and Science, Japan",Plant Specimens of Kurashiki Museum of Natural History,,,,,,,KURA,KURA,kt15022,Specimen,,17:04.0,,,Physalis pruinosa L.H.Bailey,L.H.Bailey,Physalis pruinosa L.H.Bailey,Plantae,,,Tubiflorae,Solanaceae,Physalis,Japan,Japan,,Seto-cho,,Okayama,Eastern Asia,Japan,,,,,,,,,,,,http://data.gbif.org/occurrences/204285109,http://data.gbif.org/ws/rest/occurrence/get?key=204285109
"National Museum of Nature and Science, Japan",Plant Specimens of Kurashiki Museum of Natural History,,,,,,,KURA,KURA,kt15021,Specimen,,17:04.0,,,Physalis pruinosa L.H.Bailey,L.H.Bailey,Physalis pruinosa L.H.Bailey,Plantae,,,Tubiflorae,Solanaceae,Physalis,Japan,Japan,,Seto-cho,,Okayama,Eastern Asia,Japan,,,,,,,,,,,,http://data.gbif.org/occurrences/204285108,http://data.gbif.org/ws/rest/occurrence/get?key=204285108
"National Museum of Nature and Science, Japan",Plant Specimens of Kurashiki Museum of Natural History,,,,,,,KURA,KURA,15593,Specimen,,17:04.0,,,Physalis pruinosa L.H.Bailey,L.H.Bailey,Physalis pruinosa L.H.Bailey,Plantae,,,Tubiflorae,Solanaceae,Physalis,Japan,Japan,,Yatsuka-son,,Okayama,Eastern Asia,Japan,,,,,,,,,,,,http://data.gbif.org/occurrences/395785669,http://data.gbif.org/ws/rest/occurrence/get?key=395785669
"National Museum of Nature and Science, Japan",Vascular Plants Collection of Sagamihara City Museum,,,,,,,JSCM,VS,20449,Specimen,,43:38.0,,,Physalis pubescens L. var. grisea Waterfall,L.,Physalis pubescens var. grisea Waterfall,Plantae,Spermatophyta,,,SOLANACEAE,Physalis,Japan,Japan,,Tsukui-gun Shiroyamamachi,,Kanagawa,Eastern Asia,Japan,,,,,,,,,200,,,http://data.gbif.org/occurrences/351225262,http://data.gbif.org/ws/rest/occurrence/get?key=351225262
"National Museum of Nature and Science, Japan",Vascular Plants Collection of Sagamihara City Museum,,,,,,,JSCM,VS,13430,Specimen,,43:37.0,,,Physalis pubescens L. var. grisea Waterfall,L.,Physalis pubescens var. grisea Waterfall,Plantae,Spermatophyta,,,SOLANACEAE,Physalis,Japan,Japan,,Sagamihara-shi,,Kanagawa,Eastern Asia,Japan,,,,,,,,,,,,http://data.gbif.org/occurrences/351224981,http://data.gbif.org/ws/rest/occurrence/get?key=351224981
"National Museum of Nature and Science, Japan",Vascular Plants Collection of Sagamihara City Museum,,,,,,,JSCM,VS,25386,Specimen,,43:38.0,,,Physalis pubescens L. var. grisea Waterfall,L.,Physalis pubescens var. grisea Waterfall,Plantae,Spermatophyta,,,SOLANACEAE,Physalis,Japan,Japan,"Tana, Sagamihara City, Kanagawa Pref.",Sagamihara-shi,,Kanagawa,Eastern Asia,Japan,,,,,,,,,,,,http://data.gbif.org/occurrences/351225433,http://data.gbif.org/ws/rest/occurrence/get?key=351225433
"National Museum of Nature and Science, Japan",Vascular Plant Specimen Database of Kanagawa Prefectural Museum of Natural History,,,,,,,KPM,NA,KPM-NA0126273,Specimen,,29:15.0,,,Physalis pubescens L. var. grisea Waterfall,,Physalis pubescens var. grisea Waterfall,Plantae,Angiospermae,Dicotyledoneae,,SOLANACEAE,Physalis,Japan,Japan,,"Tsukui-gun, Shiroyama-machi",,Kanagawa Prefecture,Eastern Asia,Japan,,,,,,,,,190,,,http://data.gbif.org/occurrences/388851539,http://data.gbif.org/ws/rest/occurrence/get?key=388851539
"National Museum of Nature and Science, Japan",Vascular Plant Specimen Database of Kanagawa Prefectural Museum of Natural History,,,,,,,KPM,NA,KPM-NA0116631,Specimen,,29:15.0,,,Physalis pubescens L. var. grisea Waterfall,,Physalis pubescens var. grisea Waterfall,Plantae,Angiospermae,Dicotyledoneae,,SOLANACEAE,Physalis,Japan,Japan,,Sagamihara-shi,,Kanagawa Prefecture,Eastern Asia,Japan,,,,,,,,,,,,http://data.gbif.org/occurrences/388851489,http://data.gbif.org/ws/rest/occurrence/get?key=388851489
"National Museum of Nature and Science, Japan",Vascular Plant Specimen Database of Kanagawa Prefectural Museum of Natural History,,,,,,,KPM,NA,KPM-NA1021203,Specimen,,29:12.0,,,Physalis pubescens L. var. grisea Waterfall,,Physalis pubescens var. grisea Waterfall,Plantae,Angiospermae,Dicotyledoneae,,SOLANACEAE,Physalis,Japan,Japan,Higashioogishima,"Kawasaki-shi, Kawasaki-ku",,Kanagawa Prefecture,Eastern Asia,Japan,35.4991,139.766,,45319,47,,,,,,,http://data.gbif.org/occurrences/234428011,http://data.gbif.org/ws/rest/occurrence/get?key=234428011
