Data Publisher,Dataset,Dataset Rights,Collector name,Collector number,Field number,GUID,Date collected,Institution code,Collection code,Catalogue number,Basis of record,Image url,Last indexed,Identifier,Identification date,Scientific name,Author,Scientific name (interpreted),Kingdom,Phylum,Class,Order,Family,Genus,Country,Country (interpreted),Locality,County,Continent or Ocean,State/Province,Region,Publisher country,Latitude,Longitude,Coordinate precision,Cell id,Centi cell id,Min depth,Max depth,Max depth,Min altitude,Max altitude,Altitude precision,GBIF portal url,GBIF webservice url
"National Institute of Genetics, ROIS","Herbarium Specimens of Museum of Nature and Human Activities, Hyogo Pref., Japan",,,,,,,HYO,VP,C1-131918,Specimen,,26:43.0,Toshio Tanaka,,Malva moschata,,Malva moschata,Plantae,Magnoliophyta,,,Malvaceae,Malva,Japan,Japan,"pref.Hokkaido:Jouzannkei,Minami-ku,Sapporo-city.",,,Hokkaido,Eastern Asia,Japan,,,,,,,,,,,,http://data.gbif.org/occurrences/323523958,http://data.gbif.org/ws/rest/occurrence/get?key=323523958
"National Museum of Nature and Science, Japan",Angiosperm specimens of Iwate Prefectural Museum,,,,,,,IPMM,PA,75702,Specimen,,59:50.0,,,Malva moschata L.,L.,Malva moschata L.,Plantae,Angiospermae,Dicotyledoneae,,Malvaceae,Malva,Japan,Japan,,Tono-shi,,Iwate,Eastern Asia,Japan,,,,,,,,,,,,http://data.gbif.org/occurrences/93886642,http://data.gbif.org/ws/rest/occurrence/get?key=93886642
"National Museum of Nature and Science, Japan","Herbarium Specimens of Museum of Nature and Human Activities, Hyogo Prefecture, Japan",,,,,,,HYO,C1,C1-048053,Specimen,,27:15.0,,,Malva moschata L.,L.,Malva moschata L.,Plantae,,,,Malvaceae,Malvaceae,JAPAN,Japan,Shibetsu-toge,Shibetsu-shi,,Pref. Hokkaido:,Eastern Asia,Japan,44.12,44.12,,48464,11,,,,,,,http://data.gbif.org/occurrences/204209222,http://data.gbif.org/ws/rest/occurrence/get?key=204209222
"National Museum of Nature and Science, Japan","Herbarium Specimens of Museum of Nature and Human Activities, Hyogo Prefecture, Japan",,,,,,,HYO,C1,C1-131918,Specimen,,27:15.0,,,Malva moschata L.,L.,Malva moschata L.,Plantae,,,,Malvaceae,Malvaceae,JAPAN,Japan,,"Sapporo-shi, Minami-ku, Teizankei",,Pref. Hokkaido:,Eastern Asia,Japan,43.05,43.05,,48103,0,,,,,,,http://data.gbif.org/occurrences/204209221,http://data.gbif.org/ws/rest/occurrence/get?key=204209221
"National Museum of Nature and Science, Japan","Ibaraki Nature Museum, Vascular Plants collection",,,,,,,INM,Va,50334,Specimen,,52:27.0,,,Malva moschata L.,L.,Malva moschata L.,Plantae,ANGIOSPERMAE,DICOTYLEDONEAE,,MALVACEAE,Malva,Japan,Japan,,Ishikari-shi,,Hokkaido,Eastern Asia,Japan,,,,,,,,,,,,http://data.gbif.org/occurrences/381821978,http://data.gbif.org/ws/rest/occurrence/get?key=381821978
"National Museum of Nature and Science, Japan","Ibaraki Nature Museum, Vascular Plants collection",,,,,,,INM,Va,50333,Specimen,,52:27.0,,,Malva moschata L.,L.,Malva moschata L.,Plantae,ANGIOSPERMAE,DICOTYLEDONEAE,,MALVACEAE,Malva,Japan,Japan,,Ishikari-shi,,Hokkaido,Eastern Asia,Japan,,,,,,,,,,,,http://data.gbif.org/occurrences/381821977,http://data.gbif.org/ws/rest/occurrence/get?key=381821977
"National Museum of Nature and Science, Japan","Ibaraki Nature Museum, Vascular Plants collection",,,,,,,INM,Va,50332,Specimen,,52:27.0,,,Malva moschata L.,L.,Malva moschata L.,Plantae,ANGIOSPERMAE,DICOTYLEDONEAE,,MALVACEAE,Malva,Japan,Japan,,Ishikari-shi,,Hokkaido,Eastern Asia,Japan,,,,,,,,,,,,http://data.gbif.org/occurrences/381821976,http://data.gbif.org/ws/rest/occurrence/get?key=381821976
"National Museum of Nature and Science, Japan",Plant Specimens of Kurashiki Museum of Natural History,,,,,,,KURA,KURA,121586,Specimen,,16:13.0,,,Malva moschata L.,L.,Malva moschata L.,Plantae,,,,Malvaceae,Malva,Japan,Japan,,,,Hokkaido,Eastern Asia,Japan,,,,,,,,,,,,http://data.gbif.org/occurrences/43149142,http://data.gbif.org/ws/rest/occurrence/get?key=43149142
"National Museum of Nature and Science, Japan","Plant specimens depodited in Osaka Museum of Natural History, Japan.",,,,,,,OSA,C,OSA34021,Specimen,,20:58.0,,,Malva moschata L.,L.,Malva moschata L.,Plantae,,,,Malvaceae,Malva,Japan,Japan,Shanai,Soya-shicho Hamatonbetsu-cho,,Hokkaido Prefecture,Eastern Asia,Japan,,,,,,,,,,,,http://data.gbif.org/occurrences/295147835,http://data.gbif.org/ws/rest/occurrence/get?key=295147835
"National Museum of Nature and Science, Japan","Plant specimens depodited in Osaka Museum of Natural History, Japan.",,,,,,,OSA,C,OSA23596,Specimen,,20:58.0,,,Malva moschata L.,L.,Malva moschata L.,Plantae,,,,Malvaceae,Malva,Japan,Japan,Nukabira,,,Hokkaido Prefecture,Eastern Asia,Japan,,,,,,,,,,,,http://data.gbif.org/occurrences/295147740,http://data.gbif.org/ws/rest/occurrence/get?key=295147740
"National Museum of Nature and Science, Japan",Vascular Plant Specimen Database of Kanagawa Prefectural Museum of Natural History,,,,,,,KPM,NA,KPM-NA0095751,Specimen,,28:07.0,,,Malva moschata L.,,Malva moschata L.,Plantae,Angiospermae,Dicotyledoneae,,MALVACEAE,Malva,Japan,Japan,,"Esashi-gun, Hamatonbetsu-cho",,Hokkaido,Eastern Asia,Japan,,,,,,,,,,,,http://data.gbif.org/occurrences/388842680,http://data.gbif.org/ws/rest/occurrence/get?key=388842680
Royal Botanic Garden Edinburgh,RBGE Herbarium (E),Copyright Royal Botanic Garden Edinburgh. Contact us for rights to commercial use.,"Asai, Y.",7441,,,00:00.0,E,E,E00261217,Specimen,,33:07.0,,,Malva moschata L.,,Malva moschata L.,,,,,Malvaceae,Malva,JP,Japan,,,,,Eastern Asia,,,,,,,,,,,,,http://data.gbif.org/occurrences/574855006,http://data.gbif.org/ws/rest/occurrence/get?key=574855006
