Data Publisher,Dataset,Dataset Rights,Collector name,Collector number,Field number,GUID,Date collected,Institution code,Collection code,Catalogue number,Basis of record,Image url,Last indexed,Identifier,Identification date,Scientific name,Author,Scientific name (interpreted),Kingdom,Phylum,Class,Order,Family,Genus,Country,Country (interpreted),Locality,County,Continent or Ocean,State/Province,Region,Publisher country,Latitude,Longitude,Coordinate precision,Cell id,Centi cell id,Min depth,Max depth,Max depth,Min altitude,Max altitude,Altitude precision,GBIF portal url,GBIF webservice url
"National Museum of Nature and Science, Japan",Angiosperm specimens of Iwate Prefectural Museum,,,,,,,IPMM,PA,22828,Specimen,,59:51.0,,,Lobularia maritima (L.) Desv.,(L.) Desv.,Lobularia maritima (L.) Desv.,Plantae,Angiospermae,Dicotyledoneae,Papaverales,Cruciferae,Lobularia,Japan,Japan,,Kamo-gun Minamiizucho,,Shizuoka,Eastern Asia,Japan,,,,,,,,,,,,http://data.gbif.org/occurrences/204234119,http://data.gbif.org/ws/rest/occurrence/get?key=204234119
"National Museum of Nature and Science, Japan","Gunma Museum of Natural History, Vascular Plant Specimen",,,,,,,GMNHJ,plant,BS0070268,Specimen,,35:10.0,,,Lobularia maritima (L.) Desv.,,Lobularia maritima (L.) Desv.,Plantae,Spermatophyta,,,Cruciferae,Lobularia,Japan,Japan,Mihara,Agatsuma-gun Tsumagoimura,,Gunma,Eastern Asia,Japan,36.5372,138.548,,45678,55,,,,,,,http://data.gbif.org/occurrences/188205039,http://data.gbif.org/ws/rest/occurrence/get?key=188205039
"National Museum of Nature and Science, Japan","Herbarium Specimens of Tokushima Prefectural Museum, Japan",,,,,,,TKPM,B,SP007442,Specimen,,23:03.0,,,Lobularia maritima (L.) Desv.,(L.) Desv.,Lobularia maritima (L.) Desv.,Plantae,Angiospermae,Dicotyledoneae,Angiospermae,Cruciferae,Lobularia,Japan,Japan,,Tokushima City,,Tokushima Pref.,Eastern Asia,Japan,,,,,,,,,,,,http://data.gbif.org/occurrences/150141188,http://data.gbif.org/ws/rest/occurrence/get?key=150141188
"National Museum of Nature and Science, Japan","Herbarium Specimens of Tokushima Prefectural Museum, Japan",,,,,,,TKPM,B,SP037786,Specimen,,23:04.0,,,Lobularia maritima (L.) Desv.,(L.) Desv.,Lobularia maritima (L.) Desv.,Plantae,Angiospermae,Dicotyledoneae,Angiospermae,Cruciferae,Lobularia,Japan,Japan,,Tokushima City,,Tokushima Pref.,Eastern Asia,Japan,,,,,,,,,,,,http://data.gbif.org/occurrences/150141381,http://data.gbif.org/ws/rest/occurrence/get?key=150141381
"National Museum of Nature and Science, Japan",Vascular plants collection of Hiratsuka City Museum,,,,,,,HCM,56,76141,Specimen,,15:45.0,,,Lobularia maritima (L.) Desv.,(L.) Desv.,Lobularia maritima (L.) Desv.,Plantae,,,,Cruciferae,Lobularia,Japan,Japan,,Hiratsuka-shi,,Kanagawa,Eastern Asia,Japan,,,,,,,,,,,,http://data.gbif.org/occurrences/385733757,http://data.gbif.org/ws/rest/occurrence/get?key=385733757
"National Museum of Nature and Science, Japan",Vascular plants collection of Hiratsuka City Museum,,,,,,,HCM,56,75803,Specimen,,15:45.0,,,Lobularia maritima (L.) Desv.,(L.) Desv.,Lobularia maritima (L.) Desv.,Plantae,,,,Cruciferae,Lobularia,Japan,Japan,,Hadano-shi,,Kanagawa,Eastern Asia,Japan,,,,,,,,,,,,http://data.gbif.org/occurrences/385733751,http://data.gbif.org/ws/rest/occurrence/get?key=385733751
"National Museum of Nature and Science, Japan",Vascular Plant Specimen Database of Kanagawa Prefectural Museum of Natural History,,,,,,,KPM,NA,KPM-NA0137481,Specimen,,27:51.0,,,Lobularia maritima (L.) Desv.,,Lobularia maritima (L.) Desv.,Plantae,Angiospermae,Dicotyledoneae,,BRASSICACEAE (CRUCIFERAE),Lobularia,Japan,Japan,,"Tsukui-gun, Tsukui-machi",,Kanagawa Prefecture,Eastern Asia,Japan,,,,,,,,,140,,,http://data.gbif.org/occurrences/388840396,http://data.gbif.org/ws/rest/occurrence/get?key=388840396
"National Museum of Nature and Science, Japan",Vascular Plant Specimen Database of Kanagawa Prefectural Museum of Natural History,,,,,,,KPM,NA,KPM-NA0108484,Specimen,,27:50.0,,,Lobularia maritima (L.) Desv.,,Lobularia maritima (L.) Desv.,Plantae,Angiospermae,Dicotyledoneae,,BRASSICACEAE (CRUCIFERAE),Lobularia,Japan,Japan,,"Yokohama-shi, Tsuzuki-ku",,Kanagawa Prefecture,Eastern Asia,Japan,,,,,,,,,,,,http://data.gbif.org/occurrences/388840323,http://data.gbif.org/ws/rest/occurrence/get?key=388840323
"National Museum of Nature and Science, Japan",Vascular plant specimens of Akita Prefectural Museum,,,,,,,AKPM,vs,47217,Specimen,,41:02.0,,,Lobularia maritima (L.) Desv.,(L.) Desv.,Lobularia maritima (L.) Desv.,Plantae,Spermatophyta,Dicotyledoneae,,Brassicaceae,Lobularia,Japan,Japan,Soegawa Asahikawa Koen,Akita-shi,,Akita,Eastern Asia,Japan,,,,,,,,,,,,http://data.gbif.org/occurrences/296215367,http://data.gbif.org/ws/rest/occurrence/get?key=296215367
"National Museum of Nature and Science, Japan",Vascular Plants Collection of Sagamihara City Museum,,,,,,,JSCM,VS,12169,Specimen,,43:19.0,,,Lobularia maritima (L.) Desy.,(L.) Desy.,Lobularia maritima (L.) Desy.,Plantae,Spermatophyta,,,CRUCIFERAE,Lobularia,Japan,Japan,,Yamato-shi,,Kanagawa,Eastern Asia,Japan,,,,,,,,,,,,http://data.gbif.org/occurrences/351222241,http://data.gbif.org/ws/rest/occurrence/get?key=351222241
"National Museum of Nature and Science, Japan",Vascular Plants Collection of Sagamihara City Museum,,,,,,,JSCM,VS,12497,Specimen,,43:19.0,,,Lobularia maritima (L.) Desy.,(L.) Desy.,Lobularia maritima (L.) Desy.,Plantae,Spermatophyta,,,CRUCIFERAE,Lobularia,Japan,Japan,,Sagamihara-shi,,Kanagawa,Eastern Asia,Japan,,,,,,,,,,,,http://data.gbif.org/occurrences/351222257,http://data.gbif.org/ws/rest/occurrence/get?key=351222257
"National Museum of Nature and Science, Japan",Vascular plants database of Atugi City Museum,,,,,,,JACM,PL14421,JACM-PL14421,Specimen,,29:16.0,,,Lobularia maritima Desy.,,Lobularia maritima Desy.,Plantae,Angiospermae,,,Cruciferae,Lobularia,Japan,Japan,,Ayase-shi,,Kanagawa,Eastern Asia,Japan,,,,,,,,,,,,http://data.gbif.org/occurrences/238037324,http://data.gbif.org/ws/rest/occurrence/get?key=238037324
"National Museum of Nature and Science, Japan",Vascular Plant Specimen Database of Kanagawa Prefectural Museum of Natural History,,,,,,,KPM,NA,KPM-NA1041247,Specimen,,27:48.0,,,Lobularia maritima Desy.,,Lobularia maritima Desy.,Plantae,Angiospermae,Dicotyledoneae,,CRUCIFERAE,Lobularia,Japan,Japan,Fukuda,Yamato-shi,,Kanagawa Prefecture,Eastern Asia,Japan,35.4491,139.466,,45319,44,,,,,,,http://data.gbif.org/occurrences/234425132,http://data.gbif.org/ws/rest/occurrence/get?key=234425132
"National Museum of Nature and Science, Japan",Vascular Plant Specimen Database of Kanagawa Prefectural Museum of Natural History,,,,,,,KPM,NA,KPM-NA1041246,Specimen,,27:48.0,,,Lobularia maritima Desy.,,Lobularia maritima Desy.,Plantae,Angiospermae,Dicotyledoneae,,CRUCIFERAE,Lobularia,Japan,Japan,Kuden-cho,"Yokohama-shi, Totsuka-ku",,Kanagawa Prefecture,Eastern Asia,Japan,35.3574,139.553,,45319,35,,,,,,,http://data.gbif.org/occurrences/234425131,http://data.gbif.org/ws/rest/occurrence/get?key=234425131
