Data Publisher,Dataset,Dataset Rights,Collector name,Collector number,Field number,GUID,Date collected,Institution code,Collection code,Catalogue number,Basis of record,Image url,Last indexed,Identifier,Identification date,Scientific name,Author,Scientific name (interpreted),Kingdom,Phylum,Class,Order,Family,Genus,Country,Country (interpreted),Locality,County,Continent or Ocean,State/Province,Region,Publisher country,Latitude,Longitude,Coordinate precision,Cell id,Centi cell id,Min depth,Max depth,Max depth,Min altitude,Max altitude,Altitude precision,GBIF portal url,GBIF webservice url
"National Museum of Nature and Science, Japan","Botanical specimens database of Mr. Jiro Ito collection, Shizuoka Prefecture Museum of Natural History",,,,,,,SPMN,a,SPMN-a-2120,Specimen,,37:47.0,,,Tricyrtis formosana Baker,Baker,Tricyrtis formosana Baker,Plantae,Magnoliophyta,Liliopsida,Liliales,Liliaceae,Tricyrtis,Japan,Japan,,Shizuoka-shi,,Shizuoka,Eastern Asia,Japan,,,,,,,,,,,,http://data.gbif.org/occurrences/380184486,http://data.gbif.org/ws/rest/occurrence/get?key=380184486
"National Museum of Nature and Science, Japan","Ibaraki Nature Museum, Vascular Plants collection",,,,,,,INM,Va,50641,Specimen,,54:41.0,,,Tricyrtis formosana Baker,Baker,Tricyrtis formosana Baker,Plantae,ANGIOSPERMAE,MONOCOTYLEDONEAE,,LILIACEAE,Tricyrtis,Japan,Japan,,Yamatokoriyama-shi,,Nara,Eastern Asia,Japan,,,,,,,,,,,,http://data.gbif.org/occurrences/381848812,http://data.gbif.org/ws/rest/occurrence/get?key=381848812
"National Museum of Nature and Science, Japan","Ibaraki Nature Museum, Vascular Plants collection",,,,,,,INM,Va,50642,Specimen,,54:41.0,,,Tricyrtis formosana Baker,Baker,Tricyrtis formosana Baker,Plantae,ANGIOSPERMAE,MONOCOTYLEDONEAE,,LILIACEAE,Tricyrtis,Japan,Japan,,Yamatokoriyama-shi,,Nara,Eastern Asia,Japan,,,,,,,,,,,,http://data.gbif.org/occurrences/381848813,http://data.gbif.org/ws/rest/occurrence/get?key=381848813
"National Museum of Nature and Science, Japan","Ibaraki Nature Museum, Vascular Plants collection",,,,,,,INM,Va,54076,Specimen,,54:41.0,,,Tricyrtis formosana Baker,Baker,Tricyrtis formosana Baker,Plantae,ANGIOSPERMAE,MONOCOTYLEDONEAE,,LILIACEAE,Tricyrtis,Japan,Japan,,Inashiki-gun Amimachi,,Ibaraki,Eastern Asia,Japan,,,,,,,,,,,,http://data.gbif.org/occurrences/381848834,http://data.gbif.org/ws/rest/occurrence/get?key=381848834
"National Museum of Nature and Science, Japan",Kochi Prefectural Makino Botanical Garden,,,,,,,MBK,MBK,3944,Specimen,,04:54.0,,,Tricyrtis formosana Baker,Baker,Tricyrtis formosana Baker,Plantae,,,,Liliaceae,Tricyrtis,Japan,Japan,,,,Tokyo,Eastern Asia,Japan,,,,,,,,,,,,http://data.gbif.org/occurrences/287511974,http://data.gbif.org/ws/rest/occurrence/get?key=287511974
"National Museum of Nature and Science, Japan",Kochi Prefectural Makino Botanical Garden,,,,,,,MBK,MBK,3944,Specimen,,02:22.0,,,Tricyrtis formosana Baker,Baker,Tricyrtis formosana Baker,Plantae,,,,Liliaceae,Tricyrtis,Japan,Japan,Tokyo,,,Tokyo,Eastern Asia,Japan,,,,,,,,,,,,http://data.gbif.org/occurrences/354284588,http://data.gbif.org/ws/rest/occurrence/get?key=354284588
"National Museum of Nature and Science, Japan",Kochi Prefectural Makino Botanical Garden,,,,,,,MBK,MBK,3687,Specimen,,23:28.0,,,Tricyrtis formosana Baker,Baker,Tricyrtis formosana Baker,Plantae,,,,Liliaceae,Tricyrtis,Japan,Japan,Tokyo,,,Tokyo,Eastern Asia,Japan,35.5796,139.716,,45319,57,,,,,,,http://data.gbif.org/occurrences/287515474,http://data.gbif.org/ws/rest/occurrence/get?key=287515474
"National Museum of Nature and Science, Japan",Vascular plants collection of Hiratsuka City Museum,,,,,,,HCM,56,73231,Specimen,,16:52.0,,,Tricyrtis formosana Baker,Baker,Tricyrtis formosana Baker,Plantae,,,,Liliaceae,Tricyrtis,Japan,Japan,,Koza-gun Samukawamachi,,Kanagawa,Eastern Asia,Japan,,,,,,,,,,,,http://data.gbif.org/occurrences/385741825,http://data.gbif.org/ws/rest/occurrence/get?key=385741825
"National Museum of Nature and Science, Japan",Vascular Plant Specimen Database of Kanagawa Prefectural Museum of Natural History,,,,,,,KPM,NA,KPM-NA0163709,Specimen,,31:57.0,,,Tricyrtis formosana Baker,,Tricyrtis formosana Baker,Plantae,Angiospermae,Monocotyledoneae,,LILIACEAE,Tricyrtis,Japan,Japan,,"Yokohama-shi, Totsuka-ku",,Kanagawa Prefecture,Eastern Asia,Japan,,,,,,,,,,,,http://data.gbif.org/occurrences/388874793,http://data.gbif.org/ws/rest/occurrence/get?key=388874793
"National Museum of Nature and Science, Japan",Vascular Plant Specimen Database of Kanagawa Prefectural Museum of Natural History,,,,,,,KPM,NA,KPM-NA0163795,Specimen,,31:57.0,,,Tricyrtis formosana Baker,,Tricyrtis formosana Baker,Plantae,Angiospermae,Monocotyledoneae,,LILIACEAE,Tricyrtis,Japan,Japan,,"Yokohama-shi, Sakae-ku",,Kanagawa Prefecture,Eastern Asia,Japan,,,,,,,,,,,,http://data.gbif.org/occurrences/388874794,http://data.gbif.org/ws/rest/occurrence/get?key=388874794
"National Museum of Nature and Science, Japan",Vascular Plant Specimen Database of Kanagawa Prefectural Museum of Natural History,,,,,,,KPM,NA,KPM-NA1071209,Specimen,,31:55.0,,,Tricyrtis formosana Baker,,Tricyrtis formosana Baker,Plantae,Angiospermae,Monocotyledoneae,,LILIACEAE,Tricyrtis,Japan,Japan,,"Yokohama-shi, Hodogaya-ku",,Kanagawa Prefecture,Eastern Asia,Japan,,,,,,,,,,,,http://data.gbif.org/occurrences/295949639,http://data.gbif.org/ws/rest/occurrence/get?key=295949639
"National Museum of Nature and Science, Japan",Vascular Plant Specimen Database of Kanagawa Prefectural Museum of Natural History,,,,,,,KPM,NA,KPM-NA0113493,Specimen,,31:57.0,,,Tricyrtis formosana Baker,,Tricyrtis formosana Baker,Plantae,Angiospermae,Monocotyledoneae,,LILIACEAE,Tricyrtis,Japan,Japan,,"Ashigarashimo-gun, Hakone-machi",,Kanagawa Prefecture,Eastern Asia,Japan,,,,,,,,,,,,http://data.gbif.org/occurrences/388874698,http://data.gbif.org/ws/rest/occurrence/get?key=388874698
"National Museum of Nature and Science, Japan",Vascular Plant Specimen Database of Kanagawa Prefectural Museum of Natural History,,,,,,,KPM,NA,KPM-NA1071210,Specimen,,31:55.0,,,Tricyrtis formosana Baker,,Tricyrtis formosana Baker,Plantae,Angiospermae,Monocotyledoneae,,LILIACEAE,Tricyrtis,Japan,Japan,,"Tsukui-gun, Tsukui-machi",,Kanagawa Prefecture,Eastern Asia,Japan,,,,,,,,,,,,http://data.gbif.org/occurrences/295949640,http://data.gbif.org/ws/rest/occurrence/get?key=295949640
"National Museum of Nature and Science, Japan",Vascular Plant Specimen Database of Kanagawa Prefectural Museum of Natural History,,,,,,,KPM,NA,KPM-NA1071208,Specimen,,31:55.0,,,Tricyrtis formosana Baker,,Tricyrtis formosana Baker,Plantae,Angiospermae,Monocotyledoneae,,LILIACEAE,Tricyrtis,Japan,Japan,,"Tsukui-gun, Sagamiko-machi",,Kanagawa Prefecture,Eastern Asia,Japan,,,,,,,,,,,,http://data.gbif.org/occurrences/295949637,http://data.gbif.org/ws/rest/occurrence/get?key=295949637
