Data Publisher,Dataset,Dataset Rights,Collector name,Collector number,Field number,GUID,Date collected,Institution code,Collection code,Catalogue number,Basis of record,Image url,Last indexed,Identifier,Identification date,Scientific name,Author,Scientific name (interpreted),Kingdom,Phylum,Class,Order,Family,Genus,Country,Country (interpreted),Locality,County,Continent or Ocean,State/Province,Region,Publisher country,Latitude,Longitude,Coordinate precision,Cell id,Centi cell id,Min depth,Max depth,Max depth,Min altitude,Max altitude,Altitude precision,GBIF portal url,GBIF webservice url
"National Institute of Genetics, ROIS","Herbarium Specimens of Museum of Nature and Human Activities, Hyogo Pref., Japan",,,,,,,HYO,VP,C1-115647,Specimen,,25:49.0,T.Fujii,,Oenothera tetraptera,,Oenothera tetraptera,Plantae,Magnoliophyta,,,Onagraceae,Oenothera,Japan,Japan,"Karita, Sumiyoshi-ku, Osaka-shi",,,Osaka,Eastern Asia,Japan,,,,,,,,,,,,http://data.gbif.org/occurrences/323518742,http://data.gbif.org/ws/rest/occurrence/get?key=323518742
"National Institute of Genetics, ROIS","Herbarium Specimens of Museum of Nature and Human Activities, Hyogo Pref., Japan",,,,,,,HYO,VP,C1-113655,Specimen,,27:33.0,T.Fujii,,Oenothera tetraptera,,Oenothera tetraptera,Plantae,Magnoliophyta,,,Onagraceae,Oenothera,Japan,Japan,"Sumiyoshi-ku, Osaka-shi",,,Osaka,Eastern Asia,Japan,,,,,,,,,,,,http://data.gbif.org/occurrences/323528828,http://data.gbif.org/ws/rest/occurrence/get?key=323528828
"National Museum of Nature and Science, Japan","Botanical specimens database of Mr. Jiro Ito collection, Shizuoka Prefecture Museum of Natural History",,,,,,,SPMN,a,SPMN-a-1201,Specimen,,37:41.0,,,Oenothera tetraptera Cav.,Cav.,Oenothera tetraptera Cav.,Plantae,Magnoliophyta,Magnoliopsida,Myrtales,Onagraceae,Oenothera,Japan,Japan,,Shizuoka-shi,,Shizuoka,Eastern Asia,Japan,,,,,,,,,,,,http://data.gbif.org/occurrences/380183194,http://data.gbif.org/ws/rest/occurrence/get?key=380183194
"National Museum of Nature and Science, Japan",Plant Specimens of Kurashiki Museum of Natural History,,,,,,,KURA,KURA,122645,Specimen,,16:35.0,,,Oenothera tetraptera Cav.,Cav.,Oenothera tetraptera Cav.,Plantae,,,,Onagraceae,Oenothera,Japan,Japan,,,,Okayama,Eastern Asia,Japan,,,,,,,,,,,,http://data.gbif.org/occurrences/43155927,http://data.gbif.org/ws/rest/occurrence/get?key=43155927
"National Museum of Nature and Science, Japan","Plant specimens depodited in Osaka Museum of Natural History, Japan.",,,,,,,OSA,C,OSA65389,Specimen,,21:32.0,,,Oenothera tetraptera Cav.,Cav.,Oenothera tetraptera Cav.,Plantae,,,,Onagraceae,Oenothera,Japan,Japan,,Aki-gun Kawagecho,,Mie Prefecture,Eastern Asia,Japan,,,,,,,,,,,,http://data.gbif.org/occurrences/295151433,http://data.gbif.org/ws/rest/occurrence/get?key=295151433
"National Museum of Nature and Science, Japan","Plant specimens depodited in Osaka Museum of Natural History, Japan.",,,,,,,OSA,C,OSA65388,Specimen,,21:32.0,,,Oenothera tetraptera Cav.,Cav.,Oenothera tetraptera Cav.,Plantae,,,,Onagraceae,Oenothera,Japan,Japan,,Aki-gun Kawagecho,,Mie Prefecture,Eastern Asia,Japan,,,,,,,,,,,,http://data.gbif.org/occurrences/295151432,http://data.gbif.org/ws/rest/occurrence/get?key=295151432
"National Museum of Nature and Science, Japan",Vascular plants collection of Hiratsuka City Museum,,,,,,,HCM,56,82287,Specimen,,15:58.0,,,Oenothera tetraptera Cav.,Cav.,Oenothera tetraptera Cav.,Plantae,,,,Onagraceae,Oenothera,Japan,Japan,,Hiratsuka-shi,,Kanagawa,Eastern Asia,Japan,,,,,,,,,,,,http://data.gbif.org/occurrences/385735638,http://data.gbif.org/ws/rest/occurrence/get?key=385735638
"National Museum of Nature and Science, Japan",Vascular plants collection of Hiratsuka City Museum,,,,,,,HCM,56,82257,Specimen,,15:58.0,,,Oenothera tetraptera Cav.,Cav.,Oenothera tetraptera Cav.,Plantae,,,,Onagraceae,Oenothera,Japan,Japan,,Hiratsuka-shi,,Kanagawa,Eastern Asia,Japan,,,,,,,,,,,,http://data.gbif.org/occurrences/385735637,http://data.gbif.org/ws/rest/occurrence/get?key=385735637
"National Museum of Nature and Science, Japan",Vascular Plant Specimen Database of Kanagawa Prefectural Museum of Natural History,,,,,,,KPM,NA,KPM-NA1011991,Specimen,,28:28.0,,,Oenothera tetraptera Cavan,,Oenothera tetraptera Cavan,Plantae,Angiospermae,Dicotyledoneae,,ONAGRACEAE,Oenothera,Japan,Japan,,Yamato-shi,,Kanagawa Prefecture,Eastern Asia,Japan,35.4324,139.466,,45319,44,,,,,,,http://data.gbif.org/occurrences/187997046,http://data.gbif.org/ws/rest/occurrence/get?key=187997046
