Data Publisher,Dataset,Dataset Rights,Collector name,Collector number,Field number,GUID,Date collected,Institution code,Collection code,Catalogue number,Basis of record,Image url,Last indexed,Identifier,Identification date,Scientific name,Author,Scientific name (interpreted),Kingdom,Phylum,Class,Order,Family,Genus,Country,Country (interpreted),Locality,County,Continent or Ocean,State/Province,Region,Publisher country,Latitude,Longitude,Coordinate precision,Cell id,Centi cell id,Min depth,Max depth,Max depth,Min altitude,Max altitude,Altitude precision,GBIF portal url,GBIF webservice url
"National Museum of Nature and Science, Japan",Herbarium of Kitakyushu Museum of Natural History and Human History,,,,,,,KMNH,KMNH,1998910GR22,Specimen,,12:23.0,,,Viola   odorata   L.,,Viola odorata L.,Plantae,,,Violales,Violaceae,Viola,Japan,Japan,"Kuzuhara, Kokuraminami Ward",Kitakyushu City,,Fukuoka  Pref.,Eastern Asia,Japan,,,,,,,,,,,,http://data.gbif.org/occurrences/150199302,http://data.gbif.org/ws/rest/occurrence/get?key=150199302
"National Institute of Genetics, ROIS","Herbarium Specimens of Museum of Nature and Human Activities, Hyogo Pref., Japan",,,,,,,HYO,VP,C1-146178,Specimen,,20:13.0,,,Viola odorata,,Viola odorata,Plantae,Magnoliophyta,,,Violaceae,Viola,Japan,Japan,"Hyogo Pref.; Mihara-gun, Seidan-cho, Matsuho",,,Hyogo,Eastern Asia,Japan,134.65,35.65,,,,,,,20,20,,http://data.gbif.org/occurrences/323476722,http://data.gbif.org/ws/rest/occurrence/get?key=323476722
"National Museum of Nature and Science, Japan",Angiosperm specimens of Iwate Prefectural Museum,,,,,,,IPMM,PA,75712,Specimen,,00:23.0,,,Viola odorata L.,L.,Viola odorata L.,Plantae,Angiospermae,Dicotyledoneae,,Violaceae,Viola,Japan,Japan,,Rikuzentakata-shi,,Iwate,Eastern Asia,Japan,,,,,,,,,,,,http://data.gbif.org/occurrences/93898530,http://data.gbif.org/ws/rest/occurrence/get?key=93898530
"National Museum of Nature and Science, Japan","Botanical specimens database of Mr. Jiro Ito collection, Shizuoka Prefecture Museum of Natural History",,,,,,,SPMN,a,SPMN-a-1090,Specimen,,37:45.0,,,Viola odorata L.,L.,Viola odorata L.,Plantae,Magnoliophyta,Magnoliopsida,Violales,Violaceae,Viola,Japan,Japan,,Shizuoka-shi,,Shizuoka,Eastern Asia,Japan,,,,,,,,,,,,http://data.gbif.org/occurrences/380184130,http://data.gbif.org/ws/rest/occurrence/get?key=380184130
"National Museum of Nature and Science, Japan","FKSE-Herbarium specimens of Faculty of Symbiotic Systems Science, Fukushima University, Japan",,,,,,,FKSE,Plant,2786,Specimen,,53:58.0,,,Viola odorata L.,L.,Viola odorata L.,Plantae,,,,VIOLACEAE,Viola,Japan,Japan,Cultivated,,,,Eastern Asia,Japan,,,,,,,,,,,,http://data.gbif.org/occurrences/238101794,http://data.gbif.org/ws/rest/occurrence/get?key=238101794
"National Museum of Nature and Science, Japan","Herbarium Specimens of Museum of Nature and Human Activities, Hyogo Prefecture, Japan",,,,,,,HYO,C1,C1-146178,Specimen,,29:49.0,,,Viola odorata L.,L.,Viola odorata L.,Plantae,,,,Violaceae,Violaceae,JAPAN,Japan,Imakoura,"Kinosaki-gun, Kasumi-cho",,Pref. Hyogo:,Eastern Asia,Japan,35.39,35.39,,45215,33,,,,,,,http://data.gbif.org/occurrences/204218664,http://data.gbif.org/ws/rest/occurrence/get?key=204218664
"National Museum of Nature and Science, Japan","Herbarium Specimens of Museum of Nature and Human Activities, Hyogo Prefecture, Japan",,,,,,,HYO,HYO-C,C1-191993,Specimen,,29:47.0,,,Viola odorata L.,L.,Viola odorata L.,Plantae,,,,Violaceae,Viola,Japan,Japan,"Nishino, Sakai-shi",,,Osaka,Eastern Asia,Japan,,,,,,,,,,,,http://data.gbif.org/occurrences/177388602,http://data.gbif.org/ws/rest/occurrence/get?key=177388602
"National Museum of Nature and Science, Japan","Ibaraki Nature Museum, Vascular Plants collection",,,,,,,INM,Va,50444,Specimen,,54:59.0,,,Viola odorata L.,L.,Viola odorata L.,Plantae,ANGIOSPERMAE,DICOTYLEDONEAE,,VIOLACEAE,Viola,Japan,Japan,,Sapporo-shi Chuuo-ku,,Hokkaido,Eastern Asia,Japan,,,,,,,,,,,,http://data.gbif.org/occurrences/381852520,http://data.gbif.org/ws/rest/occurrence/get?key=381852520
"National Museum of Nature and Science, Japan","Ibaraki Nature Museum, Vascular Plants collection",,,,,,,INM,Va,50445,Specimen,,54:59.0,,,Viola odorata L.,L.,Viola odorata L.,Plantae,ANGIOSPERMAE,DICOTYLEDONEAE,,VIOLACEAE,Viola,Japan,Japan,,Sapporo-shi Chuuo-ku,,Hokkaido,Eastern Asia,Japan,,,,,,,,,,,,http://data.gbif.org/occurrences/381852521,http://data.gbif.org/ws/rest/occurrence/get?key=381852521
"National Museum of Nature and Science, Japan","Ibaraki Nature Museum, Vascular Plants collection",,,,,,,INM,Va,50443,Specimen,,54:59.0,,,Viola odorata L.,L.,Viola odorata L.,Plantae,ANGIOSPERMAE,DICOTYLEDONEAE,,VIOLACEAE,Viola,Japan,Japan,,Sapporo-shi Chuuo-ku,,Hokkaido,Eastern Asia,Japan,,,,,,,,,,,,http://data.gbif.org/occurrences/381852519,http://data.gbif.org/ws/rest/occurrence/get?key=381852519
"National Museum of Nature and Science, Japan",Plant Specimens of Kurashiki Museum of Natural History,,,,,,,KURA,KURA,kt147690,Specimen,,19:47.0,,,Viola odorata L.,L.,Viola odorata L.,Plantae,,,Violales,Violaceae,Viola,Japan,Japan,,Kasaoka-shi,,Okayama,Eastern Asia,Japan,,,,,,,,,,,,http://data.gbif.org/occurrences/204297322,http://data.gbif.org/ws/rest/occurrence/get?key=204297322
"National Museum of Nature and Science, Japan",Plant Specimens of Kurashiki Museum of Natural History,,,,,,,KURA,KURA,46347,Specimen,,19:47.0,,,Viola odorata L.,,Viola odorata L.,Plantae,,,Violales,Violaceae,Viola,Japan,Japan,Onaricho,Okayama City,,Okayama Prefecture,Eastern Asia,Japan,,,,,,,,,,,,http://data.gbif.org/occurrences/148849357,http://data.gbif.org/ws/rest/occurrence/get?key=148849357
"National Museum of Nature and Science, Japan",Plant Specimens of Kurashiki Museum of Natural History,,,,,,,KURA,KURA,123237,Specimen,,19:46.0,,,Viola odorata L.,L.,Viola odorata L.,Plantae,,,,Violaceae,Viola,Japan,Japan,,,,Hyogo,Eastern Asia,Japan,,,,,,,,,,,,http://data.gbif.org/occurrences/43188931,http://data.gbif.org/ws/rest/occurrence/get?key=43188931
"National Museum of Nature and Science, Japan",Plant Specimens of Kurashiki Museum of Natural History,,,,,,,KURA,KURA,123235,Specimen,,19:46.0,,,Viola odorata L.,L.,Viola odorata L.,Plantae,,,,Violaceae,Viola,Japan,Japan,,,,Aichi,Eastern Asia,Japan,,,,,,,,,,,,http://data.gbif.org/occurrences/43188947,http://data.gbif.org/ws/rest/occurrence/get?key=43188947
"National Museum of Nature and Science, Japan",Plant Specimens of Kurashiki Museum of Natural History,,,,,,,KURA,KURA,67726,Specimen,,19:47.0,,,Viola odorata L.,,Viola odorata L.,Plantae,,,Violales,Violaceae,Viola,Japan,Japan,Megurocho,Okayama City,,Okayama Prefecture,Eastern Asia,Japan,,,,,,,,,,,,http://data.gbif.org/occurrences/148849408,http://data.gbif.org/ws/rest/occurrence/get?key=148849408
"National Museum of Nature and Science, Japan",Plant Specimens of Kurashiki Museum of Natural History,,,,,,,KURA,KURA,123236,Specimen,,19:46.0,,,Viola odorata L.,L.,Viola odorata L.,Plantae,,,,Violaceae,Viola,Japan,Japan,,,,Hyogo,Eastern Asia,Japan,,,,,,,,,,,,http://data.gbif.org/occurrences/43188944,http://data.gbif.org/ws/rest/occurrence/get?key=43188944
"National Museum of Nature and Science, Japan",Plant Specimens of Kurashiki Museum of Natural History,,,,,,,KURA,KURA,123238,Specimen,,19:46.0,,,Viola odorata L.,L.,Viola odorata L.,Plantae,,,,Violaceae,Viola,Japan,Japan,,,,Hyogo,Eastern Asia,Japan,,,,,,,,,,,,http://data.gbif.org/occurrences/43188936,http://data.gbif.org/ws/rest/occurrence/get?key=43188936
"National Museum of Nature and Science, Japan",Plant Specimens of Kurashiki Museum of Natural History,,,,,,,KURA,KURA,168826,Specimen,,19:50.0,,,Viola odorata L.,L.,Viola odorata L.,Plantae,,,Violales,Violaceae,Viola,Japan,Japan,,Okayama-shi,,Okayama,Eastern Asia,Japan,,,,,,,,,,,,http://data.gbif.org/occurrences/395812728,http://data.gbif.org/ws/rest/occurrence/get?key=395812728
"National Museum of Nature and Science, Japan",Plant Specimens of Kurashiki Museum of Natural History,,,,,,,KURA,KURA,123239,Specimen,,19:46.0,,,Viola odorata L.,L.,Viola odorata L.,Plantae,,,,Violaceae,Viola,Japan,Japan,,,,Hyogo,Eastern Asia,Japan,,,,,,,,,,,,http://data.gbif.org/occurrences/43188939,http://data.gbif.org/ws/rest/occurrence/get?key=43188939
"National Museum of Nature and Science, Japan",Plant Specimens of Kurashiki Museum of Natural History,,,,,,,KURA,KURA,147383,Specimen,,19:47.0,,,Viola odorata L.,,Viola odorata L.,Plantae,,,Violales,Violaceae,Viola,Japan,Japan,Mukoyama,Kurashiki City,,Okayama Prefecture,Eastern Asia,Japan,,,,,,,,,,,,http://data.gbif.org/occurrences/148849285,http://data.gbif.org/ws/rest/occurrence/get?key=148849285
"National Museum of Nature and Science, Japan","Plant specimens depodited in Osaka Museum of Natural History, Japan.",,,,,,,OSA,C,OSA7348,Specimen,,25:32.0,,,Viola odorata L.,L.,Viola odorata L.,Plantae,,,,Violaceae,Viola,Japan,Japan,,Nagahama-shi,,Shiga Prefecture,Eastern Asia,Japan,,,,,,,,,,,,http://data.gbif.org/occurrences/295180063,http://data.gbif.org/ws/rest/occurrence/get?key=295180063
"National Museum of Nature and Science, Japan","Plant specimens depodited in Osaka Museum of Natural History, Japan.",,,,,,,OSA,C,OSA37872,Specimen,,25:33.0,,,Viola odorata L.,L.,Viola odorata L.,Plantae,,,,Violaceae,Viola,Japan,Japan,"Aogakidai, cult.",Nara-shi,,Nara Prefecture,Eastern Asia,Japan,,,,,,,,,,,,http://data.gbif.org/occurrences/295180308,http://data.gbif.org/ws/rest/occurrence/get?key=295180308
"National Museum of Nature and Science, Japan","Plant specimens depodited in Osaka Museum of Natural History, Japan.",,,,,,,OSA,OSA,89851,Specimen,,25:31.0,,,Viola odorata L.,L.,Viola odorata L.,Plantae,,,,Violaceae,Viola,Japan,Japan,,Ikoma-shi,,Nara,Eastern Asia,Japan,34.7473,135.722,,44955,77,,,,,,,http://data.gbif.org/occurrences/204395851,http://data.gbif.org/ws/rest/occurrence/get?key=204395851
"National Museum of Nature and Science, Japan",Vascular plants collection of Hiratsuka City Museum,,,,,,,HCM,56,75275,Specimen,,17:00.0,,,Viola odorata L.,L.,Viola odorata L.,Plantae,,,,Violaceae,Viola,Japan,Japan,,Naka-gun Oisomachi,,Kanagawa,Eastern Asia,Japan,,,,,,,,,,,,http://data.gbif.org/occurrences/385743051,http://data.gbif.org/ws/rest/occurrence/get?key=385743051
"National Museum of Nature and Science, Japan",Vascular Plants Collection of Sagamihara City Museum,,,,,,,JSCM,VS,21827,Specimen,,44:22.0,,,Viola odorata L.,L.,Viola odorata L.,Plantae,Spermatophyta,,,VIOLACEAE,Viola,Japan,Japan,"Toya,Tsukui cho,Sagamihara city Kanagawa pref.",Tsukui-gun Tsukuimachi,,Kanagawa,Eastern Asia,Japan,,,,,,,,,,,,http://data.gbif.org/occurrences/351231662,http://data.gbif.org/ws/rest/occurrence/get?key=351231662
"National Museum of Nature and Science, Japan",Vascular Plants Collection of Sagamihara City Museum,,,,,,,JSCM,VS,21666,Specimen,,44:22.0,,,Viola odorata L.,L.,Viola odorata L.,Plantae,Spermatophyta,,,VIOLACEAE,Viola,Japan,Japan,"Kushikawa,Tsukui cho,Sagamihara city Kanagawa pref.",Tsukui-gun Tsukuimachi,,Kanagawa,Eastern Asia,Japan,,,,,,,,,,,,http://data.gbif.org/occurrences/351231644,http://data.gbif.org/ws/rest/occurrence/get?key=351231644
"National Museum of Nature and Science, Japan",Vascular Plant Specimen Database of Kanagawa Prefectural Museum of Natural History,,,,,,,KPM,NA,KPM-NA1010439,Specimen,,32:24.0,,,Viola odorata L.,,Viola odorata L.,Plantae,Angiospermae,Dicotyledoneae,,VIOLACEAE,Viola,Japan,Japan,Sugatachou,"Yokohama-shi, Kanagawa-ku",,Kanagawa Prefecture,Eastern Asia,Japan,35.4991,139.578,,45319,45,,,,,,,http://data.gbif.org/occurrences/188013998,http://data.gbif.org/ws/rest/occurrence/get?key=188013998
"National Museum of Nature and Science, Japan",Vascular Plant Specimen Database of Kanagawa Prefectural Museum of Natural History,,,,,,,KPM,NA,KPM-NA1010230,Specimen,,32:23.0,,,Viola odorata L.,,Viola odorata L.,Plantae,Angiospermae,Dicotyledoneae,,VIOLACEAE,Viola,Japan,Japan,Nebukawa,Odawara-shi,,Kanagawa Prefecture,Eastern Asia,Japan,35.1991,139.128,,45319,11,,,,,,,http://data.gbif.org/occurrences/188013732,http://data.gbif.org/ws/rest/occurrence/get?key=188013732
"National Museum of Nature and Science, Japan","Herbarium Specimens of Tokushima Prefectural Museum, Japan",,,,,,,TKPM,TKPM-B,SP120553,Specimen,,23:59.0,,,Viola odorata Linn.,Linn.,Viola odorata Linn.,Plantae,Angiospermae,Dicotyledoneae,Violales,Violaceae,Viola,Japan,Japan,Kouchi City,Kouchi City,,Kochi,Eastern Asia,Japan,33.5563,133.526,,44593,55,,,,,,,http://data.gbif.org/occurrences/43224948,http://data.gbif.org/ws/rest/occurrence/get?key=43224948
"National Museum of Nature and Science, Japan","Herbarium Specimens of Tokushima Prefectural Museum, Japan",,,,,,,TKPM,TKPM-B,SP120552,Specimen,,23:59.0,,,Viola odorata Linn.,Linn.,Viola odorata Linn.,Plantae,Angiospermae,Dicotyledoneae,Violales,Violaceae,Viola,Japan,Japan,Kouchi City,Kouchi City,,Kochi,Eastern Asia,Japan,33.5563,133.526,,44593,55,,,,,,,http://data.gbif.org/occurrences/43224947,http://data.gbif.org/ws/rest/occurrence/get?key=43224947
"National Museum of Nature and Science, Japan","Ibaraki Nature Museum, Vascular Plants collection",,,,,,,INM,Va,115049,Specimen,,55:01.0,,,Viola odorata Linn.,Linn.,Viola odorata Linn.,Plantae,SPERMATOPHYTAANGIOSPERMAE,DICOTYLEDONEAE,,VIOLACEAE,Viola,Japan,Japan,,Hitachi-shi,,Ibaraki,Eastern Asia,Japan,,,,,,,,,,,,http://data.gbif.org/occurrences/381852867,http://data.gbif.org/ws/rest/occurrence/get?key=381852867
"National Museum of Nature and Science, Japan","Ibaraki Nature Museum, Vascular Plants collection",,,,,,,INM,Va,27264,Specimen,,54:59.0,,,Viola odorata Linn.,Linn.,Viola odorata Linn.,Plantae,ANGIOSPERMAE,DICOTYLEDONEAE,,VIOLACEAE,Viola,Japan,Japan,,Mitsukaido-shi,,Ibaraki,Eastern Asia,Japan,,,,,,,,,10,,,http://data.gbif.org/occurrences/381852372,http://data.gbif.org/ws/rest/occurrence/get?key=381852372
