Data Publisher,Dataset,Dataset Rights,Collector name,Collector number,Field number,GUID,Date collected,Institution code,Collection code,Catalogue number,Basis of record,Image url,Last indexed,Identifier,Identification date,Scientific name,Author,Scientific name (interpreted),Kingdom,Phylum,Class,Order,Family,Genus,Country,Country (interpreted),Locality,County,Continent or Ocean,State/Province,Region,Publisher country,Latitude,Longitude,Coordinate precision,Cell id,Centi cell id,Min depth,Max depth,Max depth,Min altitude,Max altitude,Altitude precision,GBIF portal url,GBIF webservice url
"National Museum of Nature and Science, Japan","Gunma Museum of Natural History, Vascular Plant Specimen",,,,,,,GMNHJ,plant,BS0033961,Specimen,,34:31.0,,,Chorispora tenella (Pall.) DC.,(Pall.) DC.,Chorispora tenella (Pall.) DC.,Plantae,Spermatophyta,Dicotyledoneae,,Brassicaceae,Chorispora,Japan,Japan,The southern entrance of Ota Station,Ota-shi,,Gunma,Eastern Asia,Japan,36.2933,139.379,,45679,23,,,,,,,http://data.gbif.org/occurrences/295233160,http://data.gbif.org/ws/rest/occurrence/get?key=295233160
"National Museum of Nature and Science, Japan",Vascular plants collection of Hiratsuka City Museum,,,,,,,HCM,56,5909,Specimen,,14:51.0,,,Chorispora tenella (Pall.) DC.,(Pall.) DC.,Chorispora tenella (Pall.) DC.,Plantae,,,,CRUCIFERAE,Chorispora,Japan,Japan,Tsuchiya,Hiratsuka-shi,,Kanagawa,Eastern Asia,Japan,35.3375,139.256,,45319,32,,,,,,,http://data.gbif.org/occurrences/188232771,http://data.gbif.org/ws/rest/occurrence/get?key=188232771
"National Museum of Nature and Science, Japan",Vascular plants collection of Hiratsuka City Museum,,,,,,,HCM,56,59358,Specimen,,14:53.0,,,Chorispora tenella (Pall.) DC.,(Pall.) DC.,Chorispora tenella (Pall.) DC.,Plantae,Angiospermae,Dicotyledoneae,,Cruciferae,Chorispora,Japan,Japan,,Naka-gun Oisomachi,,Kanagawa,Eastern Asia,Japan,,,,,,,,,,,,http://data.gbif.org/occurrences/295328939,http://data.gbif.org/ws/rest/occurrence/get?key=295328939
"National Museum of Nature and Science, Japan",Vascular plants collection of Hiratsuka City Museum,,,,,,,HCM,56,5908,Specimen,,14:52.0,,,Chorispora tenella (Pall.) DC.,(Pall.) DC.,Chorispora tenella (Pall.) DC.,Plantae,Angiospermae,Dicotyledoneae,,Cruciferae,Chorispora,Japan,Japan,,Ashigarakami-gun Nakai-machi,,Kanagawa,Eastern Asia,Japan,,,,,,,,,,,,http://data.gbif.org/occurrences/295328726,http://data.gbif.org/ws/rest/occurrence/get?key=295328726
"National Museum of Nature and Science, Japan",Vascular plants collection of Hiratsuka City Museum,,,,,,,HCM,56,59382,Specimen,,14:53.0,,,Chorispora tenella (Pall.) DC.,(Pall.) DC.,Chorispora tenella (Pall.) DC.,Plantae,Angiospermae,Dicotyledoneae,,Cruciferae,Chorispora,Japan,Japan,,Hiratsuka-shi,,Kanagawa,Eastern Asia,Japan,,,,,,,,,,,,http://data.gbif.org/occurrences/295328940,http://data.gbif.org/ws/rest/occurrence/get?key=295328940
"National Museum of Nature and Science, Japan",Angiospermatatophytina Collection of Saitama Museum of Natural History,,,,,,,SMNH,As,9169,Specimen,,52:28.0,,,Chorispora tenella (Pallas) DC.,(Pallas) DC.,Chorispora tenella (Pallas) DC.,Plantae,Angiospermae,Dicotyledoneae,Papaverales,Cruciferae,Chorispora,Japan,Japan,Nakamura,Chichibu-shi,,Saitama,Eastern Asia,Japan,,,,,,,,,,,,http://data.gbif.org/occurrences/393094956,http://data.gbif.org/ws/rest/occurrence/get?key=393094956
"National Museum of Nature and Science, Japan",Angiospermatatophytina Collection of Saitama Museum of Natural History,,,,,,,SMNH,As,9170,Specimen,,52:28.0,,,Chorispora tenella (Pallas) DC.,(Pallas) DC.,Chorispora tenella (Pallas) DC.,Plantae,Angiospermae,Dicotyledoneae,Papaverales,Cruciferae,Chorispora,Japan,Japan,Nakamura,Chichibu-shi,,Saitama,Eastern Asia,Japan,,,,,,,,,,,,http://data.gbif.org/occurrences/393094957,http://data.gbif.org/ws/rest/occurrence/get?key=393094957
"National Museum of Nature and Science, Japan",Angiospermatatophytina Collection of Saitama Museum of Natural History,,,,,,,SMNH,As,9168,Specimen,,52:28.0,,,Chorispora tenella (Pallas) DC.,(Pallas) DC.,Chorispora tenella (Pallas) DC.,Plantae,Angiospermae,Dicotyledoneae,Papaverales,Cruciferae,Chorispora,Japan,Japan,Nakamura,Chichibu-shi,,Saitama,Eastern Asia,Japan,,,,,,,,,,,,http://data.gbif.org/occurrences/393094955,http://data.gbif.org/ws/rest/occurrence/get?key=393094955
"National Museum of Nature and Science, Japan","Plant specimens depodited in Osaka Museum of Natural History, Japan.",,,,,,,OSA,C,OSA68091,Specimen,,17:22.0,,,Chorispora tenella (Pallas) DC.,,Chorispora tenella (Pallas) DC.,Plantae,,,,Brassicaceae,Chorispora,Japan,Japan,,Kashiwara-shi,,Osaka,Eastern Asia,Japan,,,,,,,,,,,,http://data.gbif.org/occurrences/295119320,http://data.gbif.org/ws/rest/occurrence/get?key=295119320
"National Museum of Nature and Science, Japan","Plant specimens depodited in Osaka Museum of Natural History, Japan.",,,,,,,OSA,C,OSA57033,Specimen,,17:21.0,,,Chorispora tenella (Pollas) DC.,(Pollas) DC.,Chorispora tenella (Pollas) DC.,Plantae,,,,Brassicaceae,Chorispora,Japan,Japan,Senboku New Town,Sakai-shi,,Osaka Prefecture,Eastern Asia,Japan,,,,,,,,,,,,http://data.gbif.org/occurrences/295119209,http://data.gbif.org/ws/rest/occurrence/get?key=295119209
"National Museum of Nature and Science, Japan","Plant specimens depodited in Osaka Museum of Natural History, Japan.",,,,,,,OSA,C,OSA57032,Specimen,,17:21.0,,,Chorispora tenella (Pollas) DC.,(Pollas) DC.,Chorispora tenella (Pollas) DC.,Plantae,,,,Brassicaceae,Chorispora,Japan,Japan,Senboku New Town,Sakai-shi,,Osaka Prefecture,Eastern Asia,Japan,,,,,,,,,,,,http://data.gbif.org/occurrences/295119208,http://data.gbif.org/ws/rest/occurrence/get?key=295119208
"National Museum of Nature and Science, Japan",Plant Specimens of Kurashiki Museum of Natural History,,,,,,,KURA,KURA,4652,Specimen,,13:02.0,,,Chorispora tenella DC.,,Chorispora tenella DC.,Plantae,,,Papaverales,Cruciferae,Chorispora,Japan,Japan,Chikkomotomachi,Okayama City,,Okayama Prefecture,Eastern Asia,Japan,,,,,,,,,,,,http://data.gbif.org/occurrences/148833640,http://data.gbif.org/ws/rest/occurrence/get?key=148833640
"National Museum of Nature and Science, Japan",Plant Specimens of Kurashiki Museum of Natural History,,,,,,,KURA,KURA,8073,Specimen,,13:02.0,,,Chorispora tenella DC.,,Chorispora tenella DC.,Plantae,,,Papaverales,Cruciferae,Chorispora,Japan,Japan,Kaigandori,Okayama City,,Okayama Prefecture,Eastern Asia,Japan,,,,,,,,,,,,http://data.gbif.org/occurrences/148833645,http://data.gbif.org/ws/rest/occurrence/get?key=148833645
"National Museum of Nature and Science, Japan",Plant Specimens of Kurashiki Museum of Natural History,,,,,,,KURA,KURA,113743,Specimen,,13:02.0,,,Chorispora tenella DC.,,Chorispora tenella DC.,Plantae,,,Papaverales,Cruciferae,Chorispora,Japan,Japan,,Okayama City,,Okayama Prefecture,Eastern Asia,Japan,,,,,,,,,,,,http://data.gbif.org/occurrences/148833882,http://data.gbif.org/ws/rest/occurrence/get?key=148833882
"National Museum of Nature and Science, Japan",Plant Specimens of Kurashiki Museum of Natural History,,,,,,,KURA,KURA,4018,Specimen,,13:02.0,,,Chorispora tenella DC.,,Chorispora tenella DC.,Plantae,,,Papaverales,Cruciferae,Chorispora,Japan,Japan,Chikkomotomachi,Okayama City,,Okayama Prefecture,Eastern Asia,Japan,,,,,,,,,,,,http://data.gbif.org/occurrences/148833637,http://data.gbif.org/ws/rest/occurrence/get?key=148833637
"National Museum of Nature and Science, Japan",Plant Specimens of Kurashiki Museum of Natural History,,,,,,,KURA,KURA,38311,Specimen,,13:04.0,,,Chorispora tenella DC.,DC.,Chorispora tenella DC.,Plantae,,,Papaverales,Cruciferae,Chorispora,Japan,Japan,,Kawakami-son,,Okayama,Eastern Asia,Japan,,,,,,,,,,,,http://data.gbif.org/occurrences/395747553,http://data.gbif.org/ws/rest/occurrence/get?key=395747553
"National Museum of Nature and Science, Japan",Vascular Plants Collection of Sagamihara City Museum,,,,,,,JSCM,VS,1448,Specimen,,42:23.0,,,Chorispora tenella DC.,DC.,Chorispora tenella DC.,Plantae,Anthophyta,Dicotyledonopsida,,CRUCIFERAE,Chorispora,Japan,Japan,,Sagamihara-shi,,Kanagawa,Eastern Asia,Japan,,,,,,,,,,,,http://data.gbif.org/occurrences/351214725,http://data.gbif.org/ws/rest/occurrence/get?key=351214725
"National Museum of Nature and Science, Japan",Vascular Plant Specimen Database of Kanagawa Prefectural Museum of Natural History,,,,,,,KPM,NA,KPM-NA1041074,Specimen,,24:04.0,,,Chorispora tenella DC.,,Chorispora tenella DC.,Plantae,Angiospermae,Dicotyledoneae,,CRUCIFERAE,Chorispora,Japan,Japan,Sugikubo,Ebina-shi,,Kanagawa Prefecture,Eastern Asia,Japan,35.4241,139.403,,45319,44,,,,,,,http://data.gbif.org/occurrences/234414941,http://data.gbif.org/ws/rest/occurrence/get?key=234414941
