Data Publisher,Dataset,Dataset Rights,Collector name,Collector number,Field number,GUID,Date collected,Institution code,Collection code,Catalogue number,Basis of record,Image url,Last indexed,Identifier,Identification date,Scientific name,Author,Scientific name (interpreted),Kingdom,Phylum,Class,Order,Family,Genus,Country,Country (interpreted),Locality,County,Continent or Ocean,State/Province,Region,Publisher country,Latitude,Longitude,Coordinate precision,Cell id,Centi cell id,Min depth,Max depth,Max depth,Min altitude,Max altitude,Altitude precision,GBIF portal url,GBIF webservice url
"National Institute of Genetics, ROIS",Herbarium Specimens of Bonin and Ryukyu Islands,,,,,,,TI,ISP,6511,Specimen,,20:13.0,,,Malaxis boninensis (Koidz.) Nackej.,,Malaxis boninensis (Koidz.) Nackej.,Plantae,,,,ORCHIDACEAE,Malaxis,Japan,Japan,"Bonin, Hahajima, Chibusa-yama",,,,Eastern Asia,Japan,,,,,,,,,,,,http://data.gbif.org/occurrences/690792503,http://data.gbif.org/ws/rest/occurrence/get?key=690792503
"National Institute of Genetics, ROIS",Herbarium Specimens of Bonin and Ryukyu Islands,,,,,,,TI,ISP,6502,Specimen,,20:13.0,,,Malaxis boninensis (Koidz.) Nackej.,,Malaxis boninensis (Koidz.) Nackej.,Plantae,,,,ORCHIDACEAE,Malaxis,Japan,Japan,Bonin,,,,Eastern Asia,Japan,,,,,,,,,,,,http://data.gbif.org/occurrences/690792451,http://data.gbif.org/ws/rest/occurrence/get?key=690792451
"National Institute of Genetics, ROIS",Herbarium Specimens of Bonin and Ryukyu Islands,,,,,,,TI,ISP,6503,Specimen,,20:13.0,,,Malaxis boninensis (Koidz.) Nackej.,,Malaxis boninensis (Koidz.) Nackej.,Plantae,,,,ORCHIDACEAE,Malaxis,Japan,Japan,"Bonin, Titi-zima",,,,Eastern Asia,Japan,,,,,,,,,,,,http://data.gbif.org/occurrences/690792458,http://data.gbif.org/ws/rest/occurrence/get?key=690792458
"National Institute of Genetics, ROIS",Herbarium Specimens of Bonin and Ryukyu Islands,,,,,,,TI,ISP,6508,Specimen,,20:13.0,,,Malaxis boninensis (Koidz.) Nackej.,,Malaxis boninensis (Koidz.) Nackej.,Plantae,,,,ORCHIDACEAE,Malaxis,Japan,Japan,"Bonin, Kita-Iwootoo (Ins. San Alessandro)",,,,Eastern Asia,Japan,,,,,,,,,,,,http://data.gbif.org/occurrences/690792486,http://data.gbif.org/ws/rest/occurrence/get?key=690792486
"National Institute of Genetics, ROIS",Herbarium Specimens of Bonin and Ryukyu Islands,,,,,,,TI,ISP,6510,Specimen,,20:13.0,,,Malaxis boninensis (Koidz.) Nackej.,,Malaxis boninensis (Koidz.) Nackej.,Plantae,,,,ORCHIDACEAE,Malaxis,Japan,Japan,"Bonin, Titizima",,,,Eastern Asia,Japan,,,,,,,,,,,,http://data.gbif.org/occurrences/690792494,http://data.gbif.org/ws/rest/occurrence/get?key=690792494
"National Institute of Genetics, ROIS",Herbarium Specimens of Bonin and Ryukyu Islands,,,,,,,TI,ISP,6504,Specimen,,20:13.0,,,Malaxis boninensis (Koidz.) Nackej.,,Malaxis boninensis (Koidz.) Nackej.,Plantae,,,,ORCHIDACEAE,Malaxis,Japan,Japan,,,,,Eastern Asia,Japan,,,,,,,,,,,,http://data.gbif.org/occurrences/690792464,http://data.gbif.org/ws/rest/occurrence/get?key=690792464
"National Institute of Genetics, ROIS",Herbarium Specimens of Bonin and Ryukyu Islands,,,,,,,TI,ISP,6509,Specimen,,20:13.0,,,Malaxis boninensis (Koidz.) Nackej.,,Malaxis boninensis (Koidz.) Nackej.,Plantae,,,,ORCHIDACEAE,Malaxis,Japan,Japan,"Bonin, Chichijima",,,,Eastern Asia,Japan,,,,,,,,,,,,http://data.gbif.org/occurrences/690792491,http://data.gbif.org/ws/rest/occurrence/get?key=690792491
"National Institute of Genetics, ROIS",Herbarium Specimens of Bonin and Ryukyu Islands,,,,,,,MAK,ISP,371518,Specimen,,19:00.0,,,Malaxis boninensis (Koidz.) Nackej.,,Malaxis boninensis (Koidz.) Nackej.,Plantae,,,,Orchidaceae,Malaxis,Japan,Japan,"Ogasawara Islands, Kitaiwoto Island",,,,Eastern Asia,Japan,,,,,,,,,,,,http://data.gbif.org/occurrences/690760157,http://data.gbif.org/ws/rest/occurrence/get?key=690760157
"National Institute of Genetics, ROIS",Herbarium Specimens of Bonin and Ryukyu Islands,,,,,,,TI,ISP,6505,Specimen,,20:13.0,,,Malaxis boninensis (Koidz.) Nackej.,,Malaxis boninensis (Koidz.) Nackej.,Plantae,,,,ORCHIDACEAE,Malaxis,Japan,Japan,,,,,Eastern Asia,Japan,,,,,,,,,,,,http://data.gbif.org/occurrences/690792469,http://data.gbif.org/ws/rest/occurrence/get?key=690792469
"National Institute of Genetics, ROIS",Herbarium Specimens of Bonin and Ryukyu Islands,,,,,,,TI,ISP,6506,Specimen,,20:13.0,,,Malaxis boninensis (Koidz.) Nackej.,,Malaxis boninensis (Koidz.) Nackej.,Plantae,,,,ORCHIDACEAE,Malaxis,Japan,Japan,"Bonin, Titizima",,,,Eastern Asia,Japan,,,,,,,,,,,,http://data.gbif.org/occurrences/690792474,http://data.gbif.org/ws/rest/occurrence/get?key=690792474
"National Institute of Genetics, ROIS",Herbarium Specimens of Bonin and Ryukyu Islands,,,,,,,TI,ISP,6507,Specimen,,20:13.0,,,Malaxis boninensis (Koidz.) Nackej.,,Malaxis boninensis (Koidz.) Nackej.,Plantae,,,,ORCHIDACEAE,Malaxis,Japan,Japan,,,,,Eastern Asia,Japan,,,,,,,,,,,,http://data.gbif.org/occurrences/690792479,http://data.gbif.org/ws/rest/occurrence/get?key=690792479
