Data Publisher,Dataset,Dataset Rights,Collector name,Collector number,Field number,GUID,Date collected,Institution code,Collection code,Catalogue number,Basis of record,Image url,Last indexed,Identifier,Identification date,Scientific name,Author,Scientific name (interpreted),Kingdom,Phylum,Class,Order,Family,Genus,Country,Country (interpreted),Locality,County,Continent or Ocean,State/Province,Region,Publisher country,Latitude,Longitude,Coordinate precision,Cell id,Centi cell id,Min depth,Max depth,Max depth,Min altitude,Max altitude,Altitude precision,GBIF portal url,GBIF webservice url
"National Institute of Genetics, ROIS","Herbarium Specimens of Museum of Nature and Human Activities, Hyogo Pref., Japan",,,,,,,HYO,VP,C1-065651,Specimen,,27:22.0,M.Hashimoto,,Trisetum sibiricum,,Trisetum sibiricum,Plantae,Magnoliophyta,,,Gramineae,Trisetum,Japan,Japan,"Pref.Ishikawa,Mt.Hakusan,Sannomine-Sugitoge",,,Ishikawa,Eastern Asia,Japan,134.634,35.4689,,,,,,,1700,1900,,http://data.gbif.org/occurrences/323527760,http://data.gbif.org/ws/rest/occurrence/get?key=323527760
"National Institute of Genetics, ROIS","Herbarium Specimens of Museum of Nature and Human Activities, Hyogo Pref., Japan",,,,,,,HYO,VP,C1-065742,Specimen,,27:14.0,M.Hashimoto,,Trisetum sibiricum,,Trisetum sibiricum,Plantae,Magnoliophyta,,,Gramineae,Trisetum,Japan,Japan,"Pref.Ishikawa,Mt.Hakusan,From Kitaryugabanba to Shakadake",,,Ishikawa,Eastern Asia,Japan,134.634,35.4689,,,,,,,2000,2400,,http://data.gbif.org/occurrences/323527046,http://data.gbif.org/ws/rest/occurrence/get?key=323527046
"National Institute of Genetics, ROIS","Herbarium Specimens of Museum of Nature and Human Activities, Hyogo Pref., Japan",,,,,,,HYO,VP,C1-065744,Specimen,,27:15.0,M.Hashimoto,,Trisetum sibiricum,,Trisetum sibiricum,Plantae,Magnoliophyta,,,Gramineae,Trisetum,Japan,Japan,"Pref.Ishikawa,Mt.Hakusan,From Kitaryugabanba to Shakadake",,,Ishikawa,Eastern Asia,Japan,134.634,35.4689,,,,,,,2000,2400,,http://data.gbif.org/occurrences/323527047,http://data.gbif.org/ws/rest/occurrence/get?key=323527047
"National Museum of Nature and Science, Japan",Kochi Prefectural Makino Botanical Garden,,,,,,,MBK,MBK,175594,Specimen,,04:52.0,,,Trisetum sibiricum Rupr.,,Trisetum sibiricum Rupr.,Plantae,,,Graminales,Poaceae,Trisetum,Japan,Japan,,,,Pref. Kochi,Eastern Asia,Japan,,,,,,,,,,,,http://data.gbif.org/occurrences/143975644,http://data.gbif.org/ws/rest/occurrence/get?key=143975644
"National Museum of Nature and Science, Japan",Kochi Prefectural Makino Botanical Garden,,,,,,,MBK,MBK,39815,Specimen,,04:51.0,,,Trisetum sibiricum Rupr.,,Trisetum sibiricum Rupr.,Plantae,,,Graminales,Poaceae,Trisetum,Japan,Japan,,,,Pref. Kochi,Eastern Asia,Japan,,,,,,,,,,,,http://data.gbif.org/occurrences/143975267,http://data.gbif.org/ws/rest/occurrence/get?key=143975267
"National Museum of Nature and Science, Japan",Kochi Prefectural Makino Botanical Garden,,,,,,,MBK,MBK,15535,Specimen,,04:50.0,,,Trisetum sibiricum Rupr.,,Trisetum sibiricum Rupr.,Plantae,,,Graminales,Poaceae,Trisetum,Japan,Japan,,,,Pref. Kochi,Eastern Asia,Japan,,,,,,,,,,,,http://data.gbif.org/occurrences/143974932,http://data.gbif.org/ws/rest/occurrence/get?key=143974932
"National Museum of Nature and Science, Japan","Plant specimens depodited in Osaka Museum of Natural History, Japan.",,,,,,,OSA,C,OSA43635,Specimen,,25:11.0,,,Trisetum sibiricum Rupr.,Rupr.,Trisetum sibiricum Rupr.,Plantae,,,,Poaceae,Trisetum,Japan,Japan,Akkeshi,Akkeshi-gun,,Hokkaido Prefecture,Eastern Asia,Japan,,,,,,,,,,,,http://data.gbif.org/occurrences/295177343,http://data.gbif.org/ws/rest/occurrence/get?key=295177343
"National Museum of Nature and Science, Japan",Vascular Plant Specimen Database of Kanagawa Prefectural Museum of Natural History,,,,,,,KPM,NA,KPM-NA0050617,Specimen,,32:04.0,,,Trisetum sibiricum Rupr.,,Trisetum sibiricum Rupr.,Plantae,Angiospermae,Monocotyledoneae,,POACEAE (GRAMINEAE),Trisetum,Japan,Japan,,"Samani-gun, Samani-cho",,Hokkaido,Eastern Asia,Japan,,,,,,,,,,,,http://data.gbif.org/occurrences/388875662,http://data.gbif.org/ws/rest/occurrence/get?key=388875662
"National Museum of Nature and Science, Japan",Vascular Plant Specimen Database of Kanagawa Prefectural Museum of Natural History,,,,,,,KPM,NA,KPM-NA0017713,Specimen,,32:04.0,,,Trisetum sibiricum Rupr.,,Trisetum sibiricum Rupr.,Plantae,Angiospermae,Monocotyledoneae,,POACEAE (GRAMINEAE),Trisetum,Japan,Japan,,"Akkeshi-gun, Akkeshi-cho",,Hokkaido,Eastern Asia,Japan,,,,,,,,,,,,http://data.gbif.org/occurrences/388875612,http://data.gbif.org/ws/rest/occurrence/get?key=388875612
"National Museum of Nature and Science, Japan",Vascular Plant Specimen Database of Kanagawa Prefectural Museum of Natural History,,,,,,,KPM,NA,KPM-NA0013630,Specimen,,32:04.0,,,Trisetum sibiricum Rupr.,,Trisetum sibiricum Rupr.,Plantae,Angiospermae,Monocotyledoneae,,POACEAE (GRAMINEAE),Trisetum,Japan,Japan,,"Rebun-gun, Rebun-cho",,Hokkaido,Eastern Asia,Japan,,,,,,,,,,,,http://data.gbif.org/occurrences/388875593,http://data.gbif.org/ws/rest/occurrence/get?key=388875593
"National Museum of Nature and Science, Japan",Vascular Plant Specimen Database of Kanagawa Prefectural Museum of Natural History,,,,,,,KPM,NA,KPM-NA0066933,Specimen,,32:04.0,,,Trisetum sibiricum Rupr.,,Trisetum sibiricum Rupr.,Plantae,Angiospermae,Monocotyledoneae,,POACEAE (GRAMINEAE),Trisetum,Japan,Japan,,"Teshio-gun, Toyotomi-cho",,Hokkaido,Eastern Asia,Japan,,,,,,,,,,,,http://data.gbif.org/occurrences/388875678,http://data.gbif.org/ws/rest/occurrence/get?key=388875678
"National Museum of Nature and Science, Japan",Vascular Plant Specimen Database of Kanagawa Prefectural Museum of Natural History,,,,,,,KPM,NA,KPM-NA0017715,Specimen,,32:04.0,,,Trisetum sibiricum Rupr.,,Trisetum sibiricum Rupr.,Plantae,Angiospermae,Monocotyledoneae,,POACEAE (GRAMINEAE),Trisetum,Japan,Japan,,Nemuro-shi,,Hokkaido,Eastern Asia,Japan,,,,,,,,,,,,http://data.gbif.org/occurrences/388875613,http://data.gbif.org/ws/rest/occurrence/get?key=388875613
"National Museum of Nature and Science, Japan",Vascular Plant Specimen Database of Kanagawa Prefectural Museum of Natural History,,,,,,,KPM,NA,KPM-NA0068591,Specimen,,32:04.0,,,Trisetum sibiricum Rupr.,,Trisetum sibiricum Rupr.,Plantae,Angiospermae,Monocotyledoneae,,POACEAE (GRAMINEAE),Trisetum,Japan,Japan,,"Notsuke-gun, Betsukai-cho",,Hokkaido,Eastern Asia,Japan,,,,,,,,,,,,http://data.gbif.org/occurrences/388875695,http://data.gbif.org/ws/rest/occurrence/get?key=388875695
"National Museum of Nature and Science, Japan",Vascular Plant Specimen Database of Kanagawa Prefectural Museum of Natural History,,,,,,,KPM,NA,KPM-NA0068596,Specimen,,32:04.0,,,Trisetum sibiricum Rupr.,,Trisetum sibiricum Rupr.,Plantae,Angiospermae,Monocotyledoneae,,POACEAE (GRAMINEAE),Trisetum,Japan,Japan,,"Notsuke-gun, Betsukai-cho",,Hokkaido,Eastern Asia,Japan,,,,,,,,,,,,http://data.gbif.org/occurrences/388875696,http://data.gbif.org/ws/rest/occurrence/get?key=388875696
"National Museum of Nature and Science, Japan",Vascular plant specimens of Akita Prefectural Museum,,,,,,,AKPM,vs,43927,Specimen,,42:40.0,,,Trisetum sibiricum Rupr.,Rupr.,Trisetum sibiricum Rupr.,Plantae,Spermatophyta,Monocotyledoneae,,Poaceae,Trisetum,Japan,Japan,,Semboku-gun Otamachi,,Akita,Eastern Asia,Japan,,,,,,,,,,,,http://data.gbif.org/occurrences/387948731,http://data.gbif.org/ws/rest/occurrence/get?key=387948731
"National Museum of Nature and Science, Japan",Vascular plant specimens of Akita Prefectural Museum,,,,,,,AKPM,vs,43929,Specimen,,42:40.0,,,Trisetum sibiricum Rupr.,Rupr.,Trisetum sibiricum Rupr.,Plantae,Spermatophyta,Monocotyledoneae,,Poaceae,Trisetum,Japan,Japan,,Semboku-gun Otamachi,,Akita,Eastern Asia,Japan,,,,,,,,,,,,http://data.gbif.org/occurrences/387948735,http://data.gbif.org/ws/rest/occurrence/get?key=387948735
"National Museum of Nature and Science, Japan",Vascular plant specimens of Akita Prefectural Museum,,,,,,,AKPM,vs,24234,Specimen,,42:40.0,,,Trisetum sibiricum Rupr.,Rupr.,Trisetum sibiricum Rupr.,Plantae,Spermatophyta,Monocotyledoneae,,Poaceae,Trisetum,Japan,Japan,,Semboku-gun Tazawakomachi,,Akita,Eastern Asia,Japan,,,,,,,,,,,,http://data.gbif.org/occurrences/387948713,http://data.gbif.org/ws/rest/occurrence/get?key=387948713
"National Museum of Nature and Science, Japan",Vascular plant specimens of Akita Prefectural Museum,,,,,,,AKPM,vs,43928,Specimen,,42:40.0,,,Trisetum sibiricum Rupr.,Rupr.,Trisetum sibiricum Rupr.,Plantae,Spermatophyta,Monocotyledoneae,,Poaceae,Trisetum,Japan,Japan,,Semboku-gun Otamachi,,Akita,Eastern Asia,Japan,,,,,,,,,,,,http://data.gbif.org/occurrences/387948733,http://data.gbif.org/ws/rest/occurrence/get?key=387948733
"National Museum of Nature and Science, Japan",Vascular plant specimens of Akita Prefectural Museum,,,,,,,AKPM,vs,43930,Specimen,,42:40.0,,,Trisetum sibiricum Rupr.,Rupr.,Trisetum sibiricum Rupr.,Plantae,Spermatophyta,Monocotyledoneae,,Poaceae,Trisetum,Japan,Japan,,Semboku-gun Otamachi,,Akita,Eastern Asia,Japan,,,,,,,,,,,,http://data.gbif.org/occurrences/387948736,http://data.gbif.org/ws/rest/occurrence/get?key=387948736
