Data Publisher,Dataset,Dataset Rights,Collector name,Collector number,Field number,GUID,Date collected,Institution code,Collection code,Catalogue number,Basis of record,Image url,Last indexed,Identifier,Identification date,Scientific name,Author,Scientific name (interpreted),Kingdom,Phylum,Class,Order,Family,Genus,Country,Country (interpreted),Locality,County,Continent or Ocean,State/Province,Region,Publisher country,Latitude,Longitude,Coordinate precision,Cell id,Centi cell id,Min depth,Max depth,Max depth,Min altitude,Max altitude,Altitude precision,GBIF portal url,GBIF webservice url
"National Museum of Nature and Science, Japan","Vascular Plant Collection of Natural History Museum and Institute, Chiba",,,,,,,CBM,BS,38548,Specimen,,58:23.0,,,Cirsium nipponicum (Maxim.)  Makino  var. incomptum (Maxim.)  Kitamura,(Maxim.) Makino,Cirsium nipponicum var. incomptum (Maxim.) Kitamura,Plantae,Angiospermae,Dicotyledoneae,Campanulales,Compositae,Cirsium,Japan,Japan,Imobara,Ichihara-shi,,Chiba,Eastern Asia,Japan,,,,,,,,,,,,http://data.gbif.org/occurrences/624040357,http://data.gbif.org/ws/rest/occurrence/get?key=624040357
"National Museum of Nature and Science, Japan","Vascular Plant Collection of Natural History Museum and Institute, Chiba",,,,,,,CBM,BS,35948,Specimen,,58:21.0,,,Cirsium nipponicum (Maxim.)  Makino  var. incomptum (Maxim.)  Kitamura,(Maxim.) Makino,Cirsium nipponicum var. incomptum (Maxim.) Kitamura,Plantae,Angiospermae,Dicotyledoneae,Campanulales,Compositae,Cirsium,Japan,Japan,Itabu,Ichihara-shi,,Chiba,Eastern Asia,Japan,,,,,,,,,,,,http://data.gbif.org/occurrences/624040028,http://data.gbif.org/ws/rest/occurrence/get?key=624040028
"National Museum of Nature and Science, Japan","Vascular Plant Collection of Natural History Museum and Institute, Chiba",,,,,,,CBM,BS,36654,Specimen,,58:21.0,,,Cirsium nipponicum (Maxim.)  Makino  var. incomptum (Maxim.)  Kitamura,(Maxim.) Makino,Cirsium nipponicum var. incomptum (Maxim.) Kitamura,Plantae,Angiospermae,Dicotyledoneae,Campanulales,Compositae,Cirsium,Japan,Japan,Kubo,Ichihara-shi,,Chiba,Eastern Asia,Japan,,,,,,,,,,,,http://data.gbif.org/occurrences/624040030,http://data.gbif.org/ws/rest/occurrence/get?key=624040030
"National Museum of Nature and Science, Japan","Vascular Plant Collection of Natural History Museum and Institute, Chiba",,,,,,,CBM,BS,35122,Specimen,,58:21.0,,,Cirsium nipponicum (Maxim.)  Makino  var. incomptum (Maxim.)  Kitamura,(Maxim.) Makino,Cirsium nipponicum var. incomptum (Maxim.) Kitamura,Plantae,Angiospermae,Dicotyledoneae,Campanulales,Compositae,Cirsium,Japan,Japan,Iriyamazu,Ichihara-shi,,Chiba,Eastern Asia,Japan,,,,,,,,,,,,http://data.gbif.org/occurrences/624040026,http://data.gbif.org/ws/rest/occurrence/get?key=624040026
"National Museum of Nature and Science, Japan","Vascular Plant Collection of Natural History Museum and Institute, Chiba",,,,,,,CBM,BS,35446,Specimen,,58:21.0,,,Cirsium nipponicum (Maxim.)  Makino  var. incomptum (Maxim.)  Kitamura,(Maxim.) Makino,Cirsium nipponicum var. incomptum (Maxim.) Kitamura,Plantae,Angiospermae,Dicotyledoneae,Campanulales,Compositae,Cirsium,Japan,Japan,Chihara-dai,Ichihara-shi,,Chiba,Eastern Asia,Japan,,,,,,,,,,,,http://data.gbif.org/occurrences/624040027,http://data.gbif.org/ws/rest/occurrence/get?key=624040027
"National Museum of Nature and Science, Japan","Vascular Plant Collection of Natural History Museum and Institute, Chiba",,,,,,,CBM,BS,36002,Specimen,,58:21.0,,,Cirsium nipponicum (Maxim.)  Makino  var. incomptum (Maxim.)  Kitamura,(Maxim.) Makino,Cirsium nipponicum var. incomptum (Maxim.) Kitamura,Plantae,Angiospermae,Dicotyledoneae,Campanulales,Compositae,Cirsium,Japan,Japan,Itabu,Ichihara-shi,,Chiba,Eastern Asia,Japan,,,,,,,,,,,,http://data.gbif.org/occurrences/624040029,http://data.gbif.org/ws/rest/occurrence/get?key=624040029
"National Museum of Nature and Science, Japan","Plant specimens depodited in Osaka Museum of Natural History, Japan.",,,,,,,OSA,C,OSA17193,Specimen,,17:29.0,,,Cirsium nipponicum (Maxim.) Mak. var. incomptum (F. et S.) Kitam.,(Maxim.) Mak.,Cirsium nipponicum var. incomptum (F. & S.) Kitam.,Plantae,,,,Asteraceae,Cirsium,Japan,Japan,,Higashichikuma-gun Hongomura,,Nagano Prefecture,Eastern Asia,Japan,,,,,,,,,,,,http://data.gbif.org/occurrences/295120271,http://data.gbif.org/ws/rest/occurrence/get?key=295120271
"National Museum of Nature and Science, Japan","Gunma Museum of Natural History, Vascular Plant Specimen",,,,,,,GMNHJ,plant,BS0070585,Specimen,,34:33.0,,,Cirsium nipponicum (Maxim.) Makino  var. incomptum (Maxim.) Kitam.,,Cirsium nipponicum var. incomptum (Maxim.) Kitam.,Plantae,Spermatophyta,,,Compositae,Cirsium,Japan,Japan,"Iriyama,Nozori",Agatsuma-gun Kunimura,,Gunma,Eastern Asia,Japan,36.7067,138.641,,45678,76,,,,,,,http://data.gbif.org/occurrences/188200996,http://data.gbif.org/ws/rest/occurrence/get?key=188200996
"National Museum of Nature and Science, Japan","Gunma Museum of Natural History, Vascular Plant Specimen",,,,,,,GMNHJ,plant,BS0066914,Specimen,,34:32.0,,,Cirsium nipponicum (Maxim.) Makino  var. incomptum (Maxim.) Kitam.,,Cirsium nipponicum var. incomptum (Maxim.) Kitam.,Plantae,Spermatophyta,,,Compositae,Cirsium,Japan,Japan,"Shimo-hino,Nakakura",Fujioka-shi,,Gunma,Eastern Asia,Japan,36.2078,139.014,,45679,20,,,,,,,http://data.gbif.org/occurrences/188200885,http://data.gbif.org/ws/rest/occurrence/get?key=188200885
"National Museum of Nature and Science, Japan","Gunma Museum of Natural History, Vascular Plant Specimen",,,,,,,GMNHJ,plant,BS0001087,Specimen,,34:33.0,,,Cirsium nipponicum (Maxim.) Makino  var. incomptum (Maxim.) Kitam.,,Cirsium nipponicum var. incomptum (Maxim.) Kitam.,Plantae,Spermatophyta,,,Compositae,Cirsium,Japan,Japan,Hokkitsumachi-shimo-hakoda,Shibukawa-shi,,Gunma,Eastern Asia,Japan,36.4628,139.047,,45679,40,,,,,,,http://data.gbif.org/occurrences/188201210,http://data.gbif.org/ws/rest/occurrence/get?key=188201210
"National Museum of Nature and Science, Japan","Gunma Museum of Natural History, Vascular Plant Specimen",,,,,,,GMNHJ,plant,BS0070594,Specimen,,34:33.0,,,Cirsium nipponicum (Maxim.) Makino  var. incomptum (Maxim.) Kitam.,,Cirsium nipponicum var. incomptum (Maxim.) Kitam.,Plantae,Spermatophyta,,,Compositae,Cirsium,Japan,Japan,"Omae,Hosobara",Agatsuma-gun Tsumagoimura,,Gunma,Eastern Asia,Japan,36.4736,138.542,,45678,45,,,,,,,http://data.gbif.org/occurrences/188201614,http://data.gbif.org/ws/rest/occurrence/get?key=188201614
"National Museum of Nature and Science, Japan","Gunma Museum of Natural History, Vascular Plant Specimen",,,,,,,GMNHJ,plant,BS0070584,Specimen,,34:33.0,,,Cirsium nipponicum (Maxim.) Makino  var. incomptum (Maxim.) Kitam.,,Cirsium nipponicum var. incomptum (Maxim.) Kitam.,Plantae,Spermatophyta,,,Compositae,Cirsium,Japan,Japan,"Kita-karuizawa,Mt. Asamagakushi",Agatsuma-gun Naganoharamachi,,Gunma,Eastern Asia,Japan,36.4544,138.652,,45678,46,,,,,,,http://data.gbif.org/occurrences/188201006,http://data.gbif.org/ws/rest/occurrence/get?key=188201006
"National Museum of Nature and Science, Japan","Gunma Museum of Natural History, Vascular Plant Specimen",,,,,,,GMNHJ,plant,BS0007255,Specimen,,34:33.0,,,Cirsium nipponicum (Maxim.) Makino  var. incomptum (Maxim.) Kitam.,,Cirsium nipponicum var. incomptum (Maxim.) Kitam.,Plantae,Spermatophyta,,,Compositae,Cirsium,Japan,Japan,Usui Pass,,,,Eastern Asia,Japan,36.3694,138.657,,45678,36,,,,,,,http://data.gbif.org/occurrences/188202201,http://data.gbif.org/ws/rest/occurrence/get?key=188202201
"National Museum of Nature and Science, Japan","Gunma Museum of Natural History, Vascular Plant Specimen",,,,,,,GMNHJ,plant,BS0070596,Specimen,,34:33.0,,,Cirsium nipponicum (Maxim.) Makino  var. incomptum (Maxim.) Kitam.,,Cirsium nipponicum var. incomptum (Maxim.) Kitam.,Plantae,Spermatophyta,,,Compositae,Cirsium,Japan,Japan,"Hoshimata,Baragi",Agatsuma-gun Tsumagoimura,,Gunma,Eastern Asia,Japan,36.5422,138.476,,45678,54,,,,,,,http://data.gbif.org/occurrences/188201631,http://data.gbif.org/ws/rest/occurrence/get?key=188201631
"National Museum of Nature and Science, Japan","Gunma Museum of Natural History, Vascular Plant Specimen",,,,,,,GMNHJ,plant,BS0070595,Specimen,,34:33.0,,,Cirsium nipponicum (Maxim.) Makino  var. incomptum (Maxim.) Kitam.,,Cirsium nipponicum var. incomptum (Maxim.) Kitam.,Plantae,Spermatophyta,,,Compositae,Cirsium,Japan,Japan,Kanbara,Agatsuma-gun Tsumagoimura,,Gunma,Eastern Asia,Japan,36.4633,138.558,,45678,45,,,,,,,http://data.gbif.org/occurrences/188201389,http://data.gbif.org/ws/rest/occurrence/get?key=188201389
"National Museum of Nature and Science, Japan","Gunma Museum of Natural History, Vascular Plant Specimen",,,,,,,GMNHJ,plant,BS0070597,Specimen,,34:33.0,,,Cirsium nipponicum (Maxim.) Makino  var. incomptum (Maxim.) Kitam.,,Cirsium nipponicum var. incomptum (Maxim.) Kitam.,Plantae,Spermatophyta,,,Compositae,Cirsium,Japan,Japan,Omae,Agatsuma-gun Tsumagoimura,,Gunma,Eastern Asia,Japan,36.5081,138.524,,45678,55,,,,,,,http://data.gbif.org/occurrences/188201496,http://data.gbif.org/ws/rest/occurrence/get?key=188201496
"National Museum of Nature and Science, Japan","FKSE-Herbarium specimens of Faculty of Symbiotic Systems Science, Fukushima University, Japan",,,,,,,FKSE,Plant,3237,Specimen,,51:24.0,,,Cirsium nipponicum (Maxim.) Makino  var. incomptum (Maxim.) Kitam.,(Maxim.) Makino,Cirsium nipponicum var. incomptum (Maxim.) Kitam.,Plantae,,,,ASTERACEAE,Cirsium,Japan,Japan,"Honshu, Tohoku Distr., Fukushima Pref., Minamiaidzu-gun, Tateiwa-mura, Yasou-kouzan",,,,Eastern Asia,Japan,,,,,,,,,,,,http://data.gbif.org/occurrences/238091034,http://data.gbif.org/ws/rest/occurrence/get?key=238091034
"National Museum of Nature and Science, Japan","FKSE-Herbarium specimens of Faculty of Symbiotic Systems Science, Fukushima University, Japan",,,,,,,FKSE,Plant,18356,Specimen,,51:27.0,,,Cirsium nipponicum (Maxim.) Makino  var. incomptum (Maxim.) Kitam.,(Maxim.) Makino,Cirsium nipponicum var. incomptum (Maxim.) Kitam.,Plantae,,,,ASTERACEAE,Cirsium,Japan,Japan,"Okuma-machi, Nogami, Nakayashiki, upper valley of Kuma-gawa River.",Futaba-gun,,Fukushima,Eastern Asia,Japan,,,,,,,,,470,,,http://data.gbif.org/occurrences/391289043,http://data.gbif.org/ws/rest/occurrence/get?key=391289043
"National Museum of Nature and Science, Japan","Plant specimens depodited in Osaka Museum of Natural History, Japan.",,,,,,,OSA,C,OSA10436,Specimen,,17:29.0,,,Cirsium nipponicum (Maxim.) Makino var. incomptum (F. et S.) Kitam.,(Maxim.) Makino,Cirsium nipponicum var. incomptum (F. & S.) Kitam.,Plantae,,,,Asteraceae,Cirsium,Japan,Japan,Goshodaira highland,Minami-saku-gun Kawakami-mura,,Nagano Prefecture,Eastern Asia,Japan,,,,,,,,,,,,http://data.gbif.org/occurrences/295120209,http://data.gbif.org/ws/rest/occurrence/get?key=295120209
"National Museum of Nature and Science, Japan","Plant specimens depodited in Osaka Museum of Natural History, Japan.",,,,,,,OSA,C,OSA28881,Specimen,,17:30.0,,,Cirsium nipponicum (Maxim.) Makino var. incomptum (F. et S.) Kitam.,(Maxim.) Makino,Cirsium nipponicum var. incomptum (F. & S.) Kitam.,Plantae,,,,Asteraceae,Cirsium,Japan,Japan,,Kanra-gun Shimonitamachi,,Gunma Prefecture,Eastern Asia,Japan,,,,,,,,,,,,http://data.gbif.org/occurrences/295120357,http://data.gbif.org/ws/rest/occurrence/get?key=295120357
"National Museum of Nature and Science, Japan",Angiospermatatophytina Collection of Saitama Museum of Natural History,,,,,,,SMNH,As,18017,Specimen,,52:34.0,,,Cirsium nipponicum (Maxim.) Makino var. incomptum (Franch. et Savat) Kitam.,(Franch. et Savat) Kitam.,Cirsium nipponicum var. incomptum (Franch. & Savat) Kitam.,Plantae,Angiospermae,Dicotyledoneae,Campanulales,Compositae,Cirsium,Japan,Japan,Mt. Ohira-yama,Chichibu-shi,,Saitama,Eastern Asia,Japan,,,,,,,,,,,,http://data.gbif.org/occurrences/393096191,http://data.gbif.org/ws/rest/occurrence/get?key=393096191
"National Museum of Nature and Science, Japan",Angiospermatatophytina Collection of Saitama Museum of Natural History,,,,,,,SMNH,As,4206,Specimen,,52:31.0,,,Cirsium nipponicum (Maxim.) Makino var. incomptum (Franch. et Savat) Kitam.,(Franch. et Savat) Kitam.,Cirsium nipponicum var. incomptum (Franch. & Savat) Kitam.,Plantae,Angiospermae,Dicotyledoneae,Campanulales,Compositae,Cirsium,Japan,Japan,,Chichibu-gun Ryokamimura,,Saitama,Eastern Asia,Japan,,,,,,,,,,,,http://data.gbif.org/occurrences/353564376,http://data.gbif.org/ws/rest/occurrence/get?key=353564376
"National Museum of Nature and Science, Japan",Angiospermatatophytina Collection of Saitama Museum of Natural History,,,,,,,SMNH,As,18021,Specimen,,52:34.0,,,Cirsium nipponicum (Maxim.) Makino var. incomptum (Franch. et Savat) Kitam.,(Franch. et Savat) Kitam.,Cirsium nipponicum var. incomptum (Franch. & Savat) Kitam.,Plantae,Angiospermae,Dicotyledoneae,Campanulales,Compositae,Cirsium,Japan,Japan,Mt. Ryokami-san,Chichibu-gun Ryokamimura,,Saitama,Eastern Asia,Japan,,,,,,,,,,,,http://data.gbif.org/occurrences/393096199,http://data.gbif.org/ws/rest/occurrence/get?key=393096199
"National Museum of Nature and Science, Japan",Angiospermatatophytina Collection of Saitama Museum of Natural History,,,,,,,SMNH,As,18034,Specimen,,52:34.0,,,Cirsium nipponicum (Maxim.) Makino var. incomptum (Franch. et Savat) Kitam.,(Franch. et Savat) Kitam.,Cirsium nipponicum var. incomptum (Franch. & Savat) Kitam.,Plantae,Angiospermae,Dicotyledoneae,Campanulales,Compositae,Cirsium,Japan,Japan,Jukkoku-toge Pass,Tano-gun Uenomura,,Gunma,Eastern Asia,Japan,,,,,,,,,,,,http://data.gbif.org/occurrences/393096221,http://data.gbif.org/ws/rest/occurrence/get?key=393096221
"National Museum of Nature and Science, Japan",Angiospermatatophytina Collection of Saitama Museum of Natural History,,,,,,,SMNH,As,18020,Specimen,,52:34.0,,,Cirsium nipponicum (Maxim.) Makino var. incomptum (Franch. et Savat) Kitam.,(Franch. et Savat) Kitam.,Cirsium nipponicum var. incomptum (Franch. & Savat) Kitam.,Plantae,Angiospermae,Dicotyledoneae,Campanulales,Compositae,Cirsium,Japan,Japan,Mt. Ryokami-san,Chichibu-gun Ryokamimura,,Saitama,Eastern Asia,Japan,,,,,,,,,,,,http://data.gbif.org/occurrences/393096197,http://data.gbif.org/ws/rest/occurrence/get?key=393096197
"National Museum of Nature and Science, Japan",Angiospermatatophytina Collection of Saitama Museum of Natural History,,,,,,,SMNH,As,18027,Specimen,,52:34.0,,,Cirsium nipponicum (Maxim.) Makino var. incomptum (Franch. et Savat) Kitam.,(Franch. et Savat) Kitam.,Cirsium nipponicum var. incomptum (Franch. & Savat) Kitam.,Plantae,Angiospermae,Dicotyledoneae,Campanulales,Compositae,Cirsium,Japan,Japan,Mt. Kamabuse-yama,Osato-gun Yoriimachi,,Saitama,Eastern Asia,Japan,,,,,,,,,,,,http://data.gbif.org/occurrences/393096210,http://data.gbif.org/ws/rest/occurrence/get?key=393096210
"National Museum of Nature and Science, Japan",Angiospermatatophytina Collection of Saitama Museum of Natural History,,,,,,,SMNH,As,18019,Specimen,,52:34.0,,,Cirsium nipponicum (Maxim.) Makino var. incomptum (Franch. et Savat) Kitam.,(Franch. et Savat) Kitam.,Cirsium nipponicum var. incomptum (Franch. & Savat) Kitam.,Plantae,Angiospermae,Dicotyledoneae,Campanulales,Compositae,Cirsium,Japan,Japan,Urayama,Chichibu-shi,,Saitama,Eastern Asia,Japan,,,,,,,,,,,,http://data.gbif.org/occurrences/393096195,http://data.gbif.org/ws/rest/occurrence/get?key=393096195
"National Museum of Nature and Science, Japan",Angiospermatatophytina Collection of Saitama Museum of Natural History,,,,,,,SMNH,As,18032,Specimen,,52:34.0,,,Cirsium nipponicum (Maxim.) Makino var. incomptum (Franch. et Savat) Kitam.,(Franch. et Savat) Kitam.,Cirsium nipponicum var. incomptum (Franch. & Savat) Kitam.,Plantae,Angiospermae,Dicotyledoneae,Campanulales,Compositae,Cirsium,Japan,Japan,Mt. Futago-yama,Chichibu-gun Oganomachi,,Saitama,Eastern Asia,Japan,,,,,,,,,,,,http://data.gbif.org/occurrences/393096218,http://data.gbif.org/ws/rest/occurrence/get?key=393096218
"National Museum of Nature and Science, Japan",Angiospermatatophytina Collection of Saitama Museum of Natural History,,,,,,,SMNH,As,18018,Specimen,,52:34.0,,,Cirsium nipponicum (Maxim.) Makino var. incomptum (Franch. et Savat) Kitam.,(Franch. et Savat) Kitam.,Cirsium nipponicum var. incomptum (Franch. & Savat) Kitam.,Plantae,Angiospermae,Dicotyledoneae,Campanulales,Compositae,Cirsium,Japan,Japan,Mt. Buko-san,Chichibu-shi,,Saitama,Eastern Asia,Japan,,,,,,,,,,,,http://data.gbif.org/occurrences/393096193,http://data.gbif.org/ws/rest/occurrence/get?key=393096193
"National Museum of Nature and Science, Japan",Angiospermatatophytina Collection of Saitama Museum of Natural History,,,,,,,SMNH,As,18029,Specimen,,52:34.0,,,Cirsium nipponicum (Maxim.) Makino var. incomptum (Franch. et Savat) Kitam.,(Franch. et Savat) Kitam.,Cirsium nipponicum var. incomptum (Franch. & Savat) Kitam.,Plantae,Angiospermae,Dicotyledoneae,Campanulales,Compositae,Cirsium,Japan,Japan,Urayama,Chichibu-shi,,Saitama,Eastern Asia,Japan,,,,,,,,,,,,http://data.gbif.org/occurrences/393096213,http://data.gbif.org/ws/rest/occurrence/get?key=393096213
"National Museum of Nature and Science, Japan",Angiospermatatophytina Collection of Saitama Museum of Natural History,,,,,,,SMNH,As,18015,Specimen,,52:34.0,,,Cirsium nipponicum (Maxim.) Makino var. incomptum (Franch. et Savat) Kitam.,(Franch. et Savat) Kitam.,Cirsium nipponicum var. incomptum (Franch. & Savat) Kitam.,Plantae,Angiospermae,Dicotyledoneae,Campanulales,Compositae,Cirsium,Japan,Japan,Mt. Kumakura-san,Chichibu-gun Arakawamura,,Saitama,Eastern Asia,Japan,,,,,,,,,,,,http://data.gbif.org/occurrences/393096187,http://data.gbif.org/ws/rest/occurrence/get?key=393096187
"National Museum of Nature and Science, Japan",Angiospermatatophytina Collection of Saitama Museum of Natural History,,,,,,,SMNH,As,18012,Specimen,,52:34.0,,,Cirsium nipponicum (Maxim.) Makino var. incomptum (Franch. et Savat) Kitam.,(Franch. et Savat) Kitam.,Cirsium nipponicum var. incomptum (Franch. & Savat) Kitam.,Plantae,Angiospermae,Dicotyledoneae,Campanulales,Compositae,Cirsium,Japan,Japan,Mt. Kumakura-san,Chichibu-gun Arakawamura,,Saitama,Eastern Asia,Japan,,,,,,,,,,,,http://data.gbif.org/occurrences/393096181,http://data.gbif.org/ws/rest/occurrence/get?key=393096181
"National Museum of Nature and Science, Japan",Angiospermatatophytina Collection of Saitama Museum of Natural History,,,,,,,SMNH,As,18039,Specimen,,52:34.0,,,Cirsium nipponicum (Maxim.) Makino var. incomptum (Franch. et Savat) Kitam.,(Franch. et Savat) Kitam.,Cirsium nipponicum var. incomptum (Franch. & Savat) Kitam.,Plantae,Angiospermae,Dicotyledoneae,Campanulales,Compositae,Cirsium,Japan,Japan,Mt. Dodaira-san,Chichibu-gun Higashichichibumura,,Saitama,Eastern Asia,Japan,,,,,,,,,,,,http://data.gbif.org/occurrences/393096229,http://data.gbif.org/ws/rest/occurrence/get?key=393096229
"National Museum of Nature and Science, Japan",Angiospermatatophytina Collection of Saitama Museum of Natural History,,,,,,,SMNH,As,18035,Specimen,,52:34.0,,,Cirsium nipponicum (Maxim.) Makino var. incomptum (Franch. et Savat) Kitam.,(Franch. et Savat) Kitam.,Cirsium nipponicum var. incomptum (Franch. & Savat) Kitam.,Plantae,Angiospermae,Dicotyledoneae,Campanulales,Compositae,Cirsium,Japan,Japan,Onagata,Chichibu-gun Yoshidamachi,,Saitama,Eastern Asia,Japan,,,,,,,,,,,,http://data.gbif.org/occurrences/393096223,http://data.gbif.org/ws/rest/occurrence/get?key=393096223
"National Museum of Nature and Science, Japan",Angiospermatatophytina Collection of Saitama Museum of Natural History,,,,,,,SMNH,As,18026,Specimen,,52:34.0,,,Cirsium nipponicum (Maxim.) Makino var. incomptum (Franch. et Savat) Kitam.,(Franch. et Savat) Kitam.,Cirsium nipponicum var. incomptum (Franch. & Savat) Kitam.,Plantae,Angiospermae,Dicotyledoneae,Campanulales,Compositae,Cirsium,Japan,Japan,Kagemori,Chichibu-shi,,Saitama,Eastern Asia,Japan,,,,,,,,,,,,http://data.gbif.org/occurrences/393096208,http://data.gbif.org/ws/rest/occurrence/get?key=393096208
"National Museum of Nature and Science, Japan",Angiospermatatophytina Collection of Saitama Museum of Natural History,,,,,,,SMNH,As,18022,Specimen,,52:34.0,,,Cirsium nipponicum (Maxim.) Makino var. incomptum (Franch. et Savat) Kitam.,(Franch. et Savat) Kitam.,Cirsium nipponicum var. incomptum (Franch. & Savat) Kitam.,Plantae,Angiospermae,Dicotyledoneae,Campanulales,Compositae,Cirsium,Japan,Japan,Urayama,Chichibu-shi,,Saitama,Eastern Asia,Japan,,,,,,,,,,,,http://data.gbif.org/occurrences/393096201,http://data.gbif.org/ws/rest/occurrence/get?key=393096201
"National Museum of Nature and Science, Japan",Angiospermatatophytina Collection of Saitama Museum of Natural History,,,,,,,SMNH,As,18031,Specimen,,52:34.0,,,Cirsium nipponicum (Maxim.) Makino var. incomptum (Franch. et Savat) Kitam.,(Franch. et Savat) Kitam.,Cirsium nipponicum var. incomptum (Franch. & Savat) Kitam.,Plantae,Angiospermae,Dicotyledoneae,Campanulales,Compositae,Cirsium,Japan,Japan,Mt. Dodaira-san,Chichibu-gun Higashichichibumura,,Saitama,Eastern Asia,Japan,,,,,,,,,,,,http://data.gbif.org/occurrences/393096216,http://data.gbif.org/ws/rest/occurrence/get?key=393096216
"National Museum of Nature and Science, Japan",Angiospermatatophytina Collection of Saitama Museum of Natural History,,,,,,,SMNH,As,24228,Specimen,,52:35.0,,,Cirsium nipponicum (Maxim.) Makino var. incomptum (Franch. et Savat) Kitam.,(Franch. et Savat) Kitam.,Cirsium nipponicum var. incomptum (Franch. & Savat) Kitam.,Plantae,Angiospermae,Dicotyledoneae,Campanulales,Compositae,Cirsium,Japan,Japan,Trailhead of Mt. Fuji-san,Fujiyoshida-shi,,Yamanashi,Eastern Asia,Japan,,,,,,,,,,,,http://data.gbif.org/occurrences/393096454,http://data.gbif.org/ws/rest/occurrence/get?key=393096454
"National Museum of Nature and Science, Japan",Angiospermatatophytina Collection of Saitama Museum of Natural History,,,,,,,SMNH,As,5552,Specimen,,52:32.0,,,Cirsium nipponicum (Maxim.) Makino var. incomptum (Franch. et Savat) Kitam.,(Franch. et Savat) Kitam.,Cirsium nipponicum var. incomptum (Franch. & Savat) Kitam.,Plantae,Angiospermae,Dicotyledoneae,Campanulales,Compositae,Cirsium,Japan,Japan,,Hiki-gun Tokigawamura,,Saitama,Eastern Asia,Japan,,,,,,,,,,,,http://data.gbif.org/occurrences/353564562,http://data.gbif.org/ws/rest/occurrence/get?key=353564562
"National Museum of Nature and Science, Japan",Angiospermatatophytina Collection of Saitama Museum of Natural History,,,,,,,SMNH,As,18025,Specimen,,52:34.0,,,Cirsium nipponicum (Maxim.) Makino var. incomptum (Franch. et Savat) Kitam.,(Franch. et Savat) Kitam.,Cirsium nipponicum var. incomptum (Franch. & Savat) Kitam.,Plantae,Angiospermae,Dicotyledoneae,Campanulales,Compositae,Cirsium,Japan,Japan,Mt. Futago-yama,Chichibu-gun Yokozemachi,,Saitama,Eastern Asia,Japan,,,,,,,,,,,,http://data.gbif.org/occurrences/393096206,http://data.gbif.org/ws/rest/occurrence/get?key=393096206
"National Museum of Nature and Science, Japan",Angiospermatatophytina Collection of Saitama Museum of Natural History,,,,,,,SMNH,As,18014,Specimen,,52:34.0,,,Cirsium nipponicum (Maxim.) Makino var. incomptum (Franch. et Savat) Kitam.,(Franch. et Savat) Kitam.,Cirsium nipponicum var. incomptum (Franch. & Savat) Kitam.,Plantae,Angiospermae,Dicotyledoneae,Campanulales,Compositae,Cirsium,Japan,Japan,Mt. Kumakura-san,Chichibu-gun Arakawamura,,Saitama,Eastern Asia,Japan,,,,,,,,,,,,http://data.gbif.org/occurrences/393096185,http://data.gbif.org/ws/rest/occurrence/get?key=393096185
"National Museum of Nature and Science, Japan",Angiospermatatophytina Collection of Saitama Museum of Natural History,,,,,,,SMNH,As,18036,Specimen,,52:34.0,,,Cirsium nipponicum (Maxim.) Makino var. incomptum (Franch. et Savat) Kitam.,(Franch. et Savat) Kitam.,Cirsium nipponicum var. incomptum (Franch. & Savat) Kitam.,Plantae,Angiospermae,Dicotyledoneae,Campanulales,Compositae,Cirsium,Japan,Japan,Onagata,Chichibu-gun Yoshidamachi,,Saitama,Eastern Asia,Japan,,,,,,,,,,,,http://data.gbif.org/occurrences/393096224,http://data.gbif.org/ws/rest/occurrence/get?key=393096224