Data Publisher,Dataset,Dataset Rights,Collector name,Collector number,Field number,GUID,Date collected,Institution code,Collection code,Catalogue number,Basis of record,Image url,Last indexed,Identifier,Identification date,Scientific name,Author,Scientific name (interpreted),Kingdom,Phylum,Class,Order,Family,Genus,Country,Country (interpreted),Locality,County,Continent or Ocean,State/Province,Region,Publisher country,Latitude,Longitude,Coordinate precision,Cell id,Centi cell id,Min depth,Max depth,Max depth,Min altitude,Max altitude,Altitude precision,GBIF portal url,GBIF webservice url
Australian National Herbarium (CANB),Australian National Herbarium (CANB),,"Okuyama, S.",,s.n.,,00:00.0,CANB,333284,331604,Specimen,,32:54.0,,,Viola orientalis,,Viola orientalis,Plantae,,,,Violaceae,Viola,JAPAN,Japan,"Honshu Pref. Aichi: Iwasaki-mura, Toyohashi-city.",,,,Eastern Asia,Australia,35,137.25,10000,45317,2,,,,100,,,http://data.gbif.org/occurrences/117524312,http://data.gbif.org/ws/rest/occurrence/get?key=117524312
Australian National Herbarium (CANB),Australian National Herbarium (CANB),,"Togashi, M.",,s.n.,,00:00.0,CANB,333285,331591,Specimen,,32:54.0,,,Viola orientalis,,Viola orientalis,Plantae,,,,Violaceae,Viola,JAPAN,Japan,"Honshu Pref. Shizouka: Near the top of Mt Takakusa-yama, Northernpart of Yaizu-city.",,,,Eastern Asia,Australia,35,138,10000,45318,0,,,,500,,,http://data.gbif.org/occurrences/117524304,http://data.gbif.org/ws/rest/occurrence/get?key=117524304
"National Institute of Genetics, ROIS","Herbarium Specimens of Museum of Nature and Human Activities, Hyogo Pref., Japan",,,,,,,HYO,VP,C1-061963,Specimen,,25:59.0,H.Ikeda,,Viola orientalis,,Viola orientalis,Plantae,Magnoliophyta,,,Violaceae,Viola,Japan,Japan,"Kumamoto; Aso-gun, Aso-machi, Tohmiga-hana (Daikanboh).930 m alt. 32 59'30'N 131 04'20'E.",,,Kumamoto,Eastern Asia,Japan,131.067,32.9833,,,,,,,930,930,,http://data.gbif.org/occurrences/323519579,http://data.gbif.org/ws/rest/occurrence/get?key=323519579
"National Museum of Nature and Science, Japan","Plant specimens depodited in Osaka Museum of Natural History, Japan.",,,,,,,OSA,C,OSA36056,Specimen,,25:33.0,,,Viola orientalis (Maxim.) W. Beck.,(Maxim.) W. Beck.,Viola orientalis (Maxim.) W. Beck.,Plantae,,,,Violaceae,Viola,Japan,Japan,,Ohita-gun Yufuin-cho,,Oita Prefecture,Eastern Asia,Japan,,,,,,,,,,,,http://data.gbif.org/occurrences/295180288,http://data.gbif.org/ws/rest/occurrence/get?key=295180288
"National Museum of Nature and Science, Japan","Plant specimens depodited in Osaka Museum of Natural History, Japan.",,,,,,,OSA,C,OSA8866,Specimen,,25:32.0,,,Viola orientalis (Maxim.) W. Beck.,(Maxim.) W. Beck.,Viola orientalis (Maxim.) W. Beck.,Plantae,,,,Violaceae,Viola,Japan,Japan,,Shida-gun,,Shizuoka Prefecture,Eastern Asia,Japan,,,,,,,,,,,,http://data.gbif.org/occurrences/295180080,http://data.gbif.org/ws/rest/occurrence/get?key=295180080
"National Museum of Nature and Science, Japan","Plant specimens depodited in Osaka Museum of Natural History, Japan.",,,,,,,OSA,C,OSA28327,Specimen,,25:33.0,,,Viola orientalis (Maxim.) W. Beck.,(Maxim.) W. Beck.,Viola orientalis (Maxim.) W. Beck.,Plantae,,,,Violaceae,Viola,Japan,Japan,,Kuma-gun Kuju-cho,,Oita Prefecture,Eastern Asia,Japan,,,,,,,,,,,,http://data.gbif.org/occurrences/295180222,http://data.gbif.org/ws/rest/occurrence/get?key=295180222
"National Museum of Nature and Science, Japan","Plant specimens depodited in Osaka Museum of Natural History, Japan.",,,,,,,OSA,C,OSA36055,Specimen,,25:33.0,,,Viola orientalis (Maxim.) W. Beck.,(Maxim.) W. Beck.,Viola orientalis (Maxim.) W. Beck.,Plantae,,,,Violaceae,Viola,Japan,Japan,,Ohita-gun Yufuin-cho,,Oita Prefecture,Eastern Asia,Japan,,,,,,,,,,,,http://data.gbif.org/occurrences/295180287,http://data.gbif.org/ws/rest/occurrence/get?key=295180287
"National Museum of Nature and Science, Japan","Plant specimens depodited in Osaka Museum of Natural History, Japan.",,,,,,,OSA,C,OSA25232,Specimen,,25:33.0,,,Viola orientalis (Maxim.) W. Beck.,(Maxim.) W. Beck.,Viola orientalis (Maxim.) W. Beck.,Plantae,,,,Violaceae,Viola,Japan,Japan,,Yaizu-shi,,Shizuoka Prefecture,Eastern Asia,Japan,,,,,,,,,,,,http://data.gbif.org/occurrences/295180189,http://data.gbif.org/ws/rest/occurrence/get?key=295180189
"National Museum of Nature and Science, Japan","Botanical specimens database of Mr. Jiro Ito collection, Shizuoka Prefecture Museum of Natural History",,,,,,,SPMN,a,SPMN-a-1072,Specimen,,37:45.0,,,Viola orientalis (Maxim.) W. Becker,(Maxim.) W. Becker,Viola orientalis (Maxim.) W. Becker,Plantae,Magnoliophyta,Magnoliopsida,Violales,Violaceae,Viola,Japan,Japan,,Shida-gun Okabecho,,Shizuoka,Eastern Asia,Japan,,,,,,,,,,,,http://data.gbif.org/occurrences/380184116,http://data.gbif.org/ws/rest/occurrence/get?key=380184116
"National Museum of Nature and Science, Japan","Plant specimens depodited in Osaka Museum of Natural History, Japan.",,,,,,,OSA,C,OSA1021,Specimen,,25:32.0,,,Viola orientalis (Maxim.) W. Becker,(Maxim.) W. Becker,Viola orientalis (Maxim.) W. Becker,Plantae,,,,Violaceae,Viola,Japan,Japan,"Yaizu, Mt. Takakusa-yama",,,Shizuoka Prefecture,Eastern Asia,Japan,,,,,,,,,,,,http://data.gbif.org/occurrences/295179959,http://data.gbif.org/ws/rest/occurrence/get?key=295179959
"National Museum of Nature and Science, Japan",Angiosperm specimens of Iwate Prefectural Museum,,,,,,,IPMM,PA,72491,Specimen,,00:23.0,,,Viola orientalis (Maxim.) W.Becker,(Maxim.) W.Becker,Viola orientalis (Maxim.) W.Becker,Plantae,Angiospermae,Dicotyledoneae,,Violaceae,Viola,Japan,Japan,,Haibara-gun Yoshidacho,,Shizuoka,Eastern Asia,Japan,,,,,,,,,,,,http://data.gbif.org/occurrences/93898540,http://data.gbif.org/ws/rest/occurrence/get?key=93898540
"National Museum of Nature and Science, Japan","Herbarium Specimens of Museum of Nature and Human Activities, Hyogo Prefecture, Japan",,,,,,,HYO,C1,C1-061963,Specimen,,29:48.0,,,Viola orientalis (Maxim.) W.Becker,(Maxim.) W.Becker,Viola orientalis (Maxim.) W.Becker,Plantae,,,,Violaceae,Violaceae,JAPAN,Japan,Tomiga-hana (Daikanbo),"Aso-gun, Aso-machi",,Pref. Kumamoto:,Eastern Asia,Japan,32.59,32.59,,44132,55,,,,,,,http://data.gbif.org/occurrences/204218432,http://data.gbif.org/ws/rest/occurrence/get?key=204218432
"National Museum of Nature and Science, Japan",Kochi Prefectural Makino Botanical Garden,,,,,,,MBK,MBK,176197,Specimen,,04:57.0,,,Viola orientalis (Maxim.) W.Becker,,Viola orientalis (Maxim.) W.Becker,Plantae,,,Violales,Violaceae,Viola,Japan,Japan,,,,Pref. Kochi,Eastern Asia,Japan,,,,,,,,,,,,http://data.gbif.org/occurrences/143976497,http://data.gbif.org/ws/rest/occurrence/get?key=143976497
"National Museum of Nature and Science, Japan",Kochi Prefectural Makino Botanical Garden,,,,,,,MBK,MBK,9526,Specimen,,04:54.0,,,Viola orientalis (Maxim.) W.Becker,,Viola orientalis (Maxim.) W.Becker,Plantae,,,Violales,Violaceae,Viola,Japan,Japan,,,,Pref. Kochi,Eastern Asia,Japan,,,,,,,,,,,,http://data.gbif.org/occurrences/143975832,http://data.gbif.org/ws/rest/occurrence/get?key=143975832
"National Museum of Nature and Science, Japan",Plant Specimens of Kurashiki Museum of Natural History,,,,,,,KURA,KURA,123240,Specimen,,19:46.0,,,Viola orientalis (Maxim.) W.Becker,(Maxim.) W.Becker,Viola orientalis (Maxim.) W.Becker,Plantae,,,,Violaceae,Viola,Japan,Japan,,,,Kumamoto,Eastern Asia,Japan,,,,,,,,,,,,http://data.gbif.org/occurrences/43188957,http://data.gbif.org/ws/rest/occurrence/get?key=43188957
"Netherlands Centre for Biodiversity Naturalis, section National Herbarium of the Netherlands",Nationaal Herbarium Nederland,,"Keiske, I",,s.n.,,,L,L,1095359,Specimen,,07:02.0,"Nakai, T.",,Viola xanthopetala Nakai,,Viola xanthopetala Nakai,,,,,Violaceae,Viola,Japan,Japan,,,,,Eastern Asia,Netherlands,,,,,,,,,,,,http://data.gbif.org/occurrences/250664085,http://data.gbif.org/ws/rest/occurrence/get?key=250664085
"Netherlands Centre for Biodiversity Naturalis, section National Herbarium of the Netherlands",Nationaal Herbarium Nederland,,"Mohnike, OGJ",,s.n.,,,L,L,1124680,Specimen,,07:02.0,"Nakai, T.",,Viola xanthopetala Nakai,,Viola xanthopetala Nakai,,,,,Violaceae,Viola,Japan,Japan,,,,,Eastern Asia,Netherlands,,,,,,,,,,,,http://data.gbif.org/occurrences/250664086,http://data.gbif.org/ws/rest/occurrence/get?key=250664086
"National Museum of Nature and Science, Japan",Plant Specimens collections of the Kyushu UNniversity Museum,,,,,,,KYUM,FU,NAK02732,Specimen,,16:28.0,,,Viola xanthopetala Nakai,,Viola xanthopetala Nakai,Plantae,Magnoliophyta,Magnoliopsida,Violales,Violaceae,Viola,Japan,Japan,,,,Ohita Pref.,Eastern Asia,Japan,,,,,,,,,,,,http://data.gbif.org/occurrences/234573261,http://data.gbif.org/ws/rest/occurrence/get?key=234573261
