Data Publisher,Dataset,Dataset Rights,Collector name,Collector number,Field number,GUID,Date collected,Institution code,Collection code,Catalogue number,Basis of record,Image url,Last indexed,Identifier,Identification date,Scientific name,Author,Scientific name (interpreted),Kingdom,Phylum,Class,Order,Family,Genus,Country,Country (interpreted),Locality,County,Continent or Ocean,State/Province,Region,Publisher country,Latitude,Longitude,Coordinate precision,Cell id,Centi cell id,Min depth,Max depth,Max depth,Min altitude,Max altitude,Altitude precision,GBIF portal url,GBIF webservice url
"National Museum of Nature and Science, Japan",Angiosperm specimens of Iwate Prefectural Museum,,,,,,,IPMM,PA,5235,Specimen,,00:23.0,,,Viola sacchalinensis H.Boissieu,H.Boissieu,Viola sacchalinensis H.Boissieu,Plantae,Angiospermae,Dicotyledoneae,Violales,Violaceae,Viola,Japan,Japan,,Hanamaki-shi,,Iwate,Eastern Asia,Japan,,,,,,,,,,,,http://data.gbif.org/occurrences/204236988,http://data.gbif.org/ws/rest/occurrence/get?key=204236988
"National Museum of Nature and Science, Japan",Angiosperm specimens of Iwate Prefectural Museum,,,,,,,IPMM,PA,29658,Specimen,,00:25.0,,,Viola sacchalinensis H.Boissieu,H.Boissieu,Viola sacchalinensis H.Boissieu,Plantae,Angiospermae,Dicotyledoneae,Violales,Violaceae,Viola,Japan,Japan,,Hanamaki-shi,,Iwate,Eastern Asia,Japan,,,,,,,,,,,,http://data.gbif.org/occurrences/204237278,http://data.gbif.org/ws/rest/occurrence/get?key=204237278
"National Museum of Nature and Science, Japan",Angiosperm specimens of Iwate Prefectural Museum,,,,,,,IPMM,PA,29659,Specimen,,00:25.0,,,Viola sacchalinensis H.Boissieu,H.Boissieu,Viola sacchalinensis H.Boissieu,Plantae,Angiospermae,Dicotyledoneae,Violales,Violaceae,Viola,Japan,Japan,,Tono-shi,,Iwate,Eastern Asia,Japan,,,,,,,,,,,,http://data.gbif.org/occurrences/204237279,http://data.gbif.org/ws/rest/occurrence/get?key=204237279
"National Institute of Genetics, ROIS","Plant Specimen Database of Tama Forest Science Garden, Forestry and Forest Products Research Institute, Japan",,,,,,,FFPRI,TFA,19765,Specimen,,23:46.0,,,Viola sacchalinensis H.Boissieu,,Viola sacchalinensis H.Boissieu,Plantae,Magnoliophyta,Magnoliopsida,Violales,Violaceae,Viola,Japan,Japan,Mt. Risiri,Risiri County,,Hokkaido Prefecture,Eastern Asia,Japan,,,,,,,,,,,,http://data.gbif.org/occurrences/360263068,http://data.gbif.org/ws/rest/occurrence/get?key=360263068
"National Institute of Genetics, ROIS","Plant Specimen Database of Tama Forest Science Garden, Forestry and Forest Products Research Institute, Japan",,,,,,,FFPRI,TFA,19766,Specimen,,23:46.0,,,Viola sacchalinensis H.Boissieu,,Viola sacchalinensis H.Boissieu,Plantae,Magnoliophyta,Magnoliopsida,Violales,Violaceae,Viola,Japan,Japan,Mt. Yubaridake,Yubari City,,Hokkaido Prefecture,Eastern Asia,Japan,43.09665,142.2506,,48202,2,,,,,1668,,http://data.gbif.org/occurrences/360263069,http://data.gbif.org/ws/rest/occurrence/get?key=360263069
"National Institute of Genetics, ROIS","Plant Specimen Database of Tama Forest Science Garden, Forestry and Forest Products Research Institute, Japan",,,,,,,FFPRI,TFA,19764,Specimen,,23:46.0,,,Viola sacchalinensis H.Boissieu,,Viola sacchalinensis H.Boissieu,Plantae,Magnoliophyta,Magnoliopsida,Violales,Violaceae,Viola,Japan,Japan,Natudomari Peninsula,Higasi-tugaru County,,Aomori Prefecture,Eastern Asia,Japan,40.9527,140.9158,,47120,99,,,,0,320,,http://data.gbif.org/occurrences/360263067,http://data.gbif.org/ws/rest/occurrence/get?key=360263067
"National Museum of Nature and Science, Japan",Plant Specimens of Kurashiki Museum of Natural History,,,,,,,KURA,KURA,123276,Specimen,,19:46.0,,,Viola sacchalinensis H.Boissieu,H.Boissieu,Viola sacchalinensis H.Boissieu,Plantae,,,,Violaceae,Viola,Japan,Japan,,,,Hokkaido,Eastern Asia,Japan,,,,,,,,,,,,http://data.gbif.org/occurrences/43189136,http://data.gbif.org/ws/rest/occurrence/get?key=43189136
"National Museum of Nature and Science, Japan",Plant Specimens of Kurashiki Museum of Natural History,,,,,,,KURA,KURA,123274,Specimen,,19:46.0,,,Viola sacchalinensis H.Boissieu,H.Boissieu,Viola sacchalinensis H.Boissieu,Plantae,,,,Violaceae,Viola,Japan,Japan,,,,Hokkaido,Eastern Asia,Japan,,,,,,,,,,,,http://data.gbif.org/occurrences/43189133,http://data.gbif.org/ws/rest/occurrence/get?key=43189133
"National Museum of Nature and Science, Japan",Plant Specimens of Kurashiki Museum of Natural History,,,,,,,KURA,KURA,123275,Specimen,,19:46.0,,,Viola sacchalinensis H.Boissieu,H.Boissieu,Viola sacchalinensis H.Boissieu,Plantae,,,,Violaceae,Viola,Japan,Japan,,,,Hokkaido,Eastern Asia,Japan,,,,,,,,,,,,http://data.gbif.org/occurrences/43189132,http://data.gbif.org/ws/rest/occurrence/get?key=43189132
"National Museum of Nature and Science, Japan",Plant Specimens of Kurashiki Museum of Natural History,,,,,,,KURA,KURA,123277,Specimen,,19:46.0,,,Viola sacchalinensis H.Boissieu,H.Boissieu,Viola sacchalinensis H.Boissieu,Plantae,,,,Violaceae,Viola,Japan,Japan,,,,Hokkaido,Eastern Asia,Japan,,,,,,,,,,,,http://data.gbif.org/occurrences/43189146,http://data.gbif.org/ws/rest/occurrence/get?key=43189146
