Data Publisher,Dataset,Dataset Rights,Collector name,Collector number,Field number,GUID,Date collected,Institution code,Collection code,Catalogue number,Basis of record,Image url,Last indexed,Identifier,Identification date,Scientific name,Author,Scientific name (interpreted),Kingdom,Phylum,Class,Order,Family,Genus,Country,Country (interpreted),Locality,County,Continent or Ocean,State/Province,Region,Publisher country,Latitude,Longitude,Coordinate precision,Cell id,Centi cell id,Min depth,Max depth,Max depth,Min altitude,Max altitude,Altitude precision,GBIF portal url,GBIF webservice url
"National Institute of Genetics, ROIS","Herbarium Specimens of Museum of Nature and Human Activities, Hyogo Pref., Japan",,,,,,,HYO,VP,C1-017751,Specimen,,24:33.0,,,Geranium wilfordii,,Geranium wilfordii,Plantae,Magnoliophyta,,,Geraniaceae,Geranium,Japan,Japan,"Hyogo Pref.; Hyonosen, Sekinomiya-cho, Yabu-gun.",,,Hyogo,Eastern Asia,Japan,134.517,35.35,,,,,,,,,,http://data.gbif.org/occurrences/323511340,http://data.gbif.org/ws/rest/occurrence/get?key=323511340
"National Institute of Genetics, ROIS","Herbarium Specimens of Museum of Nature and Human Activities, Hyogo Pref., Japan",,,,,,,HYO,VP,C1-070615,Specimen,,24:08.0,Y.Fujimoto,,Geranium wilfordii,,Geranium wilfordii,Plantae,Magnoliophyta,,,Geraniaceae,Geranium,Japan,Japan,"HYOGO P.:Mt. Myoukensan, Youka-cyo, Yabu-gun.",,,Hyogo,Eastern Asia,Japan,134.668,35.4022,,,,,,,550,700,,http://data.gbif.org/occurrences/323509185,http://data.gbif.org/ws/rest/occurrence/get?key=323509185
"National Institute of Genetics, ROIS","Herbarium Specimens of Museum of Nature and Human Activities, Hyogo Pref., Japan",,,,,,,HYO,VP,C1-068735,Specimen,,27:02.0,T.Fujii,,Geranium wilfordii,,Geranium wilfordii,Plantae,Magnoliophyta,,,Geraniaceae,Geranium,Japan,Japan,"Pref.Hyogo;Ojiri-keikoku,Mikata-cho,Mikata- gun",,,Hyogo,Eastern Asia,Japan,134.5,35.4,,,,,,,400,500,,http://data.gbif.org/occurrences/323525856,http://data.gbif.org/ws/rest/occurrence/get?key=323525856
"National Institute of Genetics, ROIS","Herbarium Specimens of Museum of Nature and Human Activities, Hyogo Pref., Japan",,,,,,,HYO,VP,C1-122039,Specimen,,24:57.0,,,Geranium wilfordii,,Geranium wilfordii,Plantae,Magnoliophyta,,,Geraniaceae,Geranium,Japan,Japan,"Hyogo Pref.; Mikata-gun, Muraoka-cho, Saku-yama.",,,Hyogo,Eastern Asia,Japan,,,,,,,,,500,500,,http://data.gbif.org/occurrences/323513531,http://data.gbif.org/ws/rest/occurrence/get?key=323513531
"National Institute of Genetics, ROIS","Herbarium Specimens of Museum of Nature and Human Activities, Hyogo Pref., Japan",,,,,,,HYO,VP,C1-109928,Specimen,,26:35.0,,,Geranium wilfordii,,Geranium wilfordii,Plantae,Magnoliophyta,,,Geraniaceae,Geranium,Japan,Japan,"Pref. Hyogo: along the river Kosa-kawa, Ishiwara, Youka-cho, Yabu-gun.",,,Hyogo,Eastern Asia,Japan,134.7,35.4,,,,,,,200,500,,http://data.gbif.org/occurrences/323523142,http://data.gbif.org/ws/rest/occurrence/get?key=323523142
"National Institute of Genetics, ROIS","Herbarium Specimens of Museum of Nature and Human Activities, Hyogo Pref., Japan",,,,,,,HYO,VP,C1-167758,Specimen,,25:04.0,,,Geranium wilfordii,,Geranium wilfordii,Plantae,Magnoliophyta,,,Geraniaceae,Geranium,Japan,Japan,"Hyogo Pref.; Ooginosen-Kirigataki, Onsen-cho, Mikata-gun.",,,Hyogo,Eastern Asia,Japan,134.45,35.4333,,,,,,,,,,http://data.gbif.org/occurrences/323514221,http://data.gbif.org/ws/rest/occurrence/get?key=323514221
"National Institute of Genetics, ROIS","Herbarium Specimens of Museum of Nature and Human Activities, Hyogo Pref., Japan",,,,,,,HYO,VP,C1-175062,Specimen,,24:53.0,,,Geranium wilfordii,,Geranium wilfordii,Plantae,Magnoliophyta,,,Geraniaceae,Geranium,Japan,Japan,"Hyogo Pref.; Mikata-gun, Mikata-cho, Konagatawa.",,,Hyogo,Eastern Asia,Japan,134.5,35.45,,,,,,,600,700,,http://data.gbif.org/occurrences/323513106,http://data.gbif.org/ws/rest/occurrence/get?key=323513106
"National Institute of Genetics, ROIS","Herbarium Specimens of Museum of Nature and Human Activities, Hyogo Pref., Japan",,,,,,,HYO,VP,C1-049930,Specimen,,24:11.0,,,Geranium wilfordii,,Geranium wilfordii,Plantae,Magnoliophyta,,,Geraniaceae,Geranium,Japan,Japan,"Hyogo Pref.: Yabu-gun, Yohka-cho, Imataki-tera.",,,Hyogo,Eastern Asia,Japan,,,,,,,,,,,,http://data.gbif.org/occurrences/323509420,http://data.gbif.org/ws/rest/occurrence/get?key=323509420
"National Institute of Genetics, ROIS","Herbarium Specimens of Museum of Nature and Human Activities, Hyogo Pref., Japan",,,,,,,HYO,VP,C1-134470,Specimen,,24:45.0,Y.Fujimoto,,Geranium wilfordii,,Geranium wilfordii,Plantae,Magnoliophyta,,,Geraniaceae,Geranium,Japan,Japan,"Hyogo Pref.; Mikata-gun, Hamasaka-cho, Hontani.",,,Hyogo,Eastern Asia,Japan,134.567,35.5833,,,,,,,200,250,,http://data.gbif.org/occurrences/323512482,http://data.gbif.org/ws/rest/occurrence/get?key=323512482
"National Institute of Genetics, ROIS","Herbarium Specimens of Museum of Nature and Human Activities, Hyogo Pref., Japan",,,,,,,HYO,VP,C1-049903,Specimen,,25:37.0,,,Geranium wilfordii,,Geranium wilfordii,Plantae,Magnoliophyta,,,Geraniaceae,Geranium,Japan,Japan,"Hyogo-ken: Yabu-gun, Yohka-cho, Mt.Myoken.",,,Hyogo,Eastern Asia,Japan,,,,,,,,,,,,http://data.gbif.org/occurrences/323517560,http://data.gbif.org/ws/rest/occurrence/get?key=323517560
"National Institute of Genetics, ROIS","Herbarium Specimens of Museum of Nature and Human Activities, Hyogo Pref., Japan",,,,,,,HYO,VP,C1-155214,Specimen,,22:45.0,,,Geranium wilfordii,,Geranium wilfordii,Plantae,Magnoliophyta,,,Geraniaceae,Geranium,Japan,Japan,"Fukui Pref.; Nyuu-gun, Echizen-cho, en route from Besshi-touge to Kuriya.",,,Fukui,Eastern Asia,Japan,136.017,35.9333,,,,,,,100,350,,http://data.gbif.org/occurrences/323501811,http://data.gbif.org/ws/rest/occurrence/get?key=323501811
"National Institute of Genetics, ROIS","Herbarium Specimens of Museum of Nature and Human Activities, Hyogo Pref., Japan",,,,,,,HYO,VP,C1-148901,Specimen,,20:31.0,T.Fujii,,Geranium wilfordii,,Geranium wilfordii,Plantae,Magnoliophyta,,,Geraniaceae,Geranium,Japan,Japan,"Hyogo Pref.; Mihara-gun, Seidan-cho, Matsuho",,,Hyogo,Eastern Asia,Japan,,,,,,,,,,,,http://data.gbif.org/occurrences/323479729,http://data.gbif.org/ws/rest/occurrence/get?key=323479729
"National Institute of Genetics, ROIS","Herbarium Specimens of Museum of Nature and Human Activities, Hyogo Pref., Japan",,,,,,,HYO,VP,C1-122008,Specimen,,24:57.0,,,Geranium wilfordii,,Geranium wilfordii,Plantae,Magnoliophyta,,,Geraniaceae,Geranium,Japan,Japan,"Hyogo Pref.; Mikata-gun, Muraoka-cho, Saku-yama.",,,Hyogo,Eastern Asia,Japan,134.617,35.4167,,,,,,,500,500,,http://data.gbif.org/occurrences/323513532,http://data.gbif.org/ws/rest/occurrence/get?key=323513532
"National Institute of Genetics, ROIS","Herbarium Specimens of Museum of Nature and Human Activities, Hyogo Pref., Japan",,,,,,,HYO,VP,C1-035496,Specimen,,21:27.0,,,Geranium wilfordii,,Geranium wilfordii,Plantae,Magnoliophyta,,,Geraniaceae,Geranium,Japan,Japan,"Hyogo Pref.; Ryuzo-ji, Tannan-cho, Taki-gun.",,,Hyogo,Eastern Asia,Japan,,,,,,,,,,,,http://data.gbif.org/occurrences/323489926,http://data.gbif.org/ws/rest/occurrence/get?key=323489926
"National Institute of Genetics, ROIS","Herbarium Specimens of Museum of Nature and Human Activities, Hyogo Pref., Japan",,,,,,,HYO,VP,C1-115814,Specimen,,24:54.0,,,Geranium wilfordii,,Geranium wilfordii,Plantae,Magnoliophyta,,,Geraniaceae,Geranium,Japan,Japan,"Hyogo Pref.; Mikata-gun, Mikata-cho, Ojiro-keikoku.",,,Hyogo,Eastern Asia,Japan,134.5,35.4,,,,,,,400,600,,http://data.gbif.org/occurrences/323513198,http://data.gbif.org/ws/rest/occurrence/get?key=323513198
"National Institute of Genetics, ROIS","Herbarium Specimens of Museum of Nature and Human Activities, Hyogo Pref., Japan",,,,,,,HYO,VP,C1-106529,Specimen,,22:45.0,,,Geranium wilfordii,,Geranium wilfordii,Plantae,Magnoliophyta,,,Geraniaceae,Geranium,Japan,Japan,"Fukui Pref.: Omoto to Hokei-ji, Ikeda-cho, Imadate-gun.",,,Fukui,Eastern Asia,Japan,,,,,,,,,300,600,,http://data.gbif.org/occurrences/323501774,http://data.gbif.org/ws/rest/occurrence/get?key=323501774
"National Institute of Genetics, ROIS","Herbarium Specimens of Museum of Nature and Human Activities, Hyogo Pref., Japan",,,,,,,HYO,VP,C1-167686,Specimen,,24:40.0,,,Geranium wilfordii,,Geranium wilfordii,Plantae,Magnoliophyta,,,Geraniaceae,Geranium,Japan,Japan,"Hyogo Pref.; Kirigataki, Onsen-cho, Mikata-gun.",,,Hyogo,Eastern Asia,Japan,134.467,35.45,,,,,,,,,,http://data.gbif.org/occurrences/323512008,http://data.gbif.org/ws/rest/occurrence/get?key=323512008
"National Institute of Genetics, ROIS","Herbarium Specimens of Museum of Nature and Human Activities, Hyogo Pref., Japan",,,,,,,HYO,VP,C1-011257,Specimen,,23:15.0,,,Geranium wilfordii,,Geranium wilfordii,Plantae,Magnoliophyta,,,Geraniaceae,Geranium,Japan,Japan,HONSHU. Pref.Hokkaido: Lakeside of Akan.,,,Hokkaido,Eastern Asia,Japan,,,,,,,,,,,,http://data.gbif.org/occurrences/323504704,http://data.gbif.org/ws/rest/occurrence/get?key=323504704
"National Institute of Genetics, ROIS","Herbarium Specimens of Museum of Nature and Human Activities, Hyogo Pref., Japan",,,,,,,HYO,VP,C1-007385,Specimen,,24:35.0,,,Geranium wilfordii,,Geranium wilfordii,Plantae,Magnoliophyta,,,Geraniaceae,Geranium,Japan,Japan,Hyogo Pref.; Hyonosen.,,,Hyogo,Eastern Asia,Japan,,,,,,,,,,,,http://data.gbif.org/occurrences/323511532,http://data.gbif.org/ws/rest/occurrence/get?key=323511532
"National Institute of Genetics, ROIS","Herbarium Specimens of Museum of Nature and Human Activities, Hyogo Pref., Japan",,,,,,,HYO,VP,C1-029272,Specimen,,25:23.0,M.Yanai,,Geranium wilfordii,,Geranium wilfordii,Plantae,Magnoliophyta,,,Geraniaceae,Geranium,Japan,Japan,"Hyogo Pref.; Yabu-gun, Ohya-cho, Kahozaka.",,,Hyogo,Eastern Asia,Japan,134.717,35.4,,,,,,,250,250,,http://data.gbif.org/occurrences/323516098,http://data.gbif.org/ws/rest/occurrence/get?key=323516098
"National Institute of Genetics, ROIS","Herbarium Specimens of Museum of Nature and Human Activities, Hyogo Pref., Japan",,,,,,,HYO,VP,C1-010824,Specimen,,23:35.0,,,Geranium wilfordii,,Geranium wilfordii,Plantae,Magnoliophyta,,,Geraniaceae,Geranium,Japan,Japan,"HONSHU. Pref.Hyogo: Mt.Hyouno-sen, Yabu-gun.",,,Hyogo,Eastern Asia,Japan,,,,,,,,,,,,http://data.gbif.org/occurrences/323506315,http://data.gbif.org/ws/rest/occurrence/get?key=323506315
"National Institute of Genetics, ROIS","Herbarium Specimens of Museum of Nature and Human Activities, Hyogo Pref., Japan",,,,,,,HYO,VP,C1-109626,Specimen,,26:37.0,,,Geranium wilfordii,,Geranium wilfordii,Plantae,Magnoliophyta,,,Geraniaceae,Geranium,Japan,Japan,"Pref. Hyogo: Sugawara, Mt.Oogino-sen, Onsen-cho, Mikata-gun.",,,Hyogo,Eastern Asia,Japan,134.467,35.45,,,,,,,460,600,,http://data.gbif.org/occurrences/323523395,http://data.gbif.org/ws/rest/occurrence/get?key=323523395
"National Institute of Genetics, ROIS","Herbarium Specimens of Museum of Nature and Human Activities, Hyogo Pref., Japan",,,,,,,HYO,VP,C1-071031,Specimen,,27:47.0,Y.F.,,Geranium wilfordii,,Geranium wilfordii,Plantae,Magnoliophyta,,,Geraniaceae,Geranium,Japan,Japan,"YOGO P.:Ttuta, Mikata cyo, Mikata-gun.",,,Hyogo,Eastern Asia,Japan,134.501,35.3853,,,,,,,560,600,,http://data.gbif.org/occurrences/323530281,http://data.gbif.org/ws/rest/occurrence/get?key=323530281
"National Institute of Genetics, ROIS","Herbarium Specimens of Museum of Nature and Human Activities, Hyogo Pref., Japan",,,,,,,HYO,VP,C1-166238,Specimen,,24:37.0,,,Geranium wilfordii,,Geranium wilfordii,Plantae,Magnoliophyta,,,Geraniaceae,Geranium,Japan,Japan,"Hyogo Pref.; Itashino Valley, Muraoka-cho, Mikata-gun.",,,Hyogo,Eastern Asia,Japan,134.567,35.4333,,,,,,,,,,http://data.gbif.org/occurrences/323511743,http://data.gbif.org/ws/rest/occurrence/get?key=323511743
"National Institute of Genetics, ROIS","Herbarium Specimens of Museum of Nature and Human Activities, Hyogo Pref., Japan",,,,,,,HYO,VP,C1-029256,Specimen,,24:11.0,M.Yanai,,Geranium wilfordii,,Geranium wilfordii,Plantae,Magnoliophyta,,,Geraniaceae,Geranium,Japan,Japan,"Hyogo Pref.: Yabu-gun, Yohka-cho, Imataki-tera.",,,Hyogo,Eastern Asia,Japan,134.717,35.4,,,,,,,200,200,,http://data.gbif.org/occurrences/323509413,http://data.gbif.org/ws/rest/occurrence/get?key=323509413
"National Institute of Genetics, ROIS","Herbarium Specimens of Museum of Nature and Human Activities, Hyogo Pref., Japan",,,,,,,HYO,VP,C1-175382,Specimen,,25:27.0,,,Geranium wilfordii,,Geranium wilfordii,Plantae,Magnoliophyta,,,Geraniaceae,Geranium,Japan,Japan,"Hyogo Pref.; Yabu-gun, Sekinomiya-cho, Fukusada",,,Hyogo,Eastern Asia,Japan,134.517,35.3667,,,,,,,600,800,,http://data.gbif.org/occurrences/323516539,http://data.gbif.org/ws/rest/occurrence/get?key=323516539
"National Institute of Genetics, ROIS","Herbarium Specimens of Museum of Nature and Human Activities, Hyogo Pref., Japan",,,,,,,HYO,VP,C1-013759,Specimen,,23:35.0,,,Geranium wilfordii,,Geranium wilfordii,Plantae,Magnoliophyta,,,Geraniaceae,Geranium,Japan,Japan,"HONSHU. Pref.Hyogo: Mt.Hyouno-sen, Yabu-gun.",,,Hyogo,Eastern Asia,Japan,,,,,,,,,,,,http://data.gbif.org/occurrences/323506316,http://data.gbif.org/ws/rest/occurrence/get?key=323506316
"National Institute of Genetics, ROIS","Herbarium Specimens of Museum of Nature and Human Activities, Hyogo Pref., Japan",,,,,,,HYO,VP,C1-010819,Specimen,,23:35.0,,,Geranium wilfordii,,Geranium wilfordii,Plantae,Magnoliophyta,,,Geraniaceae,Geranium,Japan,Japan,"HONSHU. Pref.Hyogo: Mt.Hyouno-sen, Yabu-gun.",,,Hyogo,Eastern Asia,Japan,,,,,,,,,,,,http://data.gbif.org/occurrences/323506314,http://data.gbif.org/ws/rest/occurrence/get?key=323506314
"National Institute of Genetics, ROIS","Herbarium Specimens of Museum of Nature and Human Activities, Hyogo Pref., Japan",,,,,,,HYO,VP,C1-010878,Specimen,,23:42.0,,,Geranium wilfordii,,Geranium wilfordii,Plantae,Magnoliophyta,,,Geraniaceae,Geranium,Japan,Japan,"HONSHU. Pref.Hyogo: Mt.Torokawa-yama, Muraoka-cho, Mikata-gun.",,,Hyogo,Eastern Asia,Japan,,,,,,,,,,,,http://data.gbif.org/occurrences/323506852,http://data.gbif.org/ws/rest/occurrence/get?key=323506852
"National Institute of Genetics, ROIS","Herbarium Specimens of Museum of Nature and Human Activities, Hyogo Pref., Japan",,,,,,,HYO,VP,C1-010755,Specimen,,23:59.0,,,Geranium wilfordii,,Geranium wilfordii,Plantae,Magnoliophyta,,,Geraniaceae,Geranium,Japan,Japan,HONSHU. Pref.Shiga: Mt.Ibuki-yama.,,,Shiga,Eastern Asia,Japan,,,,,,,,,,,,http://data.gbif.org/occurrences/323508426,http://data.gbif.org/ws/rest/occurrence/get?key=323508426
"National Institute of Genetics, ROIS","Herbarium Specimens of Museum of Nature and Human Activities, Hyogo Pref., Japan",,,,,,,HYO,VP,C1-068503,Specimen,,27:00.0,T.Fujii,,Geranium wilfordii,,Geranium wilfordii,Plantae,Magnoliophyta,,,Geraniaceae,Geranium,Japan,Japan,"Pref.Hyogo;from Sonae to Akioka,Mikata-cho, Mikata-gun",,,Hyogo,Eastern Asia,Japan,134.518,35.3856,,,,,,,500,700,,http://data.gbif.org/occurrences/323525650,http://data.gbif.org/ws/rest/occurrence/get?key=323525650
"National Institute of Genetics, ROIS","Herbarium Specimens of Museum of Nature and Human Activities, Hyogo Pref., Japan",,,,,,,HYO,VP,C1-172352,Specimen,,24:37.0,,,Geranium wilfordii,,Geranium wilfordii,Plantae,Magnoliophyta,,,Geraniaceae,Geranium,Japan,Japan,"Hyogo Pref.; Ishihara, Yoka-cho, Yabu-gun.",,,Hyogo,Eastern Asia,Japan,134.7,35.4,,,,,,,,,,http://data.gbif.org/occurrences/323511708,http://data.gbif.org/ws/rest/occurrence/get?key=323511708
"National Institute of Genetics, ROIS","Herbarium Specimens of Museum of Nature and Human Activities, Hyogo Pref., Japan",,,,,,,HYO,VP,C1-011634,Specimen,,23:44.0,,,Geranium wilfordii,,Geranium wilfordii,Plantae,Magnoliophyta,,,Geraniaceae,Geranium,Japan,Japan,"HONSHU. Pref.Hyogo: Ojiro-dani, Mikata-cho, Mikata-gun.",,,Hyogo,Eastern Asia,Japan,,,,,,,,,,,,http://data.gbif.org/occurrences/323507067,http://data.gbif.org/ws/rest/occurrence/get?key=323507067
"National Institute of Genetics, ROIS","Herbarium Specimens of Museum of Nature and Human Activities, Hyogo Pref., Japan",,,,,,,HYO,VP,C1-006877,Specimen,,22:35.0,,,Geranium wilfordii,,Geranium wilfordii,Plantae,Magnoliophyta,,,Geraniaceae,Geranium,Japan,Japan,"Pref.Hyogo: Mt.Ougino-sen, Onsen-cho, Mikata-gun.",,,Hyogo,Eastern Asia,Japan,,,,,,,,,,,,http://data.gbif.org/occurrences/323500876,http://data.gbif.org/ws/rest/occurrence/get?key=323500876
"National Institute of Genetics, ROIS","Herbarium Specimens of Museum of Nature and Human Activities, Hyogo Pref., Japan",,,,,,,HYO,VP,C1-109874,Specimen,,26:35.0,,,Geranium wilfordii,,Geranium wilfordii,Plantae,Magnoliophyta,,,Geraniaceae,Geranium,Japan,Japan,"Pref. Hyogo: along the river Kosa-kawa, Ishiwara, Youka-cho, Yabu-gun.",,,Hyogo,Eastern Asia,Japan,134.7,35.4,,,,,,,200,500,,http://data.gbif.org/occurrences/323523141,http://data.gbif.org/ws/rest/occurrence/get?key=323523141
"National Institute of Genetics, ROIS","Herbarium Specimens of Museum of Nature and Human Activities, Hyogo Pref., Japan",,,,,,,HYO,VP,C1-134087,Specimen,,24:53.0,Y.Fujimoto,,Geranium wilfordii,,Geranium wilfordii,Plantae,Magnoliophyta,,,Geraniaceae,Geranium,Japan,Japan,"Hyogo Pref.; Mikata-gun, Mikata-cho, Konagatawa.",,,Hyogo,Eastern Asia,Japan,134.65,35.45,,,,,,,700,750,,http://data.gbif.org/occurrences/323513120,http://data.gbif.org/ws/rest/occurrence/get?key=323513120
"National Museum of Nature and Science, Japan","Plant Specimens of Taga Town Museum, Shiga Pref., Japan",,,,,,,TG,TG-B,TG-B-000427,Specimen,,25:14.0,,,Geranium wilfordii,,Geranium wilfordii,Plantae,SPERMATOPHYTA,DICOTYLEDONEAE,Geraniales,Geraniaceae,Geranium,Japan,Japan,,"Inukami-gun, Taga-cho, Ryozen",,Shiga,Eastern Asia,Japan,,,,,,,,,,,,http://data.gbif.org/occurrences/126838856,http://data.gbif.org/ws/rest/occurrence/get?key=126838856
"National Museum of Nature and Science, Japan","Plant Specimens of Taga Town Museum, Shiga Pref., Japan",,,,,,,TG,TG-B,TG-B-000430,Specimen,,25:14.0,,,Geranium wilfordii,,Geranium wilfordii,Plantae,SPERMATOPHYTA,DICOTYLEDONEAE,Geraniales,Geraniaceae,Geranium,Japan,Japan,,"Inukami-gun, Taga-cho",,Shiga,Eastern Asia,Japan,,,,,,,,,,,,http://data.gbif.org/occurrences/126838862,http://data.gbif.org/ws/rest/occurrence/get?key=126838862
"National Museum of Nature and Science, Japan","Plant Specimens of Taga Town Museum, Shiga Pref., Japan",,,,,,,TG,TG-B,TG-B-000434,Specimen,,25:14.0,,,Geranium wilfordii,,Geranium wilfordii,Plantae,SPERMATOPHYTA,DICOTYLEDONEAE,Geraniales,Geraniaceae,Geranium,Japan,Japan,,"Inukami-gun, Taga-cho, Ryozen",,Shiga,Eastern Asia,Japan,,,,,,,,,,,,http://data.gbif.org/occurrences/126838870,http://data.gbif.org/ws/rest/occurrence/get?key=126838870
"National Museum of Nature and Science, Japan","Plant Specimens of Taga Town Museum, Shiga Pref., Japan",,,,,,,TG,TG-B,TG-B-000431,Specimen,,25:14.0,,,Geranium wilfordii,,Geranium wilfordii,Plantae,SPERMATOPHYTA,DICOTYLEDONEAE,Geraniales,Geraniaceae,Geranium,Japan,Japan,,"Inukami-gun, Taga-cho",,Shiga,Eastern Asia,Japan,,,,,,,,,,,,http://data.gbif.org/occurrences/126838864,http://data.gbif.org/ws/rest/occurrence/get?key=126838864
"National Museum of Nature and Science, Japan",Angiosperm specimens of Iwate Prefectural Museum,,,,,,,IPMM,PA,73757,Specimen,,59:41.0,,,Geranium wilfordii Maxim.,Maxim.,Geranium wilfordii Maxim.,Plantae,Angiospermae,Dicotyledoneae,,Geraniaceae,Geranium,Japan,Japan,,Kamaishi-shi,,Iwate,Eastern Asia,Japan,,,,,,,,,,,,http://data.gbif.org/occurrences/93885055,http://data.gbif.org/ws/rest/occurrence/get?key=93885055
"National Museum of Nature and Science, Japan",Angiospermatatophytina Collection of Saitama Museum of Natural History,,,,,,,SMNH,As,11358,Specimen,,52:51.0,,,Geranium wilfordii Maxim.,Maxim.,Geranium wilfordii Maxim.,Plantae,Angiospermae,Dicotyledoneae,Geraniales,Geraniaceae,Geranium,Japan,Japan,Kawauradani,Chichibu-gun Arakawamura,,Saitama,Eastern Asia,Japan,,,,,,,,,,,,http://data.gbif.org/occurrences/393099478,http://data.gbif.org/ws/rest/occurrence/get?key=393099478
"National Museum of Nature and Science, Japan",Angiospermatatophytina Collection of Saitama Museum of Natural History,,,,,,,SMNH,As,11354,Specimen,,52:51.0,,,Geranium wilfordii Maxim.,Maxim.,Geranium wilfordii Maxim.,Plantae,Angiospermae,Dicotyledoneae,Geraniales,Geraniaceae,Geranium,Japan,Japan,Kagemori,Chichibu-shi,,Saitama,Eastern Asia,Japan,,,,,,,,,,,,http://data.gbif.org/occurrences/393099470,http://data.gbif.org/ws/rest/occurrence/get?key=393099470
"National Museum of Nature and Science, Japan",Angiospermatatophytina Collection of Saitama Museum of Natural History,,,,,,,SMNH,As,11348,Specimen,,52:51.0,,,Geranium wilfordii Maxim.,Maxim.,Geranium wilfordii Maxim.,Plantae,Angiospermae,Dicotyledoneae,Geraniales,Geraniaceae,Geranium,Japan,Japan,Mt. Kumakura-san,Chichibu-gun Arakawamura,,Saitama,Eastern Asia,Japan,,,,,,,,,,,,http://data.gbif.org/occurrences/393099459,http://data.gbif.org/ws/rest/occurrence/get?key=393099459
"National Museum of Nature and Science, Japan",Angiospermatatophytina Collection of Saitama Museum of Natural History,,,,,,,SMNH,As,11357,Specimen,,52:51.0,,,Geranium wilfordii Maxim.,Maxim.,Geranium wilfordii Maxim.,Plantae,Angiospermae,Dicotyledoneae,Geraniales,Geraniaceae,Geranium,Japan,Japan,Mt. Futago-yama,Chichibu-gun Oganomachi,,Saitama,Eastern Asia,Japan,,,,,,,,,,,,http://data.gbif.org/occurrences/393099476,http://data.gbif.org/ws/rest/occurrence/get?key=393099476
"National Museum of Nature and Science, Japan",Angiospermatatophytina Collection of Saitama Museum of Natural History,,,,,,,SMNH,As,11356,Specimen,,52:51.0,,,Geranium wilfordii Maxim.,Maxim.,Geranium wilfordii Maxim.,Plantae,Angiospermae,Dicotyledoneae,Geraniales,Geraniaceae,Geranium,Japan,Japan,Mt. Futago-yama,Chichibu-gun Oganomachi,,Saitama,Eastern Asia,Japan,,,,,,,,,,,,http://data.gbif.org/occurrences/393099474,http://data.gbif.org/ws/rest/occurrence/get?key=393099474
"National Museum of Nature and Science, Japan",Angiospermatatophytina Collection of Saitama Museum of Natural History,,,,,,,SMNH,As,11355,Specimen,,52:51.0,,,Geranium wilfordii Maxim.,Maxim.,Geranium wilfordii Maxim.,Plantae,Angiospermae,Dicotyledoneae,Geraniales,Geraniaceae,Geranium,Japan,Japan,Narao,Chichibu-gun Minanomachi,,Saitama,Eastern Asia,Japan,,,,,,,,,,,,http://data.gbif.org/occurrences/393099472,http://data.gbif.org/ws/rest/occurrence/get?key=393099472
"National Museum of Nature and Science, Japan",Angiospermatatophytina Collection of Saitama Museum of Natural History,,,,,,,SMNH,As,11350,Specimen,,52:51.0,,,Geranium wilfordii Maxim.,Maxim.,Geranium wilfordii Maxim.,Plantae,Angiospermae,Dicotyledoneae,Geraniales,Geraniaceae,Geranium,Japan,Japan,Mt. Ryokami-san,Chichibu-gun Ryokamimura,,Saitama,Eastern Asia,Japan,,,,,,,,,,,,http://data.gbif.org/occurrences/393099463,http://data.gbif.org/ws/rest/occurrence/get?key=393099463
"National Museum of Nature and Science, Japan",Angiosperm specimens of Iwate Prefectural Museum,,,,,,,IPMM,PA,29187,Specimen,,59:44.0,,,Geranium wilfordii Maxim.,Maxim.,Geranium wilfordii Maxim.,Plantae,Angiospermae,Dicotyledoneae,Geraniales,Geraniaceae,Geranium,Japan,Japan,,Morioka-shi,,Iwate,Eastern Asia,Japan,,,,,,,,,,,,http://data.gbif.org/occurrences/204233052,http://data.gbif.org/ws/rest/occurrence/get?key=204233052
"National Museum of Nature and Science, Japan",Angiospermatatophytina Collection of Saitama Museum of Natural History,,,,,,,SMNH,As,1925,Specimen,,52:50.0,,,Geranium wilfordii Maxim.,Maxim.,Geranium wilfordii Maxim.,Plantae,Angiospermae,Dicotyledoneae,Geraniales,Geraniaceae,Geranium,Japan,Japan,,Chichibu-gun Otakimura,,Saitama,Eastern Asia,Japan,,,,,,,,,,,,http://data.gbif.org/occurrences/353564873,http://data.gbif.org/ws/rest/occurrence/get?key=353564873