Data Publisher,Dataset,Dataset Rights,Collector name,Collector number,Field number,GUID,Date collected,Institution code,Collection code,Catalogue number,Basis of record,Image url,Last indexed,Identifier,Identification date,Scientific name,Author,Scientific name (interpreted),Kingdom,Phylum,Class,Order,Family,Genus,Country,Country (interpreted),Locality,County,Continent or Ocean,State/Province,Region,Publisher country,Latitude,Longitude,Coordinate precision,Cell id,Centi cell id,Min depth,Max depth,Max depth,Min altitude,Max altitude,Altitude precision,GBIF portal url,GBIF webservice url
"National Institute of Genetics, ROIS","Herbarium Specimens of Museum of Nature and Human Activities, Hyogo Pref., Japan",,,,,,,HYO,VP,C1-167876,Specimen,,17:01.0,,,Geranium tripartitum,,Geranium tripartitum,Plantae,Magnoliophyta,,,Geraniaceae,Geranium,Japan,Japan,"Hyogo Pref.; Asago-gun, Asago-cho, Sanaka.",,,Hyogo,Eastern Asia,Japan,134.717,35.2667,,,,,,,,,,http://data.gbif.org/occurrences/323440189,http://data.gbif.org/ws/rest/occurrence/get?key=323440189
"National Institute of Genetics, ROIS","Herbarium Specimens of Museum of Nature and Human Activities, Hyogo Pref., Japan",,,,,,,HYO,VP,C1-119796,Specimen,,22:41.0,,,Geranium tripartitum,,Geranium tripartitum,Plantae,Magnoliophyta,,,Geraniaceae,Geranium,Japan,Japan,"Buko-zan Mt., Chichibu-shi",,,Saitama,Eastern Asia,Japan,,,,,,,,,,,,http://data.gbif.org/occurrences/323501465,http://data.gbif.org/ws/rest/occurrence/get?key=323501465
"National Institute of Genetics, ROIS","Herbarium Specimens of Museum of Nature and Human Activities, Hyogo Pref., Japan",,,,,,,HYO,VP,C1-174528,Specimen,,19:34.0,,,Geranium tripartitum,,Geranium tripartitum,Plantae,Magnoliophyta,,,Geraniaceae,Geranium,Japan,Japan,"Hyogo Pref.; Mihara-gun, Seidan-cho, Matsuho",,,Hyogo,Eastern Asia,Japan,134.5,35.0833,,,,,,,,,,http://data.gbif.org/occurrences/323469436,http://data.gbif.org/ws/rest/occurrence/get?key=323469436
"National Institute of Genetics, ROIS","Herbarium Specimens of Museum of Nature and Human Activities, Hyogo Pref., Japan",,,,,,,HYO,VP,C1-165825,Specimen,,19:29.0,,,Geranium tripartitum,,Geranium tripartitum,Plantae,Magnoliophyta,,,Geraniaceae,Geranium,Japan,Japan,"Hyogo Pref.; Mihara-gun, Seidan-cho, Matsuho",,,Hyogo,Eastern Asia,Japan,134.633,35.0667,,,,,,,,,,http://data.gbif.org/occurrences/323468635,http://data.gbif.org/ws/rest/occurrence/get?key=323468635
"National Museum of Nature and Science, Japan",Plant Specimens of Kurashiki Museum of Natural History,,,,,,,KURA,KURA,124041,Specimen,,15:02.0,,,Geranium tripartitum Knuth,Knuth,Geranium tripartitum Knuth,Plantae,,,Geraniales,Geraniaceae,Geranium,Japan,Japan,,Nagi-cho,,Okayama,Eastern Asia,Japan,,,,,,,,,,,,http://data.gbif.org/occurrences/395766163,http://data.gbif.org/ws/rest/occurrence/get?key=395766163
"National Museum of Nature and Science, Japan",Plant Specimens of Kurashiki Museum of Natural History,,,,,,,KURA,KURA,89868,Specimen,,15:02.0,,,Geranium tripartitum Knuth,Knuth,Geranium tripartitum Knuth,Plantae,,,Geraniales,Geraniaceae,Geranium,Japan,Japan,,Nagi-cho,,Okayama,Eastern Asia,Japan,,,,,,,,,,,,http://data.gbif.org/occurrences/395766070,http://data.gbif.org/ws/rest/occurrence/get?key=395766070
"National Museum of Nature and Science, Japan",Plant Specimens of Kurashiki Museum of Natural History,,,,,,,KURA,KURA,36954,Specimen,,15:01.0,,,Geranium tripartitum Knuth,Knuth,Geranium tripartitum Knuth,Plantae,,,Geraniales,Geraniaceae,Geranium,Japan,Japan,,Nagi-cho,,Okayama,Eastern Asia,Japan,,,,,,,,,,,,http://data.gbif.org/occurrences/395765937,http://data.gbif.org/ws/rest/occurrence/get?key=395765937
"National Museum of Nature and Science, Japan",Plant Specimens of Kurashiki Museum of Natural History,,,,,,,KURA,KURA,133728,Specimen,,14:58.0,,,Geranium tripartitum Knuth,Knuth,Geranium tripartitum Knuth,Plantae,,,,Geraniaceae,Geranium,Japan,Japan,,,,Nara,Eastern Asia,Japan,,,,,,,,,,,,http://data.gbif.org/occurrences/43137062,http://data.gbif.org/ws/rest/occurrence/get?key=43137062
"National Museum of Nature and Science, Japan",Plant Specimens of Kurashiki Museum of Natural History,,,,,,,KURA,KURA,133727,Specimen,,14:58.0,,,Geranium tripartitum Knuth,Knuth,Geranium tripartitum Knuth,Plantae,,,,Geraniaceae,Geranium,Japan,Japan,,,,Nagano,Eastern Asia,Japan,,,,,,,,,,,,http://data.gbif.org/occurrences/43137055,http://data.gbif.org/ws/rest/occurrence/get?key=43137055
"National Museum of Nature and Science, Japan",Plant Specimens of Kurashiki Museum of Natural History,,,,,,,KURA,KURA,133731,Specimen,,14:58.0,,,Geranium tripartitum Knuth,Knuth,Geranium tripartitum Knuth,Plantae,,,,Geraniaceae,Geranium,Japan,Japan,,,,Nara,Eastern Asia,Japan,,,,,,,,,,,,http://data.gbif.org/occurrences/43137088,http://data.gbif.org/ws/rest/occurrence/get?key=43137088
"National Museum of Nature and Science, Japan",Plant Specimens of Kurashiki Museum of Natural History,,,,,,,KURA,KURA,133729,Specimen,,14:58.0,,,Geranium tripartitum Knuth,Knuth,Geranium tripartitum Knuth,Plantae,,,,Geraniaceae,Geranium,Japan,Japan,,,,Nara,Eastern Asia,Japan,,,,,,,,,,,,http://data.gbif.org/occurrences/43137070,http://data.gbif.org/ws/rest/occurrence/get?key=43137070
"National Museum of Nature and Science, Japan",Plant Specimens of Kurashiki Museum of Natural History,,,,,,,KURA,KURA,19134,Specimen,,15:01.0,,,Geranium tripartitum Knuth,Knuth,Geranium tripartitum Knuth,Plantae,,,Geraniales,Geraniaceae,Geranium,Japan,Japan,,Nagi-cho,,Okayama,Eastern Asia,Japan,,,,,,,,,,,,http://data.gbif.org/occurrences/395765914,http://data.gbif.org/ws/rest/occurrence/get?key=395765914
"National Museum of Nature and Science, Japan",Plant Specimens of Kurashiki Museum of Natural History,,,,,,,KURA,KURA,133726,Specimen,,14:58.0,,,Geranium tripartitum Knuth,Knuth,Geranium tripartitum Knuth,Plantae,,,,Geraniaceae,Geranium,Japan,Japan,,,,Nagano,Eastern Asia,Japan,,,,,,,,,,,,http://data.gbif.org/occurrences/43137048,http://data.gbif.org/ws/rest/occurrence/get?key=43137048
"National Museum of Nature and Science, Japan",Plant Specimens of Kurashiki Museum of Natural History,,,,,,,KURA,KURA,37120,Specimen,,15:01.0,,,Geranium tripartitum Knuth,Knuth,Geranium tripartitum Knuth,Plantae,,,Geraniales,Geraniaceae,Geranium,Japan,Japan,,Nagi-cho,,Okayama,Eastern Asia,Japan,,,,,,,,,,,,http://data.gbif.org/occurrences/395765938,http://data.gbif.org/ws/rest/occurrence/get?key=395765938
"National Museum of Nature and Science, Japan",Plant Specimens of Kurashiki Museum of Natural History,,,,,,,KURA,KURA,133725,Specimen,,14:58.0,,,Geranium tripartitum Knuth,Knuth,Geranium tripartitum Knuth,Plantae,,,,Geraniaceae,Geranium,Japan,Japan,,,,Gunma,Eastern Asia,Japan,,,,,,,,,,,,http://data.gbif.org/occurrences/43137033,http://data.gbif.org/ws/rest/occurrence/get?key=43137033
"National Museum of Nature and Science, Japan",Plant Specimens of Kurashiki Museum of Natural History,,,,,,,KURA,KURA,133730,Specimen,,14:58.0,,,Geranium tripartitum Knuth,Knuth,Geranium tripartitum Knuth,Plantae,,,,Geraniaceae,Geranium,Japan,Japan,,,,Nara,Eastern Asia,Japan,,,,,,,,,,,,http://data.gbif.org/occurrences/43137079,http://data.gbif.org/ws/rest/occurrence/get?key=43137079
"National Museum of Nature and Science, Japan",Plant Specimens of Kurashiki Museum of Natural History,,,,,,,KURA,KURA,157031,Specimen,,15:02.0,,,Geranium tripartitum Knuth,Knuth,Geranium tripartitum Knuth,Plantae,,,Geraniales,Geraniaceae,Geranium,Japan,Japan,,Nagi-cho,,Okayama,Eastern Asia,Japan,,,,,,,,,,,,http://data.gbif.org/occurrences/395766230,http://data.gbif.org/ws/rest/occurrence/get?key=395766230
"National Museum of Nature and Science, Japan",Plant Specimens of Kurashiki Museum of Natural History,,,,,,,KURA,KURA,150697,Specimen,,15:02.0,,,Geranium tripartitum Knuth,Knuth,Geranium tripartitum Knuth,Plantae,,,Geraniales,Geraniaceae,Geranium,Japan,Japan,,Nagi-cho,,Okayama,Eastern Asia,Japan,,,,,,,,,,,,http://data.gbif.org/occurrences/395766219,http://data.gbif.org/ws/rest/occurrence/get?key=395766219
"National Museum of Nature and Science, Japan",Vascular plants database of Atugi City Museum,,,,,,,JACM,PL13363,JACM-PL13363,Specimen,,28:58.0,,,Geranium tripartitum Knuth,,Geranium tripartitum Knuth,Plantae,Angiospermae,,,Geraniaceae,Geranium,Japan,Japan,,Atsugi-shi,,Kanagawa,Eastern Asia,Japan,,,,,,,,,,,,http://data.gbif.org/occurrences/238034498,http://data.gbif.org/ws/rest/occurrence/get?key=238034498
"National Museum of Nature and Science, Japan",Vascular plants database of Atugi City Museum,,,,,,,JACM,PL28449,JACM-PL28449,Specimen,,29:00.0,,,Geranium tripartitum Knuth,,Geranium tripartitum Knuth,Plantae,Angiospermae,,,Geraniaceae,Geranium,Japan,Japan,,Kiyokawa-mura,,Kanagawa,Eastern Asia,Japan,,,,,,,,,,,,http://data.gbif.org/occurrences/238034800,http://data.gbif.org/ws/rest/occurrence/get?key=238034800
"National Museum of Nature and Science, Japan",Vascular plants database of Atugi City Museum,,,,,,,JACM,PL12901,JACM-PL12901,Specimen,,28:58.0,,,Geranium tripartitum Knuth,,Geranium tripartitum Knuth,Plantae,Angiospermae,,,Geraniaceae,Geranium,Japan,Japan,,Atsugi-shi,,Kanagawa,Eastern Asia,Japan,,,,,,,,,,,,http://data.gbif.org/occurrences/238034471,http://data.gbif.org/ws/rest/occurrence/get?key=238034471
"National Museum of Nature and Science, Japan",Vascular plants database of Atugi City Museum,,,,,,,JACM,PL13676,JACM-PL13676,Specimen,,28:59.0,,,Geranium tripartitum Knuth,,Geranium tripartitum Knuth,Plantae,Angiospermae,,,Geraniaceae,Geranium,Japan,Japan,,Atsugi-shi,,Kanagawa,Eastern Asia,Japan,,,,,,,,,,,,http://data.gbif.org/occurrences/238034514,http://data.gbif.org/ws/rest/occurrence/get?key=238034514
"National Museum of Nature and Science, Japan",Vascular Plants Collection of Sagamihara City Museum,,,,,,,JSCM,VS,1807,Specimen,,43:00.0,,,Geranium tripartitum Knuth,Knuth,Geranium tripartitum Knuth,Plantae,Anthophyta,Dicotyledonopsida,,GERANIACEAE,Geranium,Japan,Japan,,Isehara-shi,,Kanagawa,Eastern Asia,Japan,,,,,,,,,,,,http://data.gbif.org/occurrences/351220239,http://data.gbif.org/ws/rest/occurrence/get?key=351220239
"National Museum of Nature and Science, Japan",Vascular Plants Collection of Sagamihara City Museum,,,,,,,JSCM,VS,1805,Specimen,,43:00.0,,,Geranium tripartitum Knuth,Knuth,Geranium tripartitum Knuth,Plantae,Anthophyta,Dicotyledonopsida,,GERANIACEAE,Geranium,Japan,Japan,,Ashigarashimo-gun Hakonemachi,,Kanagawa,Eastern Asia,Japan,,,,,,,,,,,,http://data.gbif.org/occurrences/351220237,http://data.gbif.org/ws/rest/occurrence/get?key=351220237
"National Museum of Nature and Science, Japan",Vascular plants database of Atugi City Museum,,,,,,,JACM,PL24424,JACM-PL24424,Specimen,,28:59.0,,,Geranium tripartitum Knuth,,Geranium tripartitum Knuth,Plantae,Angiospermae,,,Geraniaceae,Geranium,Japan,Japan,,Kiyokawa-mura,,Kanagawa,Eastern Asia,Japan,,,,,,,,,,,,http://data.gbif.org/occurrences/238034727,http://data.gbif.org/ws/rest/occurrence/get?key=238034727
"National Museum of Nature and Science, Japan",Vascular plants database of Atugi City Museum,,,,,,,JACM,PL25126,JACM-PL25126,Specimen,,28:59.0,,,Geranium tripartitum Knuth,,Geranium tripartitum Knuth,Plantae,Angiospermae,,,Geraniaceae,Geranium,Japan,Japan,,Atsugi-shi,,Kanagawa,Eastern Asia,Japan,,,,,,,,,,,,http://data.gbif.org/occurrences/238034751,http://data.gbif.org/ws/rest/occurrence/get?key=238034751
"National Museum of Nature and Science, Japan",Vascular plants database of Atugi City Museum,,,,,,,JACM,PL31716,JACM-PL31716,Specimen,,29:00.0,,,Geranium tripartitum Knuth,,Geranium tripartitum Knuth,Plantae,Angiospermae,,,Geraniaceae,Geranium,Japan,Japan,,Kiyokawa-mura,,Kanagawa,Eastern Asia,Japan,,,,,,,,,,,,http://data.gbif.org/occurrences/238034838,http://data.gbif.org/ws/rest/occurrence/get?key=238034838
"National Museum of Nature and Science, Japan",Vascular plants database of Atugi City Museum,,,,,,,JACM,PL9734,JACM-PL9734,Specimen,,28:58.0,,,Geranium tripartitum Knuth,,Geranium tripartitum Knuth,Plantae,Angiospermae,,,Geraniaceae,Geranium,Japan,Japan,,Atsugi-shi,,Kanagawa,Eastern Asia,Japan,,,,,,,,,,,,http://data.gbif.org/occurrences/238034357,http://data.gbif.org/ws/rest/occurrence/get?key=238034357
"National Museum of Nature and Science, Japan",Vascular plants database of Atugi City Museum,,,,,,,JACM,PL9708,JACM-PL9708,Specimen,,28:58.0,,,Geranium tripartitum Knuth,,Geranium tripartitum Knuth,Plantae,Angiospermae,,,Geraniaceae,Geranium,Japan,Japan,,Atsugi-shi,,Kanagawa,Eastern Asia,Japan,,,,,,,,,,,,http://data.gbif.org/occurrences/238034356,http://data.gbif.org/ws/rest/occurrence/get?key=238034356
"National Museum of Nature and Science, Japan",Vascular Plants Collection of Sagamihara City Museum,,,,,,,JSCM,VS,1806,Specimen,,43:00.0,,,Geranium tripartitum Knuth,Knuth,Geranium tripartitum Knuth,Plantae,Anthophyta,Dicotyledonopsida,,GERANIACEAE,Geranium,Japan,Japan,,Isehara-shi,,Kanagawa,Eastern Asia,Japan,,,,,,,,,,,,http://data.gbif.org/occurrences/351220238,http://data.gbif.org/ws/rest/occurrence/get?key=351220238
"National Museum of Nature and Science, Japan",Vascular plants database of Atugi City Museum,,,,,,,JACM,PL26499,JACM-PL26499,Specimen,,28:59.0,,,Geranium tripartitum Knuth,,Geranium tripartitum Knuth,Plantae,Angiospermae,,,Geraniaceae,Geranium,Japan,Japan,,Atsugi-shi,,Kanagawa,Eastern Asia,Japan,,,,,,,,,,,,http://data.gbif.org/occurrences/238034759,http://data.gbif.org/ws/rest/occurrence/get?key=238034759
"National Museum of Nature and Science, Japan",Vascular plants database of Atugi City Museum,,,,,,,JACM,PL13103,JACM-PL13103,Specimen,,28:58.0,,,Geranium tripartitum Knuth,,Geranium tripartitum Knuth,Plantae,Angiospermae,,,Geraniaceae,Geranium,Japan,Japan,,Atsugi-shi,,Kanagawa,Eastern Asia,Japan,,,,,,,,,,,,http://data.gbif.org/occurrences/238034475,http://data.gbif.org/ws/rest/occurrence/get?key=238034475
"National Museum of Nature and Science, Japan",Vascular plants database of Atugi City Museum,,,,,,,JACM,PL30035,JACM-PL30035,Specimen,,29:01.0,,,Geranium tripartitum Knuth,,Geranium tripartitum Knuth,Plantae,Angiospermae,,,Geraniaceae,Geranium,Japan,Japan,,Hatano-shi,,Kanagawa,Eastern Asia,Japan,,,,,,,,,,,,http://data.gbif.org/occurrences/393753534,http://data.gbif.org/ws/rest/occurrence/get?key=393753534
"National Museum of Nature and Science, Japan",Vascular plants database of Atugi City Museum,,,,,,,JACM,PL24144,JACM-PL24144,Specimen,,28:59.0,,,Geranium tripartitum Knuth,,Geranium tripartitum Knuth,Plantae,Angiospermae,,,Geraniaceae,Geranium,Japan,Japan,,Atsugi-shi,,Kanagawa,Eastern Asia,Japan,,,,,,,,,,,,http://data.gbif.org/occurrences/238034717,http://data.gbif.org/ws/rest/occurrence/get?key=238034717
"National Museum of Nature and Science, Japan",Vascular plants database of Atugi City Museum,,,,,,,JACM,PL24143,JACM-PL24143,Specimen,,28:59.0,,,Geranium tripartitum Knuth,,Geranium tripartitum Knuth,Plantae,Angiospermae,,,Geraniaceae,Geranium,Japan,Japan,,Atsugi-shi,,Kanagawa,Eastern Asia,Japan,,,,,,,,,,,,http://data.gbif.org/occurrences/238034716,http://data.gbif.org/ws/rest/occurrence/get?key=238034716
"National Museum of Nature and Science, Japan",Vascular plants database of Atugi City Museum,,,,,,,JACM,PL31792,JACM-PL31792,Specimen,,29:00.0,,,Geranium tripartitum Knuth,,Geranium tripartitum Knuth,Plantae,Angiospermae,,,Geraniaceae,Geranium,Japan,Japan,,Kiyokawa-mura,,Kanagawa,Eastern Asia,Japan,,,,,,,,,,,,http://data.gbif.org/occurrences/238034840,http://data.gbif.org/ws/rest/occurrence/get?key=238034840
"National Museum of Nature and Science, Japan",Vascular plants database of Atugi City Museum,,,,,,,JACM,PL31948,JACM-PL31948,Specimen,,29:00.0,,,Geranium tripartitum Knuth,,Geranium tripartitum Knuth,Plantae,Angiospermae,,,Geraniaceae,Geranium,Japan,Japan,,Kiyokawa-mura,,Kanagawa,Eastern Asia,Japan,,,,,,,,,,,,http://data.gbif.org/occurrences/238034842,http://data.gbif.org/ws/rest/occurrence/get?key=238034842
"National Museum of Nature and Science, Japan",Vascular plants database of Atugi City Museum,,,,,,,JACM,PL24432,JACM-PL24432,Specimen,,28:59.0,,,Geranium tripartitum Knuth,,Geranium tripartitum Knuth,Plantae,Angiospermae,,,Geraniaceae,Geranium,Japan,Japan,,Kiyokawa-mura,,Kanagawa,Eastern Asia,Japan,,,,,,,,,,,,http://data.gbif.org/occurrences/238034728,http://data.gbif.org/ws/rest/occurrence/get?key=238034728
"National Museum of Nature and Science, Japan",Vascular plants database of Atugi City Museum,,,,,,,JACM,PL24145,JACM-PL24145,Specimen,,28:59.0,,,Geranium tripartitum Knuth,,Geranium tripartitum Knuth,Plantae,Angiospermae,,,Geraniaceae,Geranium,Japan,Japan,,Atsugi-shi,,Kanagawa,Eastern Asia,Japan,,,,,,,,,,,,http://data.gbif.org/occurrences/238034718,http://data.gbif.org/ws/rest/occurrence/get?key=238034718
"National Museum of Nature and Science, Japan",Vascular Plants Collection of Sagamihara City Museum,,,,,,,JSCM,VS,24191,Specimen,,43:02.0,,,Geranium tripartitum Knuth,Knuth,Geranium tripartitum Knuth,Plantae,Spermatophyta,,,GERANIACEAE,Geranium,Japan,Japan,,Minamitsuru-gun Yamanakakomura,,Yamanashi,Eastern Asia,Japan,,,,,,,,,,,,http://data.gbif.org/occurrences/351220865,http://data.gbif.org/ws/rest/occurrence/get?key=351220865
"National Museum of Nature and Science, Japan",Vascular plants database of Atugi City Museum,,,,,,,JACM,PL26198,JACM-PL26198,Specimen,,28:59.0,,,Geranium tripartitum Knuth,,Geranium tripartitum Knuth,Plantae,Angiospermae,,,Geraniaceae,Geranium,Japan,Japan,,Atsugi-shi,,Kanagawa,Eastern Asia,Japan,,,,,,,,,,,,http://data.gbif.org/occurrences/238034758,http://data.gbif.org/ws/rest/occurrence/get?key=238034758
"National Museum of Nature and Science, Japan",Vascular Plant Specimen Database of Kanagawa Prefectural Museum of Natural History,,,,,,,KPM,NA,KPM-NA1006441,Specimen,,26:28.0,,,Geranium tripartitum Knuth,,Geranium tripartitum Knuth,Plantae,Angiospermae,Dicotyledoneae,,GERANIACEAE,Geranium,Japan,Japan,Koyama,"Ashigarashimo-gun, Hakone-machi",,Kanagawa Prefecture,Eastern Asia,Japan,35.2324,139.016,,45319,20,,,,,,,http://data.gbif.org/occurrences/187986738,http://data.gbif.org/ws/rest/occurrence/get?key=187986738
"National Museum of Nature and Science, Japan",Vascular Plant Specimen Database of Kanagawa Prefectural Museum of Natural History,,,,,,,KPM,NA,KPM-NA0081087,Specimen,,26:30.0,,,Geranium tripartitum Knuth,,Geranium tripartitum Knuth,Plantae,Angiospermae,Dicotyledoneae,,GERANIACEAE,Geranium,Japan,Japan,,"Ashigarashimo-gun, Hakone-machi",,Kanagawa Prefecture,Eastern Asia,Japan,35.2491,139.028,,45319,20,,,,,,,http://data.gbif.org/occurrences/295907021,http://data.gbif.org/ws/rest/occurrence/get?key=295907021
"National Museum of Nature and Science, Japan",Vascular Plant Specimen Database of Kanagawa Prefectural Museum of Natural History,,,,,,,KPM,NA,KPM-NA1006434,Specimen,,26:28.0,,,Geranium tripartitum Knuth,,Geranium tripartitum Knuth,Plantae,Angiospermae,Dicotyledoneae,,GERANIACEAE,Geranium,Japan,Japan,,"Ashigarashimo-gun, Hakone-machi",,Kanagawa Prefecture,Eastern Asia,Japan,35.2574,139.016,,45319,20,,,,,,,http://data.gbif.org/occurrences/187986731,http://data.gbif.org/ws/rest/occurrence/get?key=187986731
"National Museum of Nature and Science, Japan",Vascular Plant Specimen Database of Kanagawa Prefectural Museum of Natural History,,,,,,,KPM,NA,KPM-NA1006438,Specimen,,26:28.0,,,Geranium tripartitum Knuth,,Geranium tripartitum Knuth,Plantae,Angiospermae,Dicotyledoneae,,GERANIACEAE,Geranium,Japan,Japan,,"Ashigarakami-gun, Yamakita-machi",,Kanagawa Prefecture,Eastern Asia,Japan,35.3991,138.916,,45318,39,,,,,,,http://data.gbif.org/occurrences/187986735,http://data.gbif.org/ws/rest/occurrence/get?key=187986735
"National Museum of Nature and Science, Japan",Vascular Plant Specimen Database of Kanagawa Prefectural Museum of Natural History,,,,,,,KPM,NA,KPM-NA1006427,Specimen,,26:28.0,,,Geranium tripartitum Knuth,,Geranium tripartitum Knuth,Plantae,Angiospermae,Dicotyledoneae,,GERANIACEAE,Geranium,Japan,Japan,,"Ashigarakami-gun, Yamakita-machi",,Kanagawa Prefecture,Eastern Asia,Japan,35.4241,138.928,,45318,49,,,,,,,http://data.gbif.org/occurrences/187986724,http://data.gbif.org/ws/rest/occurrence/get?key=187986724
"National Museum of Nature and Science, Japan",Vascular Plant Specimen Database of Kanagawa Prefectural Museum of Natural History,,,,,,,KPM,NA,KPM-NA1006425,Specimen,,26:28.0,,,Geranium tripartitum Knuth,,Geranium tripartitum Knuth,Plantae,Angiospermae,Dicotyledoneae,,GERANIACEAE,Geranium,Japan,Japan,,"Ashigarakami-gun, Yamakita-machi",,Kanagawa Prefecture,Eastern Asia,Japan,35.4574,139.166,,45319,41,,,,,,,http://data.gbif.org/occurrences/187986722,http://data.gbif.org/ws/rest/occurrence/get?key=187986722
"National Museum of Nature and Science, Japan",Vascular Plant Specimen Database of Kanagawa Prefectural Museum of Natural History,,,,,,,KPM,NA,KPM-NA1006430,Specimen,,26:28.0,,,Geranium tripartitum Knuth,,Geranium tripartitum Knuth,Plantae,Angiospermae,Dicotyledoneae,,GERANIACEAE,Geranium,Japan,Japan,,"Ashigarashimo-gun, Hakone-machi",,Kanagawa Prefecture,Eastern Asia,Japan,35.2908,139.003,,45319,20,,,,,,,http://data.gbif.org/occurrences/187986727,http://data.gbif.org/ws/rest/occurrence/get?key=187986727
"National Museum of Nature and Science, Japan",Vascular Plant Specimen Database of Kanagawa Prefectural Museum of Natural History,,,,,,,KPM,NA,KPM-NA1006429,Specimen,,26:28.0,,,Geranium tripartitum Knuth,,Geranium tripartitum Knuth,Plantae,Angiospermae,Dicotyledoneae,,GERANIACEAE,Geranium,Japan,Japan,,"Ashigarakami-gun, Yamakita-machi",,Kanagawa Prefecture,Eastern Asia,Japan,35.3991,138.966,,45318,39,,,,,,,http://data.gbif.org/occurrences/187986726,http://data.gbif.org/ws/rest/occurrence/get?key=187986726
"National Museum of Nature and Science, Japan",Vascular Plant Specimen Database of Kanagawa Prefectural Museum of Natural History,,,,,,,KPM,NA,KPM-NA0002615,Specimen,,26:30.0,,,Geranium tripartitum Knuth,,Geranium tripartitum Knuth,Plantae,Angiospermae,Dicotyledoneae,,GERANIACEAE,Geranium,Japan,Japan,,"Ashigarakami-gun, Yamakita-machi",,Kanagawa Prefecture,Eastern Asia,Japan,35.4324,138.953,,45318,49,,,,,,,http://data.gbif.org/occurrences/295906940,http://data.gbif.org/ws/rest/occurrence/get?key=295906940
"National Museum of Nature and Science, Japan",Vascular Plant Specimen Database of Kanagawa Prefectural Museum of Natural History,,,,,,,KPM,NA,KPM-NA1006436,Specimen,,26:28.0,,,Geranium tripartitum Knuth,,Geranium tripartitum Knuth,Plantae,Angiospermae,Dicotyledoneae,,GERANIACEAE,Geranium,Japan,Japan,,"Tsukui-gun, Tsukui-machi",,Kanagawa Prefecture,Eastern Asia,Japan,35.4741,139.166,,45319,41,,,,,,,http://data.gbif.org/occurrences/187986733,http://data.gbif.org/ws/rest/occurrence/get?key=187986733
"National Museum of Nature and Science, Japan",Vascular Plant Specimen Database of Kanagawa Prefectural Museum of Natural History,,,,,,,KPM,NA,KPM-NA1006424,Specimen,,26:28.0,,,Geranium tripartitum Knuth,,Geranium tripartitum Knuth,Plantae,Angiospermae,Dicotyledoneae,,GERANIACEAE,Geranium,Japan,Japan,,"Ashigarakami-gun, Yamakita-machi",,Kanagawa Prefecture,Eastern Asia,Japan,35.5074,139.041,,45319,50,,,,,,,http://data.gbif.org/occurrences/187986721,http://data.gbif.org/ws/rest/occurrence/get?key=187986721
"National Museum of Nature and Science, Japan",Vascular Plant Specimen Database of Kanagawa Prefectural Museum of Natural History,,,,,,,KPM,NA,KPM-NA1006432,Specimen,,26:28.0,,,Geranium tripartitum Knuth,,Geranium tripartitum Knuth,Plantae,Angiospermae,Dicotyledoneae,,GERANIACEAE,Geranium,Japan,Japan,,"Ashigarashimo-gun, Hakone-machi",,Kanagawa Prefecture,Eastern Asia,Japan,35.2658,138.978,,45318,29,,,,,,,http://data.gbif.org/occurrences/187986729,http://data.gbif.org/ws/rest/occurrence/get?key=187986729