Data Publisher,Dataset,Dataset Rights,Collector name,Collector number,Field number,GUID,Date collected,Institution code,Collection code,Catalogue number,Basis of record,Image url,Last indexed,Identifier,Identification date,Scientific name,Author,Scientific name (interpreted),Kingdom,Phylum,Class,Order,Family,Genus,Country,Country (interpreted),Locality,County,Continent or Ocean,State/Province,Region,Publisher country,Latitude,Longitude,Coordinate precision,Cell id,Centi cell id,Min depth,Max depth,Max depth,Min altitude,Max altitude,Altitude precision,GBIF portal url,GBIF webservice url
"National Museum of Nature and Science, Japan","FKSE-Herbarium specimens of Faculty of Symbiotic Systems Science, Fukushima University, Japan",,,,,,,FKSE,Plant,2123,Specimen,,51:52.0,,,Erodium cicutarium (L.) L Her.,(L.) L Her.,Erodium cicutarium (L.) L Her.,Plantae,,,,GERANIACEAE,Erodium,Japan,Japan,"Honshu, Tohoku Distr., Fukushima Pref., Koriyama-shi, Asakamachi-2choume",,,,Eastern Asia,Japan,,,,,,,,,,,,http://data.gbif.org/occurrences/238093169,http://data.gbif.org/ws/rest/occurrence/get?key=238093169
"National Museum of Nature and Science, Japan","FKSE-Herbarium specimens of Faculty of Symbiotic Systems Science, Fukushima University, Japan",,,,,,,FKSE,Plant,2122,Specimen,,51:52.0,,,Erodium cicutarium (L.) L Her.,(L.) L Her.,Erodium cicutarium (L.) L Her.,Plantae,,,,GERANIACEAE,Erodium,Japan,Japan,"Honshu, Tohoku Distr., Fukushima Pref., Tamura-gun, Funehiki-machi",,,,Eastern Asia,Japan,,,,,,,,,,,,http://data.gbif.org/occurrences/238093168,http://data.gbif.org/ws/rest/occurrence/get?key=238093168
"National Museum of Nature and Science, Japan","FKSE-Herbarium specimens of Faculty of Symbiotic Systems Science, Fukushima University, Japan",,,,,,,FKSE,Plant,61972,Specimen,,51:54.0,,,Erodium cicutarium (L.) L'Her.,(L.) L'Her.,Erodium cicutarium (L.) LHer.,Plantae,,,,GERANIACEAE,Erodium,Japan,Japan,"Nakamura, Kitamachi.",Sohma-shi,,Fukushima,Eastern Asia,Japan,,,,,,,,,10,,,http://data.gbif.org/occurrences/391291837,http://data.gbif.org/ws/rest/occurrence/get?key=391291837
"National Museum of Nature and Science, Japan","Plant specimens depodited in Osaka Museum of Natural History, Japan.",,,,,,,OSA,C,OSA1317,Specimen,,19:17.0,,,Erodium cicutarium (L.) L'Her.,(L.) L'Her.,Erodium cicutarium (L.) LHer.,Plantae,,,,Geraniaceae,Erodium,Japan,Japan,,Kaizuka-shi,,Osaka Prefecture,Eastern Asia,Japan,,,,,,,,,,,,http://data.gbif.org/occurrences/295133868,http://data.gbif.org/ws/rest/occurrence/get?key=295133868
"National Museum of Nature and Science, Japan",Vascular Plants Collection of Sagamihara City Museum,,,,,,,JSCM,VS,12545,Specimen,,42:56.0,,,Erodium cicutarium (L.) L'Her.,(L.) L'Her.,Erodium cicutarium (L.) LHer.,Plantae,Spermatophyta,,,GERANIACEAE,Erodium,Japan,Japan,,Yamato-shi,,Kanagawa,Eastern Asia,Japan,,,,,,,,,,,,http://data.gbif.org/occurrences/351219541,http://data.gbif.org/ws/rest/occurrence/get?key=351219541
"National Museum of Nature and Science, Japan",Vascular Plants Collection of Sagamihara City Museum,,,,,,,JSCM,VS,12481,Specimen,,42:56.0,,,Erodium cicutarium (L.) L'Her.,(L.) L'Her.,Erodium cicutarium (L.) LHer.,Plantae,Spermatophyta,,,GERANIACEAE,Erodium,Japan,Japan,,Sagamihara-shi,,Kanagawa,Eastern Asia,Japan,,,,,,,,,,,,http://data.gbif.org/occurrences/351219535,http://data.gbif.org/ws/rest/occurrence/get?key=351219535
"National Museum of Nature and Science, Japan",Vascular Plants Collection of Sagamihara City Museum,,,,,,,JSCM,VS,13467,Specimen,,42:57.0,,,Erodium cicutarium (L.) L'Her.,(L.)L'Her.,Erodium cicutarium (L.) LHer.,Plantae,Spermatophyta,,,GERANIACEAE,Erodium,Japan,Japan,,Ayase-shi,,Kanagawa,Eastern Asia,Japan,,,,,,,,,,,,http://data.gbif.org/occurrences/351219604,http://data.gbif.org/ws/rest/occurrence/get?key=351219604
"National Museum of Nature and Science, Japan",Vascular Plants Collection of Sagamihara City Museum,,,,,,,JSCM,VS,12480,Specimen,,42:56.0,,,Erodium cicutarium (L.) L'Her.,(L.) L'Her.,Erodium cicutarium (L.) LHer.,Plantae,Spermatophyta,,,GERANIACEAE,Erodium,Japan,Japan,,Zama-shi,,Kanagawa,Eastern Asia,Japan,,,,,,,,,,,,http://data.gbif.org/occurrences/351219534,http://data.gbif.org/ws/rest/occurrence/get?key=351219534
"National Museum of Nature and Science, Japan",Vascular plants collection of Hiratsuka City Museum,,,,,,,HCM,56,59548,Specimen,,15:19.0,,,Erodium cicutarium (L.) L'Her.,(L.) L'Her.,Erodium cicutarium (L.) LHer.,Plantae,Angiospermae,Dicotyledoneae,,Geraniaceae,Erodium,Japan,Japan,,Fujisawa-shi,,Kanagawa,Eastern Asia,Japan,,,,,,,,,,,,http://data.gbif.org/occurrences/295330503,http://data.gbif.org/ws/rest/occurrence/get?key=295330503
"National Museum of Nature and Science, Japan",Vascular Plants Collection of Sagamihara City Museum,,,,,,,JSCM,VS,11943,Specimen,,42:56.0,,,Erodium cicutarium (L.) L'Her.,(L.) L'Her.,Erodium cicutarium (L.) LHer.,Plantae,Spermatophyta,,,GERANIACEAE,Erodium,Japan,Japan,,Sagamihara-shi,,Kanagawa,Eastern Asia,Japan,,,,,,,,,,,,http://data.gbif.org/occurrences/351219507,http://data.gbif.org/ws/rest/occurrence/get?key=351219507
"National Museum of Nature and Science, Japan",Vascular Plants Collection of Sagamihara City Museum,,,,,,,JSCM,VS,10975,Specimen,,42:56.0,,,Erodium cicutarium (L.) L'Her.,(L.) L'Her.,Erodium cicutarium (L.) LHer.,Plantae,Spermatophyta,,,GERANIACEAE,Erodium,Japan,Japan,,Sagamihara-shi,,Kanagawa,Eastern Asia,Japan,,,,,,,,,,,,http://data.gbif.org/occurrences/351219454,http://data.gbif.org/ws/rest/occurrence/get?key=351219454
"National Museum of Nature and Science, Japan",Vascular Plants Collection of Sagamihara City Museum,,,,,,,JSCM,VS,13565,Specimen,,42:57.0,,,Erodium cicutarium (L.) L'Her.,(L.)L'Her.,Erodium cicutarium (L.) LHer.,Plantae,Spermatophyta,,,GERANIACEAE,Erodium,Japan,Japan,,Yokohama-shi Seya-ku,,Kanagawa,Eastern Asia,Japan,,,,,,,,,,,,http://data.gbif.org/occurrences/351219609,http://data.gbif.org/ws/rest/occurrence/get?key=351219609
"National Museum of Nature and Science, Japan",Vascular Plants Collection of Sagamihara City Museum,,,,,,,JSCM,VS,32456,Specimen,,42:59.0,,,Erodium cicutarium (L.) L'Her.,(L.) L'Her.,Erodium cicutarium (L.) LHer.,Plantae,Spermatophyta,,,GERANIACEAE,Erodium,Japan,Japan,,Zama-shi,,Kanagawa,Eastern Asia,Japan,,,,,,,,,,,,http://data.gbif.org/occurrences/387673896,http://data.gbif.org/ws/rest/occurrence/get?key=387673896
"National Museum of Nature and Science, Japan",Vascular plants collection of Hiratsuka City Museum,,,,,,,HCM,56,82805,Specimen,,15:20.0,,,Erodium cicutarium (L.) L'Her.,(L.) L'Her.,Erodium cicutarium (L.) LHer.,Plantae,,,,Geraniaceae,Erodium,Japan,Japan,,Ashigarakami-gun Nakaimachi,,Kanagawa,Eastern Asia,Japan,,,,,,,,,,,,http://data.gbif.org/occurrences/385730611,http://data.gbif.org/ws/rest/occurrence/get?key=385730611
"National Museum of Nature and Science, Japan",Vascular Plants Collection of Sagamihara City Museum,,,,,,,JSCM,VS,12235,Specimen,,42:56.0,,,Erodium cicutarium (L.) L'Her.,(L.) L'Her.,Erodium cicutarium (L.) LHer.,Plantae,Spermatophyta,,,GERANIACEAE,Erodium,Japan,Japan,,Sagamihara-shi,,Kanagawa,Eastern Asia,Japan,,,,,,,,,,,,http://data.gbif.org/occurrences/351219521,http://data.gbif.org/ws/rest/occurrence/get?key=351219521
"National Museum of Nature and Science, Japan",Vascular Plants Collection of Sagamihara City Museum,,,,,,,JSCM,VS,31326,Specimen,,42:59.0,,,Erodium cicutarium (L.) L'Her.,(L.) L'Her.,Erodium cicutarium (L.) LHer.,Plantae,Spermatophyta,,,GERANIACEAE,Erodium,Japan,Japan,"Kawashiri, Shiroyama Town, Sagamihara City, Kanagawa Pref.",Sagamihara-shi,,Kanagawa,Eastern Asia,Japan,,,,,,,,,150,,,http://data.gbif.org/occurrences/387673834,http://data.gbif.org/ws/rest/occurrence/get?key=387673834
"National Museum of Nature and Science, Japan",Vascular Plants Collection of Sagamihara City Museum,,,,,,,JSCM,VS,11363,Specimen,,42:56.0,,,Erodium cicutarium (L.) L'Her.,(L.) L'Her.,Erodium cicutarium (L.) LHer.,Plantae,Spermatophyta,,,GERANIACEAE,Erodium,Japan,Japan,,Sagamihara-shi,,Kanagawa,Eastern Asia,Japan,,,,,,,,,,,,http://data.gbif.org/occurrences/351219472,http://data.gbif.org/ws/rest/occurrence/get?key=351219472
"National Museum of Nature and Science, Japan",Vascular Plants Collection of Sagamihara City Museum,,,,,,,JSCM,VS,12900,Specimen,,42:56.0,,,Erodium cicutarium (L.) L'Her.,(L.) L'Her.,Erodium cicutarium (L.) LHer.,Plantae,Spermatophyta,,,GERANIACEAE,Erodium,Japan,Japan,,Tsukui-gun Tsukuimachi,,Kanagawa,Eastern Asia,Japan,,,,,,,,,,,,http://data.gbif.org/occurrences/351219563,http://data.gbif.org/ws/rest/occurrence/get?key=351219563
"National Museum of Nature and Science, Japan",Vascular Plants Collection of Sagamihara City Museum,,,,,,,JSCM,VS,12511,Specimen,,42:56.0,,,Erodium cicutarium (L.) L'Her.,(L.) L'Her.,Erodium cicutarium (L.) LHer.,Plantae,Spermatophyta,,,GERANIACEAE,Erodium,Japan,Japan,,Sagamihara-shi,,Kanagawa,Eastern Asia,Japan,,,,,,,,,,,,http://data.gbif.org/occurrences/351219537,http://data.gbif.org/ws/rest/occurrence/get?key=351219537
"National Museum of Nature and Science, Japan",Vascular plants database of Atugi City Museum,,,,,,,JACM,PL24251,JACM-PL24251,Specimen,,28:56.0,,,Erodium cicutarium (L.) L'Her.,,Erodium cicutarium (L.) LHer.,Plantae,Angiospermae,,,Geraniaceae,Erodium,Japan,Japan,,Ebina-shi,,Kanagawa,Eastern Asia,Japan,,,,,,,,,,,,http://data.gbif.org/occurrences/393752982,http://data.gbif.org/ws/rest/occurrence/get?key=393752982
"National Museum of Nature and Science, Japan",Vascular plants collection of Hiratsuka City Museum,,,,,,,HCM,56,82804,Specimen,,15:20.0,,,Erodium cicutarium (L.) L'Her.,(L.) L'Her.,Erodium cicutarium (L.) LHer.,Plantae,,,,Geraniaceae,Erodium,Japan,Japan,,Ashigarakami-gun Nakaimachi,,Kanagawa,Eastern Asia,Japan,,,,,,,,,,,,http://data.gbif.org/occurrences/385730610,http://data.gbif.org/ws/rest/occurrence/get?key=385730610
"National Museum of Nature and Science, Japan",Vascular Plants Collection of Sagamihara City Museum,,,,,,,JSCM,VS,25338,Specimen,,42:58.0,,,Erodium cicutarium (L.) L'Her.,(L.) L'Her.,Erodium cicutarium (L.) LHer.,Plantae,Spermatophyta,,,GERANIACEAE,Erodium,Japan,Japan,"Negoya, Tskui Town, Sagamihara City, Kanagawa Pref.",Sagamihara-shi,,Kanagawa,Eastern Asia,Japan,,,,,,,,,,,,http://data.gbif.org/occurrences/351220042,http://data.gbif.org/ws/rest/occurrence/get?key=351220042
"National Museum of Nature and Science, Japan",Vascular Plants Collection of Sagamihara City Museum,,,,,,,JSCM,VS,10750,Specimen,,42:56.0,,,Erodium cicutarium (L.) L'Her.,(L.) L'Her.,Erodium cicutarium (L.) LHer.,Plantae,Spermatophyta,,,GERANIACEAE,Erodium,Japan,Japan,,Sagamihara-shi,,Kanagawa,Eastern Asia,Japan,,,,,,,,,,,,http://data.gbif.org/occurrences/351219448,http://data.gbif.org/ws/rest/occurrence/get?key=351219448
"National Museum of Nature and Science, Japan",Vascular Plants Collection of Sagamihara City Museum,,,,,,,JSCM,VS,13012,Specimen,,42:56.0,,,Erodium cicutarium (L.) L'Her.,(L.) L'Her.,Erodium cicutarium (L.) LHer.,Plantae,Spermatophyta,,,GERANIACEAE,Erodium,Japan,Japan,,Yokohama-shi Seya-ku,,Kanagawa,Eastern Asia,Japan,,,,,,,,,,,,http://data.gbif.org/occurrences/351219569,http://data.gbif.org/ws/rest/occurrence/get?key=351219569
"National Museum of Nature and Science, Japan",Vascular Plants Collection of Sagamihara City Museum,,,,,,,JSCM,VS,11871,Specimen,,42:56.0,,,Erodium cicutarium (L.) L'Her.,(L.) L'Her.,Erodium cicutarium (L.) LHer.,Plantae,Spermatophyta,,,GERANIACEAE,Erodium,Japan,Japan,,Ebina-shi,,Kanagawa,Eastern Asia,Japan,,,,,,,,,,,,http://data.gbif.org/occurrences/351219501,http://data.gbif.org/ws/rest/occurrence/get?key=351219501
"National Museum of Nature and Science, Japan",Vascular Plants Collection of Sagamihara City Museum,,,,,,,JSCM,VS,27771,Specimen,,42:58.0,,,Erodium cicutarium (L.) L'Her.,(L.) L'Her.,Erodium cicutarium (L.) LHer.,Plantae,Spermatophyta,,,GERANIACEAE,Erodium,Japan,Japan,"Ooshima, Sagamihara City, Kanagawa Pref.",Sagamihara-shi,,Kanagawa,Eastern Asia,Japan,,,,,,,,,67,,,http://data.gbif.org/occurrences/351220123,http://data.gbif.org/ws/rest/occurrence/get?key=351220123
"National Museum of Nature and Science, Japan",Vascular plants collection of Hiratsuka City Museum,,,,,,,HCM,56,37308,Specimen,,15:18.0,,,Erodium cicutarium (L.) L'Her.,(L.) L'Her.,Erodium cicutarium (L.) LHer.,Plantae,Angiospermae,Dicotyledoneae,,Geraniaceae,Erodium,Japan,Japan,,Isehara-shi,,Kanagawa,Eastern Asia,Japan,,,,,,,,,,,,http://data.gbif.org/occurrences/295330480,http://data.gbif.org/ws/rest/occurrence/get?key=295330480
"National Museum of Nature and Science, Japan",Vascular Plants Collection of Sagamihara City Museum,,,,,,,JSCM,VS,11580,Specimen,,42:56.0,,,Erodium cicutarium (L.) L'Her.,(L.) L'Her.,Erodium cicutarium (L.) LHer.,Plantae,Spermatophyta,,,GERANIACEAE,Erodium,Japan,Japan,,Sagamihara-shi,,Kanagawa,Eastern Asia,Japan,,,,,,,,,,,,http://data.gbif.org/occurrences/351219486,http://data.gbif.org/ws/rest/occurrence/get?key=351219486
"National Museum of Nature and Science, Japan",Vascular Plants Collection of Sagamihara City Museum,,,,,,,JSCM,VS,13071,Specimen,,42:57.0,,,Erodium cicutarium (L.) L'Her.,(L.)L'Her.,Erodium cicutarium (L.) LHer.,Plantae,Spermatophyta,,,GERANIACEAE,Erodium,Japan,Japan,,Sagamihara-shi,,Kanagawa,Eastern Asia,Japan,,,,,,,,,,,,http://data.gbif.org/occurrences/351219577,http://data.gbif.org/ws/rest/occurrence/get?key=351219577
"National Museum of Nature and Science, Japan",Vascular plants collection of Hiratsuka City Museum,,,,,,,HCM,56,74024,Specimen,,15:19.0,,,Erodium cicutarium (L.) L'Her.,(L.) L'Her.,Erodium cicutarium (L.) LHer.,Plantae,,,,Geraniaceae,Erodium,Japan,Japan,,Hiratsuka-shi,,Kanagawa,Eastern Asia,Japan,,,,,,,,,,,,http://data.gbif.org/occurrences/385730360,http://data.gbif.org/ws/rest/occurrence/get?key=385730360
"National Museum of Nature and Science, Japan",Vascular plants database of Atugi City Museum,,,,,,,JACM,PL24244,JACM-PL24244,Specimen,,28:55.0,,,Erodium cicutarium (L.) L'Her.,,Erodium cicutarium (L.) LHer.,Plantae,Angiospermae,,,Geraniaceae,Erodium,Japan,Japan,,Ayase-shi,,Kanagawa,Eastern Asia,Japan,,,,,,,,,,,,http://data.gbif.org/occurrences/238033834,http://data.gbif.org/ws/rest/occurrence/get?key=238033834
"National Museum of Nature and Science, Japan",Vascular Plants Collection of Sagamihara City Museum,,,,,,,JSCM,VS,27189,Specimen,,42:58.0,,,Erodium cicutarium (L.) L'Her.,(L.) L'Her.,Erodium cicutarium (L.) LHer.,Plantae,Spermatophyta,,,GERANIACEAE,Erodium,Japan,Japan,,Shibuya-ku,,Tokyo,Eastern Asia,Japan,,,,,,,,,,,,http://data.gbif.org/occurrences/351220112,http://data.gbif.org/ws/rest/occurrence/get?key=351220112
"National Museum of Nature and Science, Japan",Vascular Plant Specimen Database of Kanagawa Prefectural Museum of Natural History,,,,,,,KPM,NA,KPM-NA1105285,Specimen,,25:59.0,,,Erodium cicutarium (L.) L'Her.,,Erodium cicutarium (L.) LHer.,Plantae,Angiospermae,Dicotyledoneae,,GERANIACEAE,Erodium,Japan,Japan,,"Yokohama-shi, Hodogaya-ku",,Kanagawa Prefecture,Eastern Asia,Japan,35.4574,139.578,,45319,45,,,,,,,http://data.gbif.org/occurrences/295900119,http://data.gbif.org/ws/rest/occurrence/get?key=295900119
"National Museum of Nature and Science, Japan",Vascular Plant Specimen Database of Kanagawa Prefectural Museum of Natural History,,,,,,,KPM,NA,KPM-NA1006214,Specimen,,25:58.0,,,Erodium cicutarium (L.) L'Her.,,Erodium cicutarium (L.) LHer.,Plantae,Angiospermae,Dicotyledoneae,,GERANIACEAE,Erodium,Japan,Japan,Issiki,"Naka-gun, Ninomiya-machi",,Kanagawa Prefecture,Eastern Asia,Japan,35.3241,139.241,,45319,32,,,,,,,http://data.gbif.org/occurrences/187985225,http://data.gbif.org/ws/rest/occurrence/get?key=187985225
"National Museum of Nature and Science, Japan",Vascular Plant Specimen Database of Kanagawa Prefectural Museum of Natural History,,,,,,,KPM,NA,KPM-NA0115147,Specimen,,26:00.0,,,Erodium cicutarium (L.) L'Her.,,Erodium cicutarium (L.) LHer.,Plantae,Angiospermae,Dicotyledoneae,,GERANIACEAE,Erodium,Japan,Japan,,"Kawasaki-shi,, Kawasaki-ku",,Kanagawa Prefecture,Eastern Asia,Japan,,,,,,,,,,,,http://data.gbif.org/occurrences/388825503,http://data.gbif.org/ws/rest/occurrence/get?key=388825503
"National Museum of Nature and Science, Japan",Vascular Plant Specimen Database of Kanagawa Prefectural Museum of Natural History,,,,,,,KPM,NA,KPM-NA1105288,Specimen,,25:59.0,,,Erodium cicutarium (L.) L'Her.,,Erodium cicutarium (L.) LHer.,Plantae,Angiospermae,Dicotyledoneae,,GERANIACEAE,Erodium,Japan,Japan,,"Yokohama-shi, Hodogaya-ku",,Kanagawa Prefecture,Eastern Asia,Japan,35.4574,139.578,,45319,45,,,,,,,http://data.gbif.org/occurrences/295900122,http://data.gbif.org/ws/rest/occurrence/get?key=295900122
"National Museum of Nature and Science, Japan",Vascular Plant Specimen Database of Kanagawa Prefectural Museum of Natural History,,,,,,,KPM,NA,KPM-NA1006215,Specimen,,25:58.0,,,Erodium cicutarium (L.) L'Her.,,Erodium cicutarium (L.) LHer.,Plantae,Angiospermae,Dicotyledoneae,,GERANIACEAE,Erodium,Japan,Japan,,"Yokohama-shi, Tsurumi-ku",,Kanagawa Prefecture,Eastern Asia,Japan,35.4658,139.678,,45319,46,,,,,,,http://data.gbif.org/occurrences/187985226,http://data.gbif.org/ws/rest/occurrence/get?key=187985226
"National Museum of Nature and Science, Japan",Vascular Plant Specimen Database of Kanagawa Prefectural Museum of Natural History,,,,,,,KPM,NA,KPM-NA0102015,Specimen,,26:00.0,,,Erodium cicutarium (L.) L'Her.,,Erodium cicutarium (L.) LHer.,Plantae,Angiospermae,Dicotyledoneae,,GERANIACEAE,Erodium,Japan,Japan,,Hachioji-shi,,Tokyo Metropolis,Eastern Asia,Japan,,,,,,,,,,,,http://data.gbif.org/occurrences/388825456,http://data.gbif.org/ws/rest/occurrence/get?key=388825456
"National Museum of Nature and Science, Japan",Vascular plant specimens of Iida City Museum,,,,,,,ICM,HE,18,Specimen,,32:58.0,,,Erodium cicutarium (L.) L'Her.,,Erodium cicutarium (L.) LHer.,Plantae,,,,Geraniaceae,Erodium,Japan,Japan,,Iida-shi,,Nagano,Eastern Asia,Japan,,,,,,,,,,507,,http://data.gbif.org/occurrences/322893264,http://data.gbif.org/ws/rest/occurrence/get?key=322893264
"National Museum of Nature and Science, Japan","Herbarium Specimens of Tokushima Prefectural Museum, Japan",,,,,,,TKPM,B,SP041356,Specimen,,22:39.0,,,Erodium cicutarium L Her.,L Her.,Erodium cicutarium L Her.,Plantae,Angiospermae,Dicotyledoneae,Angiospermae,Geraniaceae,Erodium,Japan,Japan,,Ishii-cho,,Tokushima Pref.,Eastern Asia,Japan,,,,,,,,,,,,http://data.gbif.org/occurrences/150136307,http://data.gbif.org/ws/rest/occurrence/get?key=150136307
"National Museum of Nature and Science, Japan","Ibaraki Nature Museum, Vascular Plants collection",,,,,,,INM,Va,5909,Specimen,,51:04.0,,,Erodium cicutarium L'Her,L'Her,Erodium cicutarium LHer,Plantae,ANGIOSPERMAE,DICOTYLEDONEAE,,Geraniaceae,Erodium,Japan,Japan,,Kashima-gun Hasakimachi,,Ibaraki,Eastern Asia,Japan,,,,,,,,,10,,,http://data.gbif.org/occurrences/381807595,http://data.gbif.org/ws/rest/occurrence/get?key=381807595
"National Museum of Nature and Science, Japan","Ibaraki Nature Museum, Vascular Plants collection",,,,,,,INM,Va,5908,Specimen,,51:04.0,,,Erodium cicutarium L'Her,L'Her,Erodium cicutarium LHer,Plantae,ANGIOSPERMAE,DICOTYLEDONEAE,,Geraniaceae,Erodium,Japan,Japan,,Kashima-gun Hasakimachi,,Ibaraki,Eastern Asia,Japan,,,,,,,,,10,,,http://data.gbif.org/occurrences/381807594,http://data.gbif.org/ws/rest/occurrence/get?key=381807594
"National Museum of Nature and Science, Japan",Angiospermatatophytina Collection of Saitama Museum of Natural History,,,,,,,SMNH,As,11311,Specimen,,52:47.0,,,Erodium cicutarium L'Her.,L'Her.,Erodium cicutarium LHer.,Plantae,Angiospermae,Dicotyledoneae,Geraniales,Geraniaceae,Erodium,Japan,Japan,Nakamura,Chichibu-shi,,Saitama,Eastern Asia,Japan,,,,,,,,,,,,http://data.gbif.org/occurrences/393098612,http://data.gbif.org/ws/rest/occurrence/get?key=393098612
"National Museum of Nature and Science, Japan",Angiospermatatophytina Collection of Saitama Museum of Natural History,,,,,,,SMNH,As,11313,Specimen,,52:47.0,,,Erodium cicutarium L'Her.,L'Her.,Erodium cicutarium LHer.,Plantae,Angiospermae,Dicotyledoneae,Geraniales,Geraniaceae,Erodium,Japan,Japan,Nakamura,Chichibu-shi,,Saitama,Eastern Asia,Japan,,,,,,,,,,,,http://data.gbif.org/occurrences/393098616,http://data.gbif.org/ws/rest/occurrence/get?key=393098616
"National Museum of Nature and Science, Japan",Angiospermatatophytina Collection of Saitama Museum of Natural History,,,,,,,SMNH,As,11312,Specimen,,52:47.0,,,Erodium cicutarium L'Her.,L'Her.,Erodium cicutarium LHer.,Plantae,Angiospermae,Dicotyledoneae,Geraniales,Geraniaceae,Erodium,Japan,Japan,Nakamura,Chichibu-shi,,Saitama,Eastern Asia,Japan,,,,,,,,,,,,http://data.gbif.org/occurrences/393098614,http://data.gbif.org/ws/rest/occurrence/get?key=393098614
"National Museum of Nature and Science, Japan","Ibaraki Nature Museum, Vascular Plants collection",,,,,,,INM,Va,31630,Specimen,,51:05.0,,,Erodium cicutarium L'Her.,L'Her.,Erodium cicutarium LHer.,Plantae,ANGIOSPERMAE,DICOTYLEDONEAE,,GERANIACEAE,Erodium,Japan,Japan,,Hitachi-shi,,Ibaraki,Eastern Asia,Japan,,,,,,,,,200,,,http://data.gbif.org/occurrences/381807793,http://data.gbif.org/ws/rest/occurrence/get?key=381807793
"National Museum of Nature and Science, Japan","Ibaraki Nature Museum, Vascular Plants collection",,,,,,,INM,Va,31631,Specimen,,51:05.0,,,Erodium cicutarium L'Her.,L'Her.,Erodium cicutarium LHer.,Plantae,ANGIOSPERMAE,DICOTYLEDONEAE,,GERANIACEAE,Erodium,Japan,Japan,,Hitachi-shi,,Ibaraki,Eastern Asia,Japan,,,,,,,,,200,,,http://data.gbif.org/occurrences/381807794,http://data.gbif.org/ws/rest/occurrence/get?key=381807794
"National Museum of Nature and Science, Japan","Ibaraki Nature Museum, Vascular Plants collection",,,,,,,INM,Va,113435,Specimen,,51:06.0,,,Erodium cicutarium L'Her.,L'Her.,Erodium cicutarium LHer.,Plantae,SPERMATOPHYTAANGIOSPERMAE,DICOTYLEDONEAE,,GERANIACEAE,Erodium,Japan,Japan,,Mito-shi,,Ibaraki,Eastern Asia,Japan,,,,,,,,,,,,http://data.gbif.org/occurrences/381808032,http://data.gbif.org/ws/rest/occurrence/get?key=381808032
"National Museum of Nature and Science, Japan",Plant Specimens of Kurashiki Museum of Natural History,,,,,,,KURA,KURA,4717,Specimen,,14:30.0,,,Erodium cicutarium L'Her.,,Erodium cicutarium LHer.,Plantae,,,Geraniales,Geraniaceae,Erodium,Japan,Japan,Tsushimanaka,Okayama City,,Okayama Prefecture,Eastern Asia,Japan,,,,,,,,,,,,http://data.gbif.org/occurrences/148836239,http://data.gbif.org/ws/rest/occurrence/get?key=148836239
"National Museum of Nature and Science, Japan",Plant Specimens of Kurashiki Museum of Natural History,,,,,,,KURA,KURA,kt139708,Specimen,,14:32.0,,,Erodium cicutarium L'Her.,L'Her.,Erodium cicutarium LHer.,Plantae,,,Geraniales,Geraniaceae,Erodium,Japan,Japan,,Mitsu-cho,,Okayama,Eastern Asia,Japan,,,,,,,,,,,,http://data.gbif.org/occurrences/204273779,http://data.gbif.org/ws/rest/occurrence/get?key=204273779
"National Museum of Nature and Science, Japan",Plant Specimens of Kurashiki Museum of Natural History,,,,,,,KURA,KURA,4656,Specimen,,14:30.0,,,Erodium cicutarium L'Her.,,Erodium cicutarium LHer.,Plantae,,,Geraniales,Geraniaceae,Erodium,Japan,Japan,Tsushimanaka,Okayama City,,Okayama Prefecture,Eastern Asia,Japan,,,,,,,,,,,,http://data.gbif.org/occurrences/148836238,http://data.gbif.org/ws/rest/occurrence/get?key=148836238
"National Museum of Nature and Science, Japan",Plant Specimens of Kurashiki Museum of Natural History,,,,,,,KURA,KURA,170086,Specimen,,14:34.0,,,Erodium cicutarium L'Her.,L'Her.,Erodium cicutarium LHer.,Plantae,,,Geraniales,Geraniaceae,Erodium,Japan,Japan,,Akaiwa-shi,,Okayama,Eastern Asia,Japan,,,,,,,,,,,,http://data.gbif.org/occurrences/395761792,http://data.gbif.org/ws/rest/occurrence/get?key=395761792