Data Publisher,Dataset,Dataset Rights,Collector name,Collector number,Field number,GUID,Date collected,Institution code,Collection code,Catalogue number,Basis of record,Image url,Last indexed,Identifier,Identification date,Scientific name,Author,Scientific name (interpreted),Kingdom,Phylum,Class,Order,Family,Genus,Country,Country (interpreted),Locality,County,Continent or Ocean,State/Province,Region,Publisher country,Latitude,Longitude,Coordinate precision,Cell id,Centi cell id,Min depth,Max depth,Max depth,Min altitude,Max altitude,Altitude precision,GBIF portal url,GBIF webservice url
"National Museum of Nature and Science, Japan","Botanical specimens database of Mr. Jiro Ito collection, Shizuoka Prefecture Museum of Natural History",,,,,,,SPMN,a,SPMN-a-613,Specimen,,37:36.0,,,Chrysosplenium album Maxim. var. flavum Hara,Hara,Chrysosplenium album var. flavum Hara,Plantae,Magnoliophyta,Magnoliopsida,Rosales,Saxifragaceae,Chrysosplenium,Japan,Japan,,Fuji-shi,,Shizuoka,Eastern Asia,Japan,,,,,,,,,,,,http://data.gbif.org/occurrences/380182195,http://data.gbif.org/ws/rest/occurrence/get?key=380182195
"National Museum of Nature and Science, Japan","Botanical specimens database of Mr. Jiro Ito collection, Shizuoka Prefecture Museum of Natural History",,,,,,,SPMN,a,SPMN-a-614,Specimen,,37:36.0,,,Chrysosplenium album Maxim. var. flavum Hara,Hara,Chrysosplenium album var. flavum Hara,Plantae,Magnoliophyta,Magnoliopsida,Rosales,Saxifragaceae,Chrysosplenium,Japan,Japan,,Haibara-gun Nakakawanecho,,Shizuoka,Eastern Asia,Japan,,,,,,,,,,,,http://data.gbif.org/occurrences/380182196,http://data.gbif.org/ws/rest/occurrence/get?key=380182196
"National Museum of Nature and Science, Japan","Botanical specimens database of Mr. Jiro Ito collection, Shizuoka Prefecture Museum of Natural History",,,,,,,SPMN,a,SPMN-a-616,Specimen,,37:36.0,,,Chrysosplenium album Maxim. var. flavum Hara,Hara,Chrysosplenium album var. flavum Hara,Plantae,Magnoliophyta,Magnoliopsida,Rosales,Saxifragaceae,Chrysosplenium,Japan,Japan,,Shizuoka-shi,,Shizuoka,Eastern Asia,Japan,,,,,,,,,,,,http://data.gbif.org/occurrences/380182198,http://data.gbif.org/ws/rest/occurrence/get?key=380182198
"National Museum of Nature and Science, Japan","Ibaraki Nature Museum, Vascular Plants collection",,,,,,,INM,Va,129302,Specimen,,50:00.0,,,Chrysosplenium album Maxim. var. flavum Hara,Hara,Chrysosplenium album var. flavum Hara,Plantae,SPERMATOPHYTAANGIOSPERMAE,DICOTYLEDONEAE,,SAXIFRAGACEAE,Chrysosplenium,Japan,Japan,,Tenryuu-shi,,Shizuoka,Eastern Asia,Japan,,,,,,,,,,,,http://data.gbif.org/occurrences/381797123,http://data.gbif.org/ws/rest/occurrence/get?key=381797123
"National Museum of Nature and Science, Japan","Ibaraki Nature Museum, Vascular Plants collection",,,,,,,INM,Va,129298,Specimen,,50:00.0,,,Chrysosplenium album Maxim. var. flavum Hara,Hara,Chrysosplenium album var. flavum Hara,Plantae,SPERMATOPHYTAANGIOSPERMAE,DICOTYLEDONEAE,,SAXIFRAGACEAE,Chrysosplenium,Japan,Japan,,Shizuoka-shi,,Shizuoka,Eastern Asia,Japan,,,,,,,,,,,,http://data.gbif.org/occurrences/381797119,http://data.gbif.org/ws/rest/occurrence/get?key=381797119
"National Museum of Nature and Science, Japan","Ibaraki Nature Museum, Vascular Plants collection",,,,,,,INM,Va,138482,Specimen,,50:02.0,,,Chrysosplenium album Maxim. var. flavum Hara,Hara,Chrysosplenium album var. flavum Hara,Plantae,SPERMATOPHYTAANGIOSPERMAE,DICOTYLEDONEAE,,SAXIFRAGACEAE,Chrysosplenium,Japan,Japan,,Tenryuu-shi,,Shizuoka,Eastern Asia,Japan,,,,,,,,,,,,http://data.gbif.org/occurrences/381797317,http://data.gbif.org/ws/rest/occurrence/get?key=381797317
"National Museum of Nature and Science, Japan","Ibaraki Nature Museum, Vascular Plants collection",,,,,,,INM,Va,129299,Specimen,,50:00.0,,,Chrysosplenium album Maxim. var. flavum Hara,Hara,Chrysosplenium album var. flavum Hara,Plantae,SPERMATOPHYTAANGIOSPERMAE,DICOTYLEDONEAE,,SAXIFRAGACEAE,Chrysosplenium,Japan,Japan,,Shizuoka-shi,,Shizuoka,Eastern Asia,Japan,,,,,,,,,,,,http://data.gbif.org/occurrences/381797120,http://data.gbif.org/ws/rest/occurrence/get?key=381797120
"National Museum of Nature and Science, Japan","Ibaraki Nature Museum, Vascular Plants collection",,,,,,,INM,Va,129301,Specimen,,50:00.0,,,Chrysosplenium album Maxim. var. flavum Hara,Hara,Chrysosplenium album var. flavum Hara,Plantae,SPERMATOPHYTAANGIOSPERMAE,DICOTYLEDONEAE,,SAXIFRAGACEAE,Chrysosplenium,Japan,Japan,,Iwata-gun Sakumacho,,Shizuoka,Eastern Asia,Japan,,,,,,,,,,,,http://data.gbif.org/occurrences/381797122,http://data.gbif.org/ws/rest/occurrence/get?key=381797122
"National Museum of Nature and Science, Japan","Ibaraki Nature Museum, Vascular Plants collection",,,,,,,INM,Va,129300,Specimen,,50:00.0,,,Chrysosplenium album Maxim. var. flavum Hara,Hara,Chrysosplenium album var. flavum Hara,Plantae,SPERMATOPHYTAANGIOSPERMAE,DICOTYLEDONEAE,,SAXIFRAGACEAE,Chrysosplenium,Japan,Japan,,Haibara-gun Kawanecho,,Shizuoka,Eastern Asia,Japan,,,,,,,,,,,,http://data.gbif.org/occurrences/381797121,http://data.gbif.org/ws/rest/occurrence/get?key=381797121
"National Museum of Nature and Science, Japan","Ibaraki Nature Museum, Vascular Plants collection",,,,,,,INM,Va,138470,Specimen,,50:01.0,,,Chrysosplenium album Maxim. var. flavum Hara,Hara,Chrysosplenium album var. flavum Hara,Plantae,SPERMATOPHYTAANGIOSPERMAE,DICOTYLEDONEAE,,SAXIFRAGACEAE,Chrysosplenium,Japan,Japan,,Tenryuu-shi,,Shizuoka,Eastern Asia,Japan,,,,,,,,,,,,http://data.gbif.org/occurrences/381797305,http://data.gbif.org/ws/rest/occurrence/get?key=381797305
