Data Publisher,Dataset,Dataset Rights,Collector name,Collector number,Field number,GUID,Date collected,Institution code,Collection code,Catalogue number,Basis of record,Image url,Last indexed,Identifier,Identification date,Scientific name,Author,Scientific name (interpreted),Kingdom,Phylum,Class,Order,Family,Genus,Country,Country (interpreted),Locality,County,Continent or Ocean,State/Province,Region,Publisher country,Latitude,Longitude,Coordinate precision,Cell id,Centi cell id,Min depth,Max depth,Max depth,Min altitude,Max altitude,Altitude precision,GBIF portal url,GBIF webservice url
"National Museum of Nature and Science, Japan",Angiosperm specimens of Iwate Prefectural Museum,,,,,,,IPMM,PA,72207,Specimen,,59:37.0,,,Draba japonica Maxim.,Maxim.,Draba japonica Maxim.,Plantae,Angiospermae,Dicotyledoneae,,Cruciferae,Draba,Japan,Japan,,Hanamaki-shi,,Iwate,Eastern Asia,Japan,,,,,,,,,,,,http://data.gbif.org/occurrences/93883384,http://data.gbif.org/ws/rest/occurrence/get?key=93883384
"National Museum of Nature and Science, Japan",Angiosperm specimens of Iwate Prefectural Museum,,,,,,,IPMM,PA,22816,Specimen,,59:39.0,,,Draba japonica Maxim.,Maxim.,Draba japonica Maxim.,Plantae,Angiospermae,Dicotyledoneae,Papaverales,Cruciferae,Draba,Japan,Japan,,Hanamaki-shi,,Iwate,Eastern Asia,Japan,,,,,,,,,,,,http://data.gbif.org/occurrences/204232317,http://data.gbif.org/ws/rest/occurrence/get?key=204232317
"National Museum of Nature and Science, Japan",Angiosperm specimens of Iwate Prefectural Museum,,,,,,,IPMM,PA,7582,Specimen,,59:39.0,,,Draba japonica Maxim.,Maxim.,Draba japonica Maxim.,Plantae,Angiospermae,Dicotyledoneae,Papaverales,Cruciferae,Draba,Japan,Japan,,Hanamaki-shi,,Iwate,Eastern Asia,Japan,,,,,,,,,,,,http://data.gbif.org/occurrences/204232279,http://data.gbif.org/ws/rest/occurrence/get?key=204232279
"National Museum of Nature and Science, Japan",Angiosperm specimens of Iwate Prefectural Museum,,,,,,,IPMM,PA,4736,Specimen,,59:38.0,,,Draba japonica Maxim.,Maxim.,Draba japonica Maxim.,Plantae,Angiospermae,Dicotyledoneae,Papaverales,Cruciferae,Draba,Japan,Japan,,Hanamaki-shi,,Iwate,Eastern Asia,Japan,,,,,,,,,,,,http://data.gbif.org/occurrences/204232202,http://data.gbif.org/ws/rest/occurrence/get?key=204232202
"National Museum of Nature and Science, Japan",Angiosperm specimens of Iwate Prefectural Museum,,,,,,,IPMM,PA,7513,Specimen,,59:39.0,,,Draba japonica Maxim.,Maxim.,Draba japonica Maxim.,Plantae,Angiospermae,Dicotyledoneae,Papaverales,Cruciferae,Draba,Japan,Japan,,Hanamaki-shi,,Iwate,Eastern Asia,Japan,,,,,,,,,,,,http://data.gbif.org/occurrences/204232276,http://data.gbif.org/ws/rest/occurrence/get?key=204232276
"National Museum of Nature and Science, Japan",Angiosperm specimens of Iwate Prefectural Museum,,,,,,,IPMM,PA,4734,Specimen,,59:38.0,,,Draba japonica Maxim.,Maxim.,Draba japonica Maxim.,Plantae,Angiospermae,Dicotyledoneae,Papaverales,Cruciferae,Draba,Japan,Japan,,Hanamaki-shi,,Iwate,Eastern Asia,Japan,,,,,,,,,,,,http://data.gbif.org/occurrences/204232200,http://data.gbif.org/ws/rest/occurrence/get?key=204232200
"National Museum of Nature and Science, Japan",Angiosperm specimens of Iwate Prefectural Museum,,,,,,,IPMM,PA,72218,Specimen,,59:37.0,,,Draba japonica Maxim.,Maxim.,Draba japonica Maxim.,Plantae,Angiospermae,Dicotyledoneae,,Cruciferae,Draba,Japan,Japan,,Hanamaki-shi,,Iwate,Eastern Asia,Japan,,,,,,,,,,,,http://data.gbif.org/occurrences/93883385,http://data.gbif.org/ws/rest/occurrence/get?key=93883385
"National Museum of Nature and Science, Japan",Angiosperm specimens of Iwate Prefectural Museum,,,,,,,IPMM,PA,4733,Specimen,,59:38.0,,,Draba japonica Maxim.,Maxim.,Draba japonica Maxim.,Plantae,Angiospermae,Dicotyledoneae,Papaverales,Cruciferae,Draba,Japan,Japan,,Hanamaki-shi,,Iwate,Eastern Asia,Japan,,,,,,,,,,,,http://data.gbif.org/occurrences/204232199,http://data.gbif.org/ws/rest/occurrence/get?key=204232199
"National Museum of Nature and Science, Japan",Angiosperm specimens of Iwate Prefectural Museum,,,,,,,IPMM,PA,7611,Specimen,,59:39.0,,,Draba japonica Maxim.,Maxim.,Draba japonica Maxim.,Plantae,Angiospermae,Dicotyledoneae,Papaverales,Cruciferae,Draba,Japan,Japan,,Hanamaki-shi,,Iwate,Eastern Asia,Japan,,,,,,,,,,,,http://data.gbif.org/occurrences/204232280,http://data.gbif.org/ws/rest/occurrence/get?key=204232280
"National Museum of Nature and Science, Japan",Angiosperm specimens of Iwate Prefectural Museum,,,,,,,IPMM,PA,4737,Specimen,,59:38.0,,,Draba japonica Maxim.,Maxim.,Draba japonica Maxim.,Plantae,Angiospermae,Dicotyledoneae,Papaverales,Cruciferae,Draba,Japan,Japan,,Hanamaki-shi,,Iwate,Eastern Asia,Japan,,,,,,,,,,,,http://data.gbif.org/occurrences/204232203,http://data.gbif.org/ws/rest/occurrence/get?key=204232203
"National Museum of Nature and Science, Japan",Angiosperm specimens of Iwate Prefectural Museum,,,,,,,IPMM,PA,4735,Specimen,,59:38.0,,,Draba japonica Maxim.,Maxim.,Draba japonica Maxim.,Plantae,Angiospermae,Dicotyledoneae,Papaverales,Cruciferae,Draba,Japan,Japan,,Hanamaki-shi,,Iwate,Eastern Asia,Japan,,,,,,,,,,,,http://data.gbif.org/occurrences/204232201,http://data.gbif.org/ws/rest/occurrence/get?key=204232201
"National Museum of Nature and Science, Japan","Ibaraki Nature Museum, Vascular Plants collection",,,,,,,INM,Va,41539,Specimen,,50:50.0,,,Draba japonica Maxim.,Maxim.,Draba japonica Maxim.,Plantae,ANGIOSPERMAE,DICOTYLEDONEAE,,BRASSICACEAE,Draba,Japan,Japan,,,,,Eastern Asia,Japan,,,,,,,,,,,,http://data.gbif.org/occurrences/381805118,http://data.gbif.org/ws/rest/occurrence/get?key=381805118
Botanic Garden and Botanical Museum Berlin-Dahlem,Herbarium Berolinense,,Tschonoski,,,,,BGBM,Herbarium Berolinense,B 10 0241483,Specimen,,52:19.0,,,Draba japonica Maxim.,,Draba japonica Maxim.,,,,,CRUCIFERAE,Draba,JP,Japan,Prov. Nambu.,,,,Eastern Asia,Germany,,,,,,,,,,,,http://data.gbif.org/occurrences/165319661,http://data.gbif.org/ws/rest/occurrence/get?key=165319661
"National Museum of Nature and Science, Japan","Plant specimens depodited in Osaka Museum of Natural History, Japan.",,,,,,,OSA,C,OSA41007,Specimen,,18:37.0,,,Draba japonica Maxim.,Maxim.,Draba japonica Maxim.,Plantae,,,,Brassicaceae,Draba,Japan,Japan,Mt. Hayachine-san,,,Iwate Prefecture,Eastern Asia,Japan,,,,,,,,,,,,http://data.gbif.org/occurrences/295128616,http://data.gbif.org/ws/rest/occurrence/get?key=295128616
"National Museum of Nature and Science, Japan",Plant specimens of Hokkaido University Museum,,,,,,,SAPS,plant,16178,Specimen,,02:26.0,,,Draba japonica Maxim.,Maxim.,Draba japonica Maxim.,Plantae,Magnoliophyta,Magnoliopsida,Capparales,Cruciferae,Draba,Japan,Japan,,Yuubari-shi,,Hokkaido Pref.,Eastern Asia,Japan,,,,,,,,,,,,http://data.gbif.org/occurrences/415413964,http://data.gbif.org/ws/rest/occurrence/get?key=415413964
"National Museum of Nature and Science, Japan",Plant specimens of Hokkaido University Museum,,,,,,,SAPS,plant,16154,Specimen,,02:26.0,,,Draba japonica Maxim.,Maxim.,Draba japonica Maxim.,Plantae,Magnoliophyta,Magnoliopsida,Capparales,Cruciferae,Draba,Japan,Japan,,Yuubari-shi,,Hokkaido Pref.,Eastern Asia,Japan,,,,,,,,,,,,http://data.gbif.org/occurrences/415413962,http://data.gbif.org/ws/rest/occurrence/get?key=415413962
"National Museum of Nature and Science, Japan",Plant specimens of Hokkaido University Museum,,,,,,,SAPS,plant,16165,Specimen,,02:26.0,,,Draba japonica Maxim.,Maxim.,Draba japonica Maxim.,Plantae,Magnoliophyta,Magnoliopsida,Capparales,Cruciferae,Draba,Japan,Japan,,Yuubari-shi,,Hokkaido Pref.,Eastern Asia,Japan,,,,,,,,,,,,http://data.gbif.org/occurrences/415413963,http://data.gbif.org/ws/rest/occurrence/get?key=415413963
"Royal Botanic Gardens, Kew","Royal Botanic Gardens, Kew",http://www.kew.org/aboutus/legal.html,Tschonoski,s.n.,,,,K,Herbarium,K000697266,Specimen,,04:39.0,,,Draba japonica Maxim.,Maxim.,Draba japonica Maxim.,Plantae,,,,BRASSICACEAE,Draba,Japan,Japan,Nippon Prov. Nambu,,,,Eastern Asia,United Kingdom,,,,,,,,,,,,http://data.gbif.org/occurrences/286843493,http://data.gbif.org/ws/rest/occurrence/get?key=286843493
"National Museum of Nature and Science, Japan",Vascular Plant Specimen Database of Kanagawa Prefectural Museum of Natural History,,,,,,,KPM,NA,KPM-NA0011695,Specimen,,25:24.0,,,Draba japonica Maxim.,,Draba japonica Maxim.,Plantae,Angiospermae,Dicotyledoneae,,BRASSICACEAE (CRUCIFERAE),Draba,Japan,Japan,,"Saru-gun, Biratori-cho",,Hokkaido,Eastern Asia,Japan,,,,,,,,,,,,http://data.gbif.org/occurrences/388820395,http://data.gbif.org/ws/rest/occurrence/get?key=388820395
"National Museum of Nature and Science, Japan",Vascular Plant Specimen Database of Kanagawa Prefectural Museum of Natural History,,,,,,,KPM,NA,KPM-NA0055894,Specimen,,25:24.0,,,Draba japonica Maxim.,,Draba japonica Maxim.,Plantae,Angiospermae,Dicotyledoneae,,BRASSICACEAE (CRUCIFERAE),Draba,Japan,Japan,,"Sorachi-gun, Minamifurano-cho",,Hokkaido,Eastern Asia,Japan,,,,,,,,,,,,http://data.gbif.org/occurrences/388820543,http://data.gbif.org/ws/rest/occurrence/get?key=388820543
"National Museum of Nature and Science, Japan",Vascular Plant Specimen Database of Kanagawa Prefectural Museum of Natural History,,,,,,,KPM,NA,KPM-NA0011589,Specimen,,25:24.0,,,Draba japonica Maxim.,,Draba japonica Maxim.,Plantae,Angiospermae,Dicotyledoneae,,BRASSICACEAE (CRUCIFERAE),Draba,Japan,Japan,,Yuubari-shi,,Hokkaido,Eastern Asia,Japan,,,,,,,,,,,,http://data.gbif.org/occurrences/388820394,http://data.gbif.org/ws/rest/occurrence/get?key=388820394
"National Museum of Nature and Science, Japan",Vascular Plant Specimen Database of Kanagawa Prefectural Museum of Natural History,,,,,,,KPM,NA,KPM-NA0021512,Specimen,,25:24.0,,,Draba japonica Maxim.,,Draba japonica Maxim.,Plantae,Angiospermae,Dicotyledoneae,,BRASSICACEAE (CRUCIFERAE),Draba,Japan,Japan,,Yuubari-shi,,Hokkaido,Eastern Asia,Japan,,,,,,,,,,,,http://data.gbif.org/occurrences/388820458,http://data.gbif.org/ws/rest/occurrence/get?key=388820458
"National Museum of Nature and Science, Japan",Vascular Plant Specimen Database of Kanagawa Prefectural Museum of Natural History,,,,,,,KPM,NA,KPM-NA0055812,Specimen,,25:24.0,,,Draba japonica Maxim.,,Draba japonica Maxim.,Plantae,Angiospermae,Dicotyledoneae,,BRASSICACEAE (CRUCIFERAE),Draba,Japan,Japan,,"Sorachi-gun, Minamifurano-cho",,Hokkaido,Eastern Asia,Japan,,,,,,,,,,,,http://data.gbif.org/occurrences/388820541,http://data.gbif.org/ws/rest/occurrence/get?key=388820541
Royal Botanic Garden Edinburgh,RBGE Herbarium (E),Copyright Royal Botanic Garden Edinburgh. Contact us for rights to commercial use.,"Brooks, R.R.",89-25,,,00:00.0,E,E,E00295786,Specimen,,12:55.0,,,Draba japonica Maxim.,,Draba japonica Maxim.,,,,,Cruciferae,Draba,JP,Japan,,,,,Eastern Asia,,,,,,,,,,,,,http://data.gbif.org/occurrences/575015735,http://data.gbif.org/ws/rest/occurrence/get?key=575015735
