Data Publisher,Dataset,Dataset Rights,Collector name,Collector number,Field number,GUID,Date collected,Institution code,Collection code,Catalogue number,Basis of record,Image url,Last indexed,Identifier,Identification date,Scientific name,Author,Scientific name (interpreted),Kingdom,Phylum,Class,Order,Family,Genus,Country,Country (interpreted),Locality,County,Continent or Ocean,State/Province,Region,Publisher country,Latitude,Longitude,Coordinate precision,Cell id,Centi cell id,Min depth,Max depth,Max depth,Min altitude,Max altitude,Altitude precision,GBIF portal url,GBIF webservice url
"National Museum of Nature and Science, Japan","Plant specimens depodited in Osaka Museum of Natural History, Japan.",,,,,,,OSA,OSA,35253,Specimen,,18:17.0,,,Dichocarpum numajirianum (Makino) W.T.Wang et P.K.Hsiao,(Makino) W.T.Wang et P.K.Hsiao,Dichocarpum numajirianum (Makino) W.T.Wang & P.K.Hsiao,Plantae,,,,Ranunculaceae,Dichocarpum,Japan,Japan,,Yoshino-gun Totsukawamura,,Nara,Eastern Asia,Japan,34.4069,135.798,,44955,47,,,,,,,http://data.gbif.org/occurrences/204375078,http://data.gbif.org/ws/rest/occurrence/get?key=204375078
"National Museum of Nature and Science, Japan","Plant specimens depodited in Osaka Museum of Natural History, Japan.",,,,,,,OSA,OSA,240719,Specimen,,18:17.0,,,Dichocarpum numajirianum (Makino) W.T.Wang et P.K.Hsiao,(Makino) W.T.Wang et P.K.Hsiao,Dichocarpum numajirianum (Makino) W.T.Wang & P.K.Hsiao,Plantae,,,,Ranunculaceae,Dichocarpum,Japan,Japan,,Yoshino-gun Totsukawamura,,Nara,Eastern Asia,Japan,34.4069,135.798,,44955,47,,,,,,,http://data.gbif.org/occurrences/204375080,http://data.gbif.org/ws/rest/occurrence/get?key=204375080
"National Museum of Nature and Science, Japan","Plant specimens depodited in Osaka Museum of Natural History, Japan.",,,,,,,OSA,OSA,34166,Specimen,,18:17.0,,,Dichocarpum numajirianum (Makino) W.T.Wang et P.K.Hsiao,(Makino) W.T.Wang et P.K.Hsiao,Dichocarpum numajirianum (Makino) W.T.Wang & P.K.Hsiao,Plantae,,,,Ranunculaceae,Dichocarpum,Japan,Japan,,Yoshino-gun Totsukawamura,,Nara,Eastern Asia,Japan,34.4069,135.798,,44955,47,,,,,,,http://data.gbif.org/occurrences/204375077,http://data.gbif.org/ws/rest/occurrence/get?key=204375077
"National Museum of Nature and Science, Japan","Plant specimens depodited in Osaka Museum of Natural History, Japan.",,,,,,,OSA,OSA,240718,Specimen,,18:17.0,,,Dichocarpum numajirianum (Makino) W.T.Wang et P.K.Hsiao,(Makino) W.T.Wang et P.K.Hsiao,Dichocarpum numajirianum (Makino) W.T.Wang & P.K.Hsiao,Plantae,,,,Ranunculaceae,Dichocarpum,Japan,Japan,,Yoshino-gun Totsukawamura,,Nara,Eastern Asia,Japan,34.4069,135.798,,44955,47,,,,,,,http://data.gbif.org/occurrences/204375079,http://data.gbif.org/ws/rest/occurrence/get?key=204375079
"National Museum of Nature and Science, Japan","Plant specimens depodited in Osaka Museum of Natural History, Japan.",,,,,,,OSA,C,OSA8641,Specimen,,20:13.0,,,Isopyrum numajirianum Mak.,Mak.,Isopyrum numajirianum Mak.,Plantae,,,,Ranunculaceae,Isopyrum,Japan,Japan,,Nishi-muro-gun Ohto-mura,,Wakayama Prefecture,Eastern Asia,Japan,,,,,,,,,,,,http://data.gbif.org/occurrences/295141459,http://data.gbif.org/ws/rest/occurrence/get?key=295141459
"National Museum of Nature and Science, Japan","Plant specimens depodited in Osaka Museum of Natural History, Japan.",,,,,,,OSA,C,OSA34783,Specimen,,20:14.0,,,Isopyrum numajirianum Mak.,Mak.,Isopyrum numajirianum Mak.,Plantae,,,,Ranunculaceae,Isopyrum,Japan,Japan,Kurozo-dani valley,Higashimuro-gun Hongu-cho,,Wakayama Prefecture,Eastern Asia,Japan,,,,,,,,,,,,http://data.gbif.org/occurrences/295141610,http://data.gbif.org/ws/rest/occurrence/get?key=295141610
"National Museum of Nature and Science, Japan","Plant specimens depodited in Osaka Museum of Natural History, Japan.",,,,,,,OSA,C,OSA35253,Specimen,,20:14.0,,,Isopyrum numajirianum Makino,Makino,Isopyrum numajirianum Makino,Plantae,,,,Ranunculaceae,Isopyrum,Japan,Japan,Mt. Tamaki-yama,Yoshino-gun Totsugawa-mura,,Nara Prefecture,Eastern Asia,Japan,,,,,,,,,,,,http://data.gbif.org/occurrences/295141613,http://data.gbif.org/ws/rest/occurrence/get?key=295141613
"National Museum of Nature and Science, Japan","Plant specimens depodited in Osaka Museum of Natural History, Japan.",,,,,,,OSA,C,OSA34166,Specimen,,20:14.0,,,Isopyrum numajirianum Makino,Makino,Isopyrum numajirianum Makino,Plantae,,,,Ranunculaceae,Isopyrum,Japan,Japan,Hiromi-gawa river (upstream of Hiki-gawa river),Yoshino-gun Totsugawa-mura,,Nara Prefecture,Eastern Asia,Japan,,,,,,,,,,,,http://data.gbif.org/occurrences/295141601,http://data.gbif.org/ws/rest/occurrence/get?key=295141601
"National Museum of Nature and Science, Japan","Plant specimens depodited in Osaka Museum of Natural History, Japan.",,,,,,,OSA,C,OSA8538,Specimen,,20:13.0,,,Isopyrum numajirianum Makino,Makino,Isopyrum numajirianum Makino,Plantae,,,,Ranunculaceae,Isopyrum,Japan,Japan,,Hidaka-gun Miyama-mura,,Wakayama Prefecture,Eastern Asia,Japan,,,,,,,,,,,,http://data.gbif.org/occurrences/295141457,http://data.gbif.org/ws/rest/occurrence/get?key=295141457
