Data Publisher,Dataset,Dataset Rights,Collector name,Collector number,Field number,GUID,Date collected,Institution code,Collection code,Catalogue number,Basis of record,Image url,Last indexed,Identifier,Identification date,Scientific name,Author,Scientific name (interpreted),Kingdom,Phylum,Class,Order,Family,Genus,Country,Country (interpreted),Locality,County,Continent or Ocean,State/Province,Region,Publisher country,Latitude,Longitude,Coordinate precision,Cell id,Centi cell id,Min depth,Max depth,Max depth,Min altitude,Max altitude,Altitude precision,GBIF portal url,GBIF webservice url
"National Institute of Genetics, ROIS","Herbarium Specimens of Museum of Nature and Human Activities, Hyogo Pref., Japan",,,,,,,HYO,VP,C1-014092,Specimen,,23:49.0,,,Ranunculus chinensis,,Ranunculus chinensis,Plantae,Magnoliophyta,,,Ranunculaceae,Ranunculus,Japan,Japan,"HONSHU. Pref.Hyogo: Tokuo, Ichijima-cho, Hikami-gun.",,,Hyogo,Eastern Asia,Japan,,,,,,,,,,,,http://data.gbif.org/occurrences/323507481,http://data.gbif.org/ws/rest/occurrence/get?key=323507481
"National Museum of Nature and Science, Japan",Angiosperm specimens of Iwate Prefectural Museum,,,,,,,IPMM,PA,71059,Specimen,,00:03.0,,,Ranunculus chinensis Bunge,Bunge,Ranunculus chinensis Bunge,Plantae,Angiospermae,Dicotyledoneae,,Ranunculaceae,Ranunculus,Japan,Japan,,Kamaishi-shi,,Iwate,Eastern Asia,Japan,,,,,,,,,,,,http://data.gbif.org/occurrences/93890035,http://data.gbif.org/ws/rest/occurrence/get?key=93890035
"National Museum of Nature and Science, Japan",Angiosperm specimens of Iwate Prefectural Museum,,,,,,,IPMM,PA,71060,Specimen,,00:03.0,,,Ranunculus chinensis Bunge,Bunge,Ranunculus chinensis Bunge,Plantae,Angiospermae,Dicotyledoneae,,Ranunculaceae,Ranunculus,Japan,Japan,,Kamaishi-shi,,Iwate,Eastern Asia,Japan,,,,,,,,,,,,http://data.gbif.org/occurrences/93890034,http://data.gbif.org/ws/rest/occurrence/get?key=93890034
"National Museum of Nature and Science, Japan","Herbarium Specimens of Museum of Nature and Human Activities, Hyogo Prefecture, Japan",,,,,,,HYO,HYO-C,C1-014092,Specimen,,28:27.0,,,Ranunculus chinensis Bunge,Bunge,Ranunculus chinensis Bunge,Plantae,Magnoliophyta,Magnoliopsida,Ranunculales,Ranunculaceae,Ranunculus,Japan,Japan,,,,Hyogo,Eastern Asia,Japan,,,,,,,,,,,,http://data.gbif.org/occurrences/177378138,http://data.gbif.org/ws/rest/occurrence/get?key=177378138
"National Museum of Nature and Science, Japan","Ibaraki Nature Museum, Vascular Plants collection",,,,,,,INM,Va,41458,Specimen,,53:36.0,,,Ranunculus chinensis Bunge,Bunge,Ranunculus chinensis Bunge,Plantae,ANGIOSPERMAE,DICOTYLEDONEAE,,RANUNCULACEAE,Ranunculus,Japan,Japan,,,,,Eastern Asia,Japan,,,,,,,,,,,,http://data.gbif.org/occurrences/381835798,http://data.gbif.org/ws/rest/occurrence/get?key=381835798
"National Museum of Nature and Science, Japan",Kochi Prefectural Makino Botanical Garden,,,,,,,MBK,MBK,1505,Specimen,,13:16.0,,,Ranunculus chinensis Bunge,Bunge,Ranunculus chinensis Bunge,Plantae,,,,Ranunculaceaea,Ranunculus,Japan,Japan,Hiratsuka,Hiratsuka-shi,,Kanagawa,Eastern Asia,Japan,35.3278,139.335,,45319,33,,,,,,,http://data.gbif.org/occurrences/287510713,http://data.gbif.org/ws/rest/occurrence/get?key=287510713
"National Museum of Nature and Science, Japan",Kochi Prefectural Makino Botanical Garden,,,,,,,MBK,MBK,150239,Specimen,,01:47.0,,,Ranunculus chinensis Bunge,Bunge,Ranunculus chinensis Bunge,Plantae,,,,Ranunculaceaea,Ranunculus,Japan,Japan,Hiratsuka,Hiratsuka-shi,,Kanagawa,Eastern Asia,Japan,,,,,,,,,,,,http://data.gbif.org/occurrences/354283215,http://data.gbif.org/ws/rest/occurrence/get?key=354283215
"National Museum of Nature and Science, Japan",Kochi Prefectural Makino Botanical Garden,,,,,,,MBK,MBK,150239,Specimen,,04:33.0,,,Ranunculus chinensis Bunge,Bunge,Ranunculus chinensis Bunge,Plantae,,,,Ranunculaceaea,Ranunculus,Japan,Japan,,Hiratsuka-shi,,Kanagawa,Eastern Asia,Japan,,,,,,,,,,,,http://data.gbif.org/occurrences/472898530,http://data.gbif.org/ws/rest/occurrence/get?key=472898530
"National Museum of Nature and Science, Japan",Plant specimens of Hokkaido University Museum,,,,,,,SAPS,plant,15720,Specimen,,02:55.0,,,Ranunculus chinensis Bunge,Bunge,Ranunculus chinensis Bunge,Plantae,Magnoliophyta,Magnoliopsida,Ranunculales,Ranunculaceae,Ranunculus,Japan,Japan,,Atsuma-cho,,Hokkaido Pref.,Eastern Asia,Japan,,,,,,,,,,,,http://data.gbif.org/occurrences/415417049,http://data.gbif.org/ws/rest/occurrence/get?key=415417049
"National Museum of Nature and Science, Japan",Plant specimens of Hokkaido University Museum,,,,,,,SAPS,plant,15721,Specimen,,02:55.0,,,Ranunculus chinensis Bunge,Bunge,Ranunculus chinensis Bunge,Plantae,Magnoliophyta,Magnoliopsida,Ranunculales,Ranunculaceae,Ranunculus,Japan,Japan,,Mukawa-cho,,Hokkaido Pref.,Eastern Asia,Japan,,,,,,,,,,,,http://data.gbif.org/occurrences/415417050,http://data.gbif.org/ws/rest/occurrence/get?key=415417050
"National Museum of Nature and Science, Japan",Plant specimens of Hokkaido University Museum,,,,,,,SAPS,plant,15731,Specimen,,02:55.0,,,Ranunculus chinensis Bunge,Bunge,Ranunculus chinensis Bunge,Plantae,Magnoliophyta,Magnoliopsida,Ranunculales,Ranunculaceae,Ranunculus,Japan,Japan,,Atsuma-cho,,Hokkaido Pref.,Eastern Asia,Japan,,,,,,,,,,,,http://data.gbif.org/occurrences/415417060,http://data.gbif.org/ws/rest/occurrence/get?key=415417060
"National Museum of Nature and Science, Japan",Plant specimens of Hokkaido University Museum,,,,,,,SAPS,plant,15718,Specimen,,02:55.0,,,Ranunculus chinensis Bunge,Bunge,Ranunculus chinensis Bunge,Plantae,Magnoliophyta,Magnoliopsida,Ranunculales,Ranunculaceae,Ranunculus,Japan,Japan,,Shiraoi-cho,,Hokkaido Pref.,Eastern Asia,Japan,,,,,,,,,,,,http://data.gbif.org/occurrences/415417047,http://data.gbif.org/ws/rest/occurrence/get?key=415417047
"National Museum of Nature and Science, Japan",Plant specimens of Hokkaido University Museum,,,,,,,SAPS,plant,15738,Specimen,,02:55.0,,,Ranunculus chinensis Bunge,Bunge,Ranunculus chinensis Bunge,Plantae,Magnoliophyta,Magnoliopsida,Ranunculales,Ranunculaceae,Ranunculus,Japan,Japan,,Ikeda-cho,,Hokkaido Pref.,Eastern Asia,Japan,,,,,,,,,,,,http://data.gbif.org/occurrences/415417066,http://data.gbif.org/ws/rest/occurrence/get?key=415417066
"National Museum of Nature and Science, Japan",Plant specimens of Hokkaido University Museum,,,,,,,SAPS,plant,15729,Specimen,,02:55.0,,,Ranunculus chinensis Bunge,Bunge,Ranunculus chinensis Bunge,Plantae,Magnoliophyta,Magnoliopsida,Ranunculales,Ranunculaceae,Ranunculus,Japan,Japan,,Atsuma-cho,,Hokkaido Pref.,Eastern Asia,Japan,,,,,,,,,,,,http://data.gbif.org/occurrences/415417058,http://data.gbif.org/ws/rest/occurrence/get?key=415417058
"National Museum of Nature and Science, Japan",Plant specimens of Hokkaido University Museum,,,,,,,SAPS,plant,15726,Specimen,,02:55.0,,,Ranunculus chinensis Bunge,Bunge,Ranunculus chinensis Bunge,Plantae,Magnoliophyta,Magnoliopsida,Ranunculales,Ranunculaceae,Ranunculus,Japan,Japan,,Mukawa-cho,,Hokkaido Pref.,Eastern Asia,Japan,,,,,,,,,,,,http://data.gbif.org/occurrences/415417055,http://data.gbif.org/ws/rest/occurrence/get?key=415417055
"National Museum of Nature and Science, Japan",Plant specimens of Hokkaido University Museum,,,,,,,SAPS,plant,15737,Specimen,,02:55.0,,,Ranunculus chinensis Bunge,Bunge,Ranunculus chinensis Bunge,Plantae,Magnoliophyta,Magnoliopsida,Ranunculales,Ranunculaceae,Ranunculus,Japan,Japan,,Ikeda-cho,,Hokkaido Pref.,Eastern Asia,Japan,,,,,,,,,,,,http://data.gbif.org/occurrences/415417065,http://data.gbif.org/ws/rest/occurrence/get?key=415417065
"National Museum of Nature and Science, Japan",Plant specimens of Hokkaido University Museum,,,,,,,SAPS,plant,15734,Specimen,,02:55.0,,,Ranunculus chinensis Bunge,Bunge,Ranunculus chinensis Bunge,Plantae,Magnoliophyta,Magnoliopsida,Ranunculales,Ranunculaceae,Ranunculus,Japan,Japan,,Noboribetsu-shi,,Hokkaido Pref.,Eastern Asia,Japan,,,,,,,,,,,,http://data.gbif.org/occurrences/415417063,http://data.gbif.org/ws/rest/occurrence/get?key=415417063
"National Museum of Nature and Science, Japan",Plant specimens of Hokkaido University Museum,,,,,,,SAPS,plant,15719,Specimen,,02:55.0,,,Ranunculus chinensis Bunge,Bunge,Ranunculus chinensis Bunge,Plantae,Magnoliophyta,Magnoliopsida,Ranunculales,Ranunculaceae,Ranunculus,Japan,Japan,,Shiraoi-cho,,Hokkaido Pref.,Eastern Asia,Japan,,,,,,,,,,,,http://data.gbif.org/occurrences/415417048,http://data.gbif.org/ws/rest/occurrence/get?key=415417048
"National Museum of Nature and Science, Japan",Plant specimens of Hokkaido University Museum,,,,,,,SAPS,plant,15724,Specimen,,02:55.0,,,Ranunculus chinensis Bunge,Bunge,Ranunculus chinensis Bunge,Plantae,Magnoliophyta,Magnoliopsida,Ranunculales,Ranunculaceae,Ranunculus,Japan,Japan,,Mukawa-cho,,Hokkaido Pref.,Eastern Asia,Japan,,,,,,,,,,,,http://data.gbif.org/occurrences/415417053,http://data.gbif.org/ws/rest/occurrence/get?key=415417053
"National Museum of Nature and Science, Japan",Plant specimens of Hokkaido University Museum,,,,,,,SAPS,plant,15727,Specimen,,02:55.0,,,Ranunculus chinensis Bunge,Bunge,Ranunculus chinensis Bunge,Plantae,Magnoliophyta,Magnoliopsida,Ranunculales,Ranunculaceae,Ranunculus,Japan,Japan,,Mukawa-cho,,Hokkaido Pref.,Eastern Asia,Japan,,,,,,,,,,,,http://data.gbif.org/occurrences/415417056,http://data.gbif.org/ws/rest/occurrence/get?key=415417056
"National Museum of Nature and Science, Japan",Plant specimens of Hokkaido University Museum,,,,,,,SAPS,plant,15722,Specimen,,02:55.0,,,Ranunculus chinensis Bunge,Bunge,Ranunculus chinensis Bunge,Plantae,Magnoliophyta,Magnoliopsida,Ranunculales,Ranunculaceae,Ranunculus,Japan,Japan,,Shiraoi-cho,,Hokkaido Pref.,Eastern Asia,Japan,,,,,,,,,,,,http://data.gbif.org/occurrences/415417051,http://data.gbif.org/ws/rest/occurrence/get?key=415417051
"National Museum of Nature and Science, Japan",Plant specimens of Hokkaido University Museum,,,,,,,SAPS,plant,15735,Specimen,,02:55.0,,,Ranunculus chinensis Bunge,Bunge,Ranunculus chinensis Bunge,Plantae,Magnoliophyta,Magnoliopsida,Ranunculales,Ranunculaceae,Ranunculus,Japan,Japan,,Shiraoi-cho,,Hokkaido Pref.,Eastern Asia,Japan,,,,,,,,,,,,http://data.gbif.org/occurrences/415417064,http://data.gbif.org/ws/rest/occurrence/get?key=415417064
"National Museum of Nature and Science, Japan",Plant specimens of Hokkaido University Museum,,,,,,,SAPS,plant,15732,Specimen,,02:55.0,,,Ranunculus chinensis Bunge,Bunge,Ranunculus chinensis Bunge,Plantae,Magnoliophyta,Magnoliopsida,Ranunculales,Ranunculaceae,Ranunculus,Japan,Japan,,Noboribetsu-shi,,Hokkaido Pref.,Eastern Asia,Japan,,,,,,,,,,,,http://data.gbif.org/occurrences/415417061,http://data.gbif.org/ws/rest/occurrence/get?key=415417061
"National Museum of Nature and Science, Japan",Plant specimens of Hokkaido University Museum,,,,,,,SAPS,plant,15725,Specimen,,02:55.0,,,Ranunculus chinensis Bunge,Bunge,Ranunculus chinensis Bunge,Plantae,Magnoliophyta,Magnoliopsida,Ranunculales,Ranunculaceae,Ranunculus,Japan,Japan,,Mukawa-cho,,Hokkaido Pref.,Eastern Asia,Japan,,,,,,,,,,,,http://data.gbif.org/occurrences/415417054,http://data.gbif.org/ws/rest/occurrence/get?key=415417054
"National Museum of Nature and Science, Japan",Plant specimens of Hokkaido University Museum,,,,,,,SAPS,plant,15741,Specimen,,02:55.0,,,Ranunculus chinensis Bunge,Bunge,Ranunculus chinensis Bunge,Plantae,Magnoliophyta,Magnoliopsida,Ranunculales,Ranunculaceae,Ranunculus,Japan,Japan,,Mukawa-cho,,Hokkaido Pref.,Eastern Asia,Japan,,,,,,,,,,,,http://data.gbif.org/occurrences/415417067,http://data.gbif.org/ws/rest/occurrence/get?key=415417067
"National Museum of Nature and Science, Japan",Plant specimens of Hokkaido University Museum,,,,,,,SAPS,plant,15733,Specimen,,02:55.0,,,Ranunculus chinensis Bunge,Bunge,Ranunculus chinensis Bunge,Plantae,Magnoliophyta,Magnoliopsida,Ranunculales,Ranunculaceae,Ranunculus,Japan,Japan,,Noboribetsu-cho,,Hokkaido Pref.,Eastern Asia,Japan,,,,,,,,,,,,http://data.gbif.org/occurrences/415417062,http://data.gbif.org/ws/rest/occurrence/get?key=415417062
"National Museum of Nature and Science, Japan",Plant specimens of Hokkaido University Museum,,,,,,,SAPS,plant,15723,Specimen,,02:55.0,,,Ranunculus chinensis Bunge,Bunge,Ranunculus chinensis Bunge,Plantae,Magnoliophyta,Magnoliopsida,Ranunculales,Ranunculaceae,Ranunculus,Japan,Japan,,Mukawa-cho,,Hokkaido Pref.,Eastern Asia,Japan,,,,,,,,,,,,http://data.gbif.org/occurrences/415417052,http://data.gbif.org/ws/rest/occurrence/get?key=415417052
"National Museum of Nature and Science, Japan",Plant specimens of Hokkaido University Museum,,,,,,,SAPS,plant,15730,Specimen,,02:55.0,,,Ranunculus chinensis Bunge,Bunge,Ranunculus chinensis Bunge,Plantae,Magnoliophyta,Magnoliopsida,Ranunculales,Ranunculaceae,Ranunculus,Japan,Japan,,Atsuma-cho,,Hokkaido Pref.,Eastern Asia,Japan,,,,,,,,,,,,http://data.gbif.org/occurrences/415417059,http://data.gbif.org/ws/rest/occurrence/get?key=415417059
"National Museum of Nature and Science, Japan",Plant specimens of Hokkaido University Museum,,,,,,,SAPS,plant,15728,Specimen,,02:55.0,,,Ranunculus chinensis Bunge,Bunge,Ranunculus chinensis Bunge,Plantae,Magnoliophyta,Magnoliopsida,Ranunculales,Ranunculaceae,Ranunculus,Japan,Japan,,Mukawa-cho,,Hokkaido Pref.,Eastern Asia,Japan,,,,,,,,,,,,http://data.gbif.org/occurrences/415417057,http://data.gbif.org/ws/rest/occurrence/get?key=415417057
"National Museum of Nature and Science, Japan",Vascular Plants Collection of Sagamihara City Museum,,,,,,,JSCM,VS,24858,Specimen,,43:56.0,,,Ranunculus chinensis Bunge,Bunge,Ranunculus chinensis Bunge,Plantae,Spermatophyta,,,RANUNCULACEAE,Ranunculus,Japan,Japan,,Minamitsuru-gun,,Yamanashi,Eastern Asia,Japan,,,,,,,,,,,,http://data.gbif.org/occurrences/351228147,http://data.gbif.org/ws/rest/occurrence/get?key=351228147
"National Museum of Nature and Science, Japan",Vascular Plant Specimen Database of Kanagawa Prefectural Museum of Natural History,,,,,,,KPM,NA,KPM-NA0197408,Specimen,,30:06.0,,,Ranunculus chinensis Bunge,,Ranunculus chinensis Bunge,Plantae,Angiospermae,Dicotyledoneae,,RANUNCULACEAE,Ranunculus,Japan,Japan,,Oyama-shi,,Tochigi Prefecture,Eastern Asia,Japan,,,,,,,,,,,,http://data.gbif.org/occurrences/388859066,http://data.gbif.org/ws/rest/occurrence/get?key=388859066
"National Museum of Nature and Science, Japan",Vascular Plant Specimen Database of Kanagawa Prefectural Museum of Natural History,,,,,,,KPM,NA,KPM-NA0197399,Specimen,,30:06.0,,,Ranunculus chinensis Bunge,,Ranunculus chinensis Bunge,Plantae,Angiospermae,Dicotyledoneae,,RANUNCULACEAE,Ranunculus,Japan,Japan,,Oyama-shi,,Tochigi Prefecture,Eastern Asia,Japan,,,,,,,,,,,,http://data.gbif.org/occurrences/388859064,http://data.gbif.org/ws/rest/occurrence/get?key=388859064
"National Museum of Nature and Science, Japan",Vascular Plant Specimen Database of Kanagawa Prefectural Museum of Natural History,,,,,,,KPM,NA,KPM-NA0197641,Specimen,,30:06.0,,,Ranunculus chinensis Bunge,,Ranunculus chinensis Bunge,Plantae,Angiospermae,Dicotyledoneae,,RANUNCULACEAE,Ranunculus,Japan,Japan,,"Kitasaitama-gun,, Kitakawabe-machi",,Saitama Prefecture,Eastern Asia,Japan,,,,,,,,,12,,,http://data.gbif.org/occurrences/388859067,http://data.gbif.org/ws/rest/occurrence/get?key=388859067
