Data Publisher,Dataset,Dataset Rights,Collector name,Collector number,Field number,GUID,Date collected,Institution code,Collection code,Catalogue number,Basis of record,Image url,Last indexed,Identifier,Identification date,Scientific name,Author,Scientific name (interpreted),Kingdom,Phylum,Class,Order,Family,Genus,Country,Country (interpreted),Locality,County,Continent or Ocean,State/Province,Region,Publisher country,Latitude,Longitude,Coordinate precision,Cell id,Centi cell id,Min depth,Max depth,Max depth,Min altitude,Max altitude,Altitude precision,GBIF portal url,GBIF webservice url
GBIF-Sweden,Phanerogamic Botanical Collections (S),,Miyoshi Furuse,,,,00:00.0,S,S-Vascular,S-PL-20197,Specimen,,18:57.0,,,Callianthemum miyabeanum Tatew.,Tatew.,Callianthemum miyabeanum Tatew.,Plantae,,,,,Callianthemum,Japan,Japan,"Japan: Hokkaido, prov.Hidaka, Mt.Apoioroman Samani-mach",,ASIA,,Eastern Asia,Sweden,,,,,,,,,,,,http://data.gbif.org/occurrences/200052710,http://data.gbif.org/ws/rest/occurrence/get?key=200052710
"National Museum of Nature and Science, Japan",Plant specimens of Hokkaido University Museum,,,,,,,SAPS,plant,15602,Specimen,,02:12.0,,,Callianthemum miyabeanum Tatew.,Tatew.,Callianthemum miyabeanum Tatew.,Plantae,Magnoliophyta,Magnoliopsida,Ranunculales,Ranunculaceae,Callianthemum,Japan,Japan,,Samani-cho,,Hokkaido Pref.,Eastern Asia,Japan,,,,,,,,,,,,http://data.gbif.org/occurrences/415412085,http://data.gbif.org/ws/rest/occurrence/get?key=415412085
"National Museum of Nature and Science, Japan",Plant specimens of Hokkaido University Museum,,,,,,,SAPS,plant,15598,Specimen,,02:12.0,,,Callianthemum miyabeanum Tatew.,Tatew.,Callianthemum miyabeanum Tatew.,Plantae,Magnoliophyta,Magnoliopsida,Ranunculales,Ranunculaceae,Callianthemum,Japan,Japan,,Samani-mura,,Hokkaido Pref.,Eastern Asia,Japan,,,,,,,,,,,,http://data.gbif.org/occurrences/415412081,http://data.gbif.org/ws/rest/occurrence/get?key=415412081
"National Museum of Nature and Science, Japan",Plant specimens of Hokkaido University Museum,,,,,,,SAPS,plant,15605,Specimen,,02:12.0,,,Callianthemum miyabeanum Tatew.,Tatew.,Callianthemum miyabeanum Tatew.,Plantae,Magnoliophyta,Magnoliopsida,Ranunculales,Ranunculaceae,Callianthemum,Japan,Japan,,Samani-mura,,Hokkaido Pref.,Eastern Asia,Japan,,,,,,,,,,,,http://data.gbif.org/occurrences/415412087,http://data.gbif.org/ws/rest/occurrence/get?key=415412087
"National Museum of Nature and Science, Japan",Plant specimens of Hokkaido University Museum,,,,,,,SAPS,plant,15599,Specimen,,02:12.0,,,Callianthemum miyabeanum Tatew.,Tatew.,Callianthemum miyabeanum Tatew.,Plantae,Magnoliophyta,Magnoliopsida,Ranunculales,Ranunculaceae,Callianthemum,Japan,Japan,,Samani-mura,,Hokkaido Pref.,Eastern Asia,Japan,,,,,,,,,,,,http://data.gbif.org/occurrences/415412082,http://data.gbif.org/ws/rest/occurrence/get?key=415412082
"National Museum of Nature and Science, Japan",Plant specimens of Hokkaido University Museum,,,,,,,SAPS,plant,15597,Specimen,,02:12.0,,,Callianthemum miyabeanum Tatew.,Tatew.,Callianthemum miyabeanum Tatew.,Plantae,Magnoliophyta,Magnoliopsida,Ranunculales,Ranunculaceae,Callianthemum,Japan,Japan,,Samani-mura,,Hokkaido Pref.,Eastern Asia,Japan,,,,,,,,,,,,http://data.gbif.org/occurrences/415412080,http://data.gbif.org/ws/rest/occurrence/get?key=415412080
"National Museum of Nature and Science, Japan",Plant specimens of Hokkaido University Museum,,,,,,,SAPS,plant,15592,Specimen,,02:12.0,,,Callianthemum miyabeanum Tatew.,Tatew.,Callianthemum miyabeanum Tatew.,Plantae,Magnoliophyta,Magnoliopsida,Ranunculales,Ranunculaceae,Callianthemum,Japan,Japan,,Samani-mura,,Hokkaido Pref.,Eastern Asia,Japan,,,,,,,,,,,,http://data.gbif.org/occurrences/415412077,http://data.gbif.org/ws/rest/occurrence/get?key=415412077
"National Museum of Nature and Science, Japan",Plant specimens of Hokkaido University Museum,,,,,,,SAPS,plant,15594,Specimen,,02:11.0,,,Callianthemum miyabeanum Tatew.,Tatew.,Callianthemum miyabeanum Tatew.,Plantae,Magnoliophyta,Magnoliopsida,Ranunculales,Ranunculaceae,Callianthemum,Japan,Japan,,Samani-mura,,Hokkaido Pref.,Eastern Asia,Japan,,,,,,,,,,,,http://data.gbif.org/occurrences/415411827,http://data.gbif.org/ws/rest/occurrence/get?key=415411827
"National Museum of Nature and Science, Japan",Plant specimens of Hokkaido University Museum,,,,,,,SAPS,plant,15600,Specimen,,02:12.0,,,Callianthemum miyabeanum Tatew.,Tatew.,Callianthemum miyabeanum Tatew.,Plantae,Magnoliophyta,Magnoliopsida,Ranunculales,Ranunculaceae,Callianthemum,Japan,Japan,,Samani-mura,,Hokkaido Pref.,Eastern Asia,Japan,,,,,,,,,,,,http://data.gbif.org/occurrences/415412083,http://data.gbif.org/ws/rest/occurrence/get?key=415412083
"National Museum of Nature and Science, Japan",Plant specimens of Hokkaido University Museum,,,,,,,SAPS,plant,15593,Specimen,,02:12.0,,,Callianthemum miyabeanum Tatew.,Tatew.,Callianthemum miyabeanum Tatew.,Plantae,Magnoliophyta,Magnoliopsida,Ranunculales,Ranunculaceae,Callianthemum,Japan,Japan,,Samani-cho,,Hokkaido Pref.,Eastern Asia,Japan,,,,,,,,,,,,http://data.gbif.org/occurrences/415412078,http://data.gbif.org/ws/rest/occurrence/get?key=415412078
"National Museum of Nature and Science, Japan",Plant specimens of Hokkaido University Museum,,,,,,,SAPS,plant,15596,Specimen,,02:12.0,,,Callianthemum miyabeanum Tatew.,Tatew.,Callianthemum miyabeanum Tatew.,Plantae,Magnoliophyta,Magnoliopsida,Ranunculales,Ranunculaceae,Callianthemum,Japan,Japan,,Samani-mura,,Hokkaido Pref.,Eastern Asia,Japan,,,,,,,,,,,,http://data.gbif.org/occurrences/415412079,http://data.gbif.org/ws/rest/occurrence/get?key=415412079
"National Museum of Nature and Science, Japan",Plant specimens of Hokkaido University Museum,,,,,,,SAPS,plant,15604,Specimen,,02:12.0,,,Callianthemum miyabeanum Tatew.,Tatew.,Callianthemum miyabeanum Tatew.,Plantae,Magnoliophyta,Magnoliopsida,Ranunculales,Ranunculaceae,Callianthemum,Japan,Japan,,Samani-cho,,Hokkaido Pref.,Eastern Asia,Japan,,,,,,,,,,,,http://data.gbif.org/occurrences/415412086,http://data.gbif.org/ws/rest/occurrence/get?key=415412086
"National Museum of Nature and Science, Japan",Plant specimens of Hokkaido University Museum,,,,,,,SAPS,plant,15601,Specimen,,02:12.0,,,Callianthemum miyabeanum Tatew.,Tatew.,Callianthemum miyabeanum Tatew.,Plantae,Magnoliophyta,Magnoliopsida,Ranunculales,Ranunculaceae,Callianthemum,Japan,Japan,,Samani-mura,,Hokkaido Pref.,Eastern Asia,Japan,,,,,,,,,,,,http://data.gbif.org/occurrences/415412084,http://data.gbif.org/ws/rest/occurrence/get?key=415412084
"National Museum of Nature and Science, Japan","Plant specimens depodited in Osaka Museum of Natural History, Japan.",,,,,,,OSA,C,OSA36475,Specimen,,16:50.0,,,Callianthemum insigne Nakai var. miyabeanum (Takewaki) Kitam.,Nakai,Callianthemum insigne var. miyabeanum (Takewaki) Kitam.,Plantae,,,,Asteraceae,Callianthemum,Japan,Japan,Mt. Apoi-dake,Hidaka-koku,,Hokkaido Prefecture,Eastern Asia,Japan,,,,,,,,,,,,http://data.gbif.org/occurrences/295114986,http://data.gbif.org/ws/rest/occurrence/get?key=295114986
