Data Publisher,Dataset,Dataset Rights,Collector name,Collector number,Field number,GUID,Date collected,Institution code,Collection code,Catalogue number,Basis of record,Image url,Last indexed,Identifier,Identification date,Scientific name,Author,Scientific name (interpreted),Kingdom,Phylum,Class,Order,Family,Genus,Country,Country (interpreted),Locality,County,Continent or Ocean,State/Province,Region,Publisher country,Latitude,Longitude,Coordinate precision,Cell id,Centi cell id,Min depth,Max depth,Max depth,Min altitude,Max altitude,Altitude precision,GBIF portal url,GBIF webservice url
"National Institute of Genetics, ROIS","Herbarium Specimens of Museum of Nature and Human Activities, Hyogo Pref., Japan",,,,,,,HYO,VP,C1-049972,Specimen,,25:37.0,,,Aconitum sanyoense,,Aconitum sanyoense,Plantae,Magnoliophyta,,,Ranunculaceae,Aconitum,Japan,Japan,"Hyogo-ken: Yabu-gun, Yohka-cho, Mt.Myoken.",,,Hyogo,Eastern Asia,Japan,,,,,,,,,,,,http://data.gbif.org/occurrences/323517552,http://data.gbif.org/ws/rest/occurrence/get?key=323517552
"National Institute of Genetics, ROIS","Herbarium Specimens of Museum of Nature and Human Activities, Hyogo Pref., Japan",,,,,,,HYO,VP,C1-067756,Specimen,,27:08.0,T.Fujii,,Aconitum sanyoense,,Aconitum sanyoense,Plantae,Magnoliophyta,,,Ranunculaceae,Aconitum,Japan,Japan,"Pref.Ishikawa,Mt.Hakusan",,,Ishikawa,Eastern Asia,Japan,134.634,35.4689,,,,,,,1500,2100,,http://data.gbif.org/occurrences/323526496,http://data.gbif.org/ws/rest/occurrence/get?key=323526496
"National Institute of Genetics, ROIS","Herbarium Specimens of Museum of Nature and Human Activities, Hyogo Pref., Japan",,,,,,,HYO,VP,C1-172165,Specimen,,19:37.0,,,Aconitum sanyoense,,Aconitum sanyoense,Plantae,Magnoliophyta,,,Ranunculaceae,Aconitum,Japan,Japan,"Hyogo Pref.; Mihara-gun, Seidan-cho, Matsuho",,,Hyogo,Eastern Asia,Japan,,,,,,,,,,,,http://data.gbif.org/occurrences/323470063,http://data.gbif.org/ws/rest/occurrence/get?key=323470063
"National Institute of Genetics, ROIS","Herbarium Specimens of Museum of Nature and Human Activities, Hyogo Pref., Japan",,,,,,,HYO,VP,C1-018632,Specimen,,23:39.0,,,Aconitum sanyoense,,Aconitum sanyoense,Plantae,Magnoliophyta,,,Ranunculaceae,Aconitum,Japan,Japan,"HONSHU. Pref.Hyogo: Mt.Ougino-sen, Mikata-gun.",,,Hyogo,Eastern Asia,Japan,,,,,,,,,,,,http://data.gbif.org/occurrences/323506628,http://data.gbif.org/ws/rest/occurrence/get?key=323506628
"National Institute of Genetics, ROIS","Herbarium Specimens of Museum of Nature and Human Activities, Hyogo Pref., Japan",,,,,,,HYO,VP,C1-005350,Specimen,,25:26.0,,,Aconitum sanyoense,,Aconitum sanyoense,Plantae,Magnoliophyta,,,Ranunculaceae,Aconitum,Japan,Japan,"Hyogo Pref.; Yabu-gun, Ohya-cho, Yokoyuki.",,,Hyogo,Eastern Asia,Japan,134.567,35.3,,,,,,,,,,http://data.gbif.org/occurrences/323516408,http://data.gbif.org/ws/rest/occurrence/get?key=323516408
"National Institute of Genetics, ROIS","Herbarium Specimens of Museum of Nature and Human Activities, Hyogo Pref., Japan",,,,,,,HYO,VP,C1-066620,Specimen,,27:22.0,M.Hashimoto,,Aconitum sanyoense,,Aconitum sanyoense,Plantae,Magnoliophyta,,,Ranunculaceae,Aconitum,Japan,Japan,"Pref.Ishikawa,Mt.Hakusan,Saboshindo",,,Ishikawa,Eastern Asia,Japan,134.634,35.4689,,,,,,,1500,1500,,http://data.gbif.org/occurrences/323527726,http://data.gbif.org/ws/rest/occurrence/get?key=323527726
"National Institute of Genetics, ROIS","Herbarium Specimens of Museum of Nature and Human Activities, Hyogo Pref., Japan",,,,,,,HYO,VP,C1-171462,Specimen,,20:29.0,,,Aconitum sanyoense,,Aconitum sanyoense,Plantae,Magnoliophyta,,,Ranunculaceae,Aconitum,Japan,Japan,"Hyogo Pref.; Mihara-gun, Seidan-cho, Matsuho",,,Hyogo,Eastern Asia,Japan,134.633,35.4333,,,,,,,800,1000,,http://data.gbif.org/occurrences/323479509,http://data.gbif.org/ws/rest/occurrence/get?key=323479509
"National Institute of Genetics, ROIS","Herbarium Specimens of Museum of Nature and Human Activities, Hyogo Pref., Japan",,,,,,,HYO,VP,C1-125240,Specimen,,25:33.0,,,Aconitum sanyoense,,Aconitum sanyoense,Plantae,Magnoliophyta,,,Ranunculaceae,Aconitum,Japan,Japan,"Hyogo Pref.; Yabu-gun, Yohka-cho, Ishihara.",,,Hyogo,Eastern Asia,Japan,134.7,35.4,,,,,,,200,400,,http://data.gbif.org/occurrences/323517108,http://data.gbif.org/ws/rest/occurrence/get?key=323517108
"National Institute of Genetics, ROIS","Herbarium Specimens of Museum of Nature and Human Activities, Hyogo Pref., Japan",,,,,,,HYO,VP,C1-068499,Specimen,,27:00.0,T.Fujii,,Aconitum sanyoense,,Aconitum sanyoense,Plantae,Magnoliophyta,,,Ranunculaceae,Aconitum,Japan,Japan,"Pref.Hyogo;from Sonae to Akioka,Mikata-cho, Mikata-gun",,,Hyogo,Eastern Asia,Japan,134.518,35.3856,,,,,,,500,700,,http://data.gbif.org/occurrences/323525647,http://data.gbif.org/ws/rest/occurrence/get?key=323525647
"National Institute of Genetics, ROIS","Herbarium Specimens of Museum of Nature and Human Activities, Hyogo Pref., Japan",,,,,,,HYO,VP,C1-068500,Specimen,,27:00.0,T.Fujii,,Aconitum sanyoense,,Aconitum sanyoense,Plantae,Magnoliophyta,,,Ranunculaceae,Aconitum,Japan,Japan,"Pref.Hyogo;from Sonae to Akioka,Mikata-cho, Mikata-gun",,,Hyogo,Eastern Asia,Japan,134.518,35.3856,,,,,,,500,700,,http://data.gbif.org/occurrences/323525648,http://data.gbif.org/ws/rest/occurrence/get?key=323525648
"National Institute of Genetics, ROIS","Herbarium Specimens of Museum of Nature and Human Activities, Hyogo Pref., Japan",,,,,,,HYO,VP,C1-167852,Specimen,,25:00.0,,,Aconitum sanyoense,,Aconitum sanyoense,Plantae,Magnoliophyta,,,Ranunculaceae,Aconitum,Japan,Japan,"Hyogo Pref.; Mikata-gun, Onsen-cho, Mt.Ouginosen-Kirigataki.",,,Hyogo,Eastern Asia,Japan,134.467,35.45,,,,,,,,,,http://data.gbif.org/occurrences/323513793,http://data.gbif.org/ws/rest/occurrence/get?key=323513793
"National Institute of Genetics, ROIS","Herbarium Specimens of Museum of Nature and Human Activities, Hyogo Pref., Japan",,,,,,,HYO,VP,C1-167783,Specimen,,25:03.0,,,Aconitum sanyoense,,Aconitum sanyoense,Plantae,Magnoliophyta,,,Ranunculaceae,Aconitum,Japan,Japan,"Hyogo Pref.; Myouken, Muraoka-cho, Mikata-gun.",,,Hyogo,Eastern Asia,Japan,134.667,35.4167,,,,,,,,,,http://data.gbif.org/occurrences/323514064,http://data.gbif.org/ws/rest/occurrence/get?key=323514064
"National Institute of Genetics, ROIS","Herbarium Specimens of Museum of Nature and Human Activities, Hyogo Pref., Japan",,,,,,,HYO,VP,C1-007390,Specimen,,24:35.0,,,Aconitum sanyoense,,Aconitum sanyoense,Plantae,Magnoliophyta,,,Ranunculaceae,Aconitum,Japan,Japan,Hyogo Pref.; Hyonosen.,,,Hyogo,Eastern Asia,Japan,,,,,,,,,,,,http://data.gbif.org/occurrences/323511517,http://data.gbif.org/ws/rest/occurrence/get?key=323511517
"National Institute of Genetics, ROIS","Herbarium Specimens of Museum of Nature and Human Activities, Hyogo Pref., Japan",,,,,,,HYO,VP,C1-172160,Specimen,,19:37.0,,,Aconitum sanyoense,,Aconitum sanyoense,Plantae,Magnoliophyta,,,Ranunculaceae,Aconitum,Japan,Japan,"Hyogo Pref.; Mihara-gun, Seidan-cho, Matsuho",,,Hyogo,Eastern Asia,Japan,,,,,,,,,,,,http://data.gbif.org/occurrences/323470039,http://data.gbif.org/ws/rest/occurrence/get?key=323470039
"National Museum of Nature and Science, Japan","Plant specimens depodited in Osaka Museum of Natural History, Japan.",,,,,,,OSA,C,OSA14242,Specimen,,14:54.0,,,Aconitum sanyoense Nak.,Nak.,Aconitum sanyoense Nak.,Plantae,,,,Ranunculaeae,Aconitum,Japan,Japan,Mt. Hyono-sen,Yabu-gun,,Hyogo Prefecture,Eastern Asia,Japan,,,,,,,,,,,,http://data.gbif.org/occurrences/295102047,http://data.gbif.org/ws/rest/occurrence/get?key=295102047
"National Museum of Nature and Science, Japan","Plant specimens depodited in Osaka Museum of Natural History, Japan.",,,,,,,OSA,C,OSA4957,Specimen,,14:54.0,,,Aconitum sanyoense Nak.,Nak.,Aconitum sanyoense Nak.,Plantae,,,,Ranunculaeae,Aconitum,Japan,Japan,"Shodo-shima Island, Kanka-kei valley",,,Kagawa Prefecture,Eastern Asia,Japan,,,,,,,,,,,,http://data.gbif.org/occurrences/295101969,http://data.gbif.org/ws/rest/occurrence/get?key=295101969
"National Museum of Nature and Science, Japan","Gunma Museum of Natural History, Vascular Plant Specimen",,,,,,,GMNHJ,Plant,BS0032907,Specimen,,34:01.0,,,Aconitum sanyoense Nakai,Nakai,Aconitum sanyoense Nakai,Plantae,Spermatophyta,Dicotyledoneae,,Ranunculaceae,Aconitum,Japan,Japan,"Ishizu,Imai",Agatsuma-gun Tsumagoimura,,Gunma,Eastern Asia,Japan,36.5644,138.557,,45678,55,,,,,,,http://data.gbif.org/occurrences/234489308,http://data.gbif.org/ws/rest/occurrence/get?key=234489308
"National Museum of Nature and Science, Japan","Gunma Museum of Natural History, Vascular Plant Specimen",,,,,,,GMNHJ,plant,BS0034304,Specimen,,34:01.0,,,Aconitum sanyoense Nakai,Nakai,Aconitum sanyoense Nakai,Plantae,Spermatophyta,Dicotyledoneae,,Ranunculaceae,Aconitum,Japan,Japan,"Mt. Akaguna,Kamihino",Fujioka-shi,,Gunma,Eastern Asia,Japan,36.1447,138.843,,45678,18,,,,,,,http://data.gbif.org/occurrences/295231423,http://data.gbif.org/ws/rest/occurrence/get?key=295231423
"National Museum of Nature and Science, Japan","Gunma Museum of Natural History, Vascular Plant Specimen",,,,,,,GMNHJ,plant,BS0036241,Specimen,,34:03.0,,,Aconitum sanyoense Nakai,Nakai,Aconitum sanyoense Nakai,Plantae,Spermatophyta,Dicotyledoneae,,Ranunculaceae,Aconitum,Japan,Japan,"Kannagawa-genryu-iki,Narahara",Tano-gun Uenomura,,Gunma,Eastern Asia,Japan,,,,,,,,,1290,1290,,http://data.gbif.org/occurrences/394050265,http://data.gbif.org/ws/rest/occurrence/get?key=394050265
"National Museum of Nature and Science, Japan","Herbarium Specimens of Museum of Nature and Human Activities, Hyogo Prefecture, Japan",,,,,,,HYO,HYO-C,C1-172160,Specimen,,23:57.0,,,Aconitum sanyoense Nakai,Nakai,Aconitum sanyoense Nakai,Plantae,Magnoliophyta,Magnoliopsida,Ranunculales,Ranunculaceae,Aconitum,Japan,Japan,,,,Hyogo,Eastern Asia,Japan,,,,,,,,,,,,http://data.gbif.org/occurrences/177340337,http://data.gbif.org/ws/rest/occurrence/get?key=177340337
"National Museum of Nature and Science, Japan","Herbarium Specimens of Museum of Nature and Human Activities, Hyogo Prefecture, Japan",,,,,,,HYO,HYO-C,C1-049972,Specimen,,23:57.0,,,Aconitum sanyoense Nakai,Nakai,Aconitum sanyoense Nakai,Plantae,Magnoliophyta,Magnoliopsida,Ranunculales,Ranunculaceae,Aconitum,Japan,Japan,,,,Hyogo,Eastern Asia,Japan,,,,,,,,,,,,http://data.gbif.org/occurrences/177340328,http://data.gbif.org/ws/rest/occurrence/get?key=177340328
"National Museum of Nature and Science, Japan","Herbarium Specimens of Museum of Nature and Human Activities, Hyogo Prefecture, Japan",,,,,,,HYO,HYO-C,C1-007390,Specimen,,23:57.0,,,Aconitum sanyoense Nakai,Nakai,Aconitum sanyoense Nakai,Plantae,Magnoliophyta,Magnoliopsida,Ranunculales,Ranunculaceae,Aconitum,Japan,Japan,,,,Hyogo,Eastern Asia,Japan,,,,,,,,,,,,http://data.gbif.org/occurrences/177340326,http://data.gbif.org/ws/rest/occurrence/get?key=177340326
"National Museum of Nature and Science, Japan","Herbarium Specimens of Museum of Nature and Human Activities, Hyogo Prefecture, Japan",,,,,,,HYO,HYO-C,C1-068500,Specimen,,23:57.0,,,Aconitum sanyoense Nakai,Nakai,Aconitum sanyoense Nakai,Plantae,Magnoliophyta,Magnoliopsida,Ranunculales,Ranunculaceae,Aconitum,Japan,Japan,,,,Hyogo,Eastern Asia,Japan,,,,,,,,,500,700,,http://data.gbif.org/occurrences/177340332,http://data.gbif.org/ws/rest/occurrence/get?key=177340332
"National Museum of Nature and Science, Japan","Herbarium Specimens of Museum of Nature and Human Activities, Hyogo Prefecture, Japan",,,,,,,HYO,HYO-C,C1-171462,Specimen,,23:57.0,,,Aconitum sanyoense Nakai,Nakai,Aconitum sanyoense Nakai,Plantae,Magnoliophyta,Magnoliopsida,Ranunculales,Ranunculaceae,Aconitum,Japan,Japan,,,,Hyogo,Eastern Asia,Japan,,,,,,,,,800,1000,,http://data.gbif.org/occurrences/177340336,http://data.gbif.org/ws/rest/occurrence/get?key=177340336
"National Museum of Nature and Science, Japan","Herbarium Specimens of Museum of Nature and Human Activities, Hyogo Prefecture, Japan",,,,,,,HYO,HYO-C,C1-067756,Specimen,,23:57.0,,,Aconitum sanyoense Nakai,Nakai,Aconitum sanyoense Nakai,Plantae,Magnoliophyta,Magnoliopsida,Ranunculales,Ranunculaceae,Aconitum,Japan,Japan,,,,Ishikawa,Eastern Asia,Japan,,,,,,,,,1500,2100,,http://data.gbif.org/occurrences/177340330,http://data.gbif.org/ws/rest/occurrence/get?key=177340330
"National Museum of Nature and Science, Japan","Herbarium Specimens of Museum of Nature and Human Activities, Hyogo Prefecture, Japan",,,,,,,HYO,HYO-C,C1-018632,Specimen,,23:57.0,,,Aconitum sanyoense Nakai,Nakai,Aconitum sanyoense Nakai,Plantae,Magnoliophyta,Magnoliopsida,Ranunculales,Ranunculaceae,Aconitum,Japan,Japan,,,,Hyogo,Eastern Asia,Japan,,,,,,,,,,,,http://data.gbif.org/occurrences/177340327,http://data.gbif.org/ws/rest/occurrence/get?key=177340327
"National Museum of Nature and Science, Japan","Herbarium Specimens of Museum of Nature and Human Activities, Hyogo Prefecture, Japan",,,,,,,HYO,HYO-C,C1-068499,Specimen,,23:57.0,,,Aconitum sanyoense Nakai,Nakai,Aconitum sanyoense Nakai,Plantae,Magnoliophyta,Magnoliopsida,Ranunculales,Ranunculaceae,Aconitum,Japan,Japan,,,,Hyogo,Eastern Asia,Japan,,,,,,,,,500,700,,http://data.gbif.org/occurrences/177340331,http://data.gbif.org/ws/rest/occurrence/get?key=177340331
"National Museum of Nature and Science, Japan","Herbarium Specimens of Museum of Nature and Human Activities, Hyogo Prefecture, Japan",,,,,,,HYO,HYO-C,C1-167783,Specimen,,23:57.0,,,Aconitum sanyoense Nakai,Nakai,Aconitum sanyoense Nakai,Plantae,Magnoliophyta,Magnoliopsida,Ranunculales,Ranunculaceae,Aconitum,Japan,Japan,,,,Hyogo,Eastern Asia,Japan,,,,,,,,,,,,http://data.gbif.org/occurrences/177340334,http://data.gbif.org/ws/rest/occurrence/get?key=177340334
"National Museum of Nature and Science, Japan","Herbarium Specimens of Museum of Nature and Human Activities, Hyogo Prefecture, Japan",,,,,,,HYO,HYO-C,C1-167852,Specimen,,23:57.0,,,Aconitum sanyoense Nakai,Nakai,Aconitum sanyoense Nakai,Plantae,Magnoliophyta,Magnoliopsida,Ranunculales,Ranunculaceae,Aconitum,Japan,Japan,,,,Hyogo,Eastern Asia,Japan,,,,,,,,,,,,http://data.gbif.org/occurrences/177340335,http://data.gbif.org/ws/rest/occurrence/get?key=177340335
"National Museum of Nature and Science, Japan","Herbarium Specimens of Museum of Nature and Human Activities, Hyogo Prefecture, Japan",,,,,,,HYO,HYO-C,C1-192566,Specimen,,23:57.0,,,Aconitum sanyoense Nakai,Nakai,Aconitum sanyoense Nakai,Plantae,,,,Ranunculaceae,Aconitum,Japan,Japan,,,,Hyogo,Eastern Asia,Japan,,,,,,,,,,,,http://data.gbif.org/occurrences/177340339,http://data.gbif.org/ws/rest/occurrence/get?key=177340339
"National Museum of Nature and Science, Japan","Herbarium Specimens of Museum of Nature and Human Activities, Hyogo Prefecture, Japan",,,,,,,HYO,HYO-C,C1-172165,Specimen,,23:57.0,,,Aconitum sanyoense Nakai,Nakai,Aconitum sanyoense Nakai,Plantae,Magnoliophyta,Magnoliopsida,Ranunculales,Ranunculaceae,Aconitum,Japan,Japan,,,,Hyogo,Eastern Asia,Japan,,,,,,,,,,,,http://data.gbif.org/occurrences/177340338,http://data.gbif.org/ws/rest/occurrence/get?key=177340338
"National Museum of Nature and Science, Japan","Herbarium Specimens of Museum of Nature and Human Activities, Hyogo Prefecture, Japan",,,,,,,HYO,HYO-C,C1-005350,Specimen,,23:57.0,,,Aconitum sanyoense Nakai,Nakai,Aconitum sanyoense Nakai,Plantae,Magnoliophyta,Magnoliopsida,Ranunculales,Ranunculaceae,Aconitum,Japan,Japan,,,,Hyogo,Eastern Asia,Japan,,,,,,,,,,,,http://data.gbif.org/occurrences/177340325,http://data.gbif.org/ws/rest/occurrence/get?key=177340325
"National Museum of Nature and Science, Japan","Herbarium Specimens of Museum of Nature and Human Activities, Hyogo Prefecture, Japan",,,,,,,HYO,HYO-C,C1-066620,Specimen,,23:57.0,,,Aconitum sanyoense Nakai,Nakai,Aconitum sanyoense Nakai,Plantae,Magnoliophyta,Magnoliopsida,Ranunculales,Ranunculaceae,Aconitum,Japan,Japan,,,,Ishikawa,Eastern Asia,Japan,,,,,,,,,1500,,,http://data.gbif.org/occurrences/177340329,http://data.gbif.org/ws/rest/occurrence/get?key=177340329
"National Museum of Nature and Science, Japan","Herbarium Specimens of Museum of Nature and Human Activities, Hyogo Prefecture, Japan",,,,,,,HYO,HYO-C,C1-125240,Specimen,,23:57.0,,,Aconitum sanyoense Nakai,Nakai,Aconitum sanyoense Nakai,Plantae,Magnoliophyta,Magnoliopsida,Ranunculales,Ranunculaceae,Aconitum,Japan,Japan,,,,Hyogo,Eastern Asia,Japan,,,,,,,,,200,400,,http://data.gbif.org/occurrences/177340333,http://data.gbif.org/ws/rest/occurrence/get?key=177340333
"National Institute of Genetics, ROIS","Plant Specimen Database of Tama Forest Science Garden, Forestry and Forest Products Research Institute, Japan",,,,,,,FFPRI,TFA,29600,Specimen,,25:32.0,,,Aconitum sanyoense Nakai,,Aconitum sanyoense Nakai,Plantae,Magnoliophyta,Magnoliopsida,Ranunculales,Ranunculaceae,Aconitum,Japan,Japan,Misakubo National Forest,"Hamamatu City, Tenryu Ward",,Sizuoka Prefecture,Eastern Asia,Japan,,,,,,,,,,,,http://data.gbif.org/occurrences/360272900,http://data.gbif.org/ws/rest/occurrence/get?key=360272900
"National Institute of Genetics, ROIS","Plant Specimen Database of Tama Forest Science Garden, Forestry and Forest Products Research Institute, Japan",,,,,,,FFPRI,TFA,29601,Specimen,,25:32.0,,,Aconitum sanyoense Nakai,,Aconitum sanyoense Nakai,Plantae,Magnoliophyta,Magnoliopsida,Ranunculales,Ranunculaceae,Aconitum,Japan,Japan,Misakubo National Forest,"Hamamatu City, Tenryu Ward",,Sizuoka Prefecture,Eastern Asia,Japan,,,,,,,,,,,,http://data.gbif.org/occurrences/360272901,http://data.gbif.org/ws/rest/occurrence/get?key=360272901
"National Museum of Nature and Science, Japan",Plant Specimens of Kurashiki Museum of Natural History,,,,,,,KURA,KURA,15071,Specimen,,11:28.0,,,Aconitum sanyoense Nakai,Nakai,Aconitum sanyoense Nakai,Plantae,,,Ranunculales,Ranunculaceae,Aconitum,Japan,Japan,,Niimi-shi,,Okayama,Eastern Asia,Japan,,,,,,,,,,,,http://data.gbif.org/occurrences/395733765,http://data.gbif.org/ws/rest/occurrence/get?key=395733765
"National Museum of Nature and Science, Japan",Plant Specimens of Kurashiki Museum of Natural History,,,,,,,KURA,KURA,36957,Specimen,,11:28.0,,,Aconitum sanyoense Nakai,Nakai,Aconitum sanyoense Nakai,Plantae,,,Ranunculales,Ranunculaceae,Aconitum,Japan,Japan,,Nagi-cho,,Okayama,Eastern Asia,Japan,,,,,,,,,,,,http://data.gbif.org/occurrences/395733817,http://data.gbif.org/ws/rest/occurrence/get?key=395733817
"National Museum of Nature and Science, Japan",Plant Specimens of Kurashiki Museum of Natural History,,,,,,,KURA,KURA,62625,Specimen,,11:28.0,,,Aconitum sanyoense Nakai,Nakai,Aconitum sanyoense Nakai,Plantae,,,Ranunculales,Ranunculaceae,Aconitum,Japan,Japan,,Shinjo-son,,Okayama,Eastern Asia,Japan,,,,,,,,,,,,http://data.gbif.org/occurrences/395733859,http://data.gbif.org/ws/rest/occurrence/get?key=395733859
"National Museum of Nature and Science, Japan",Plant Specimens of Kurashiki Museum of Natural History,,,,,,,KURA,KURA,10985,Specimen,,11:28.0,,,Aconitum sanyoense Nakai,Nakai,Aconitum sanyoense Nakai,Plantae,,,Ranunculales,Ranunculaceae,Aconitum,Japan,Japan,,Kagamino-cho,,Okayama,Eastern Asia,Japan,,,,,,,,,,,,http://data.gbif.org/occurrences/395733761,http://data.gbif.org/ws/rest/occurrence/get?key=395733761
"National Museum of Nature and Science, Japan",Plant Specimens of Kurashiki Museum of Natural History,,,,,,,KURA,KURA,55885,Specimen,,11:28.0,,,Aconitum sanyoense Nakai,Nakai,Aconitum sanyoense Nakai,Plantae,,,Ranunculales,Ranunculaceae,Aconitum,Japan,Japan,,Shinjo-son,,Okayama,Eastern Asia,Japan,,,,,,,,,,,,http://data.gbif.org/occurrences/395733834,http://data.gbif.org/ws/rest/occurrence/get?key=395733834
"National Museum of Nature and Science, Japan",Plant Specimens of Kurashiki Museum of Natural History,,,,,,,KURA,KURA,120291,Specimen,,11:29.0,,,Aconitum sanyoense Nakai,Nakai,Aconitum sanyoense Nakai,Plantae,,,Ranunculales,Ranunculaceae,Aconitum,Japan,Japan,,Shoboku-cho,,Okayama,Eastern Asia,Japan,,,,,,,,,,,,http://data.gbif.org/occurrences/395734089,http://data.gbif.org/ws/rest/occurrence/get?key=395734089
"National Museum of Nature and Science, Japan",Plant Specimens of Kurashiki Museum of Natural History,,,,,,,KURA,KURA,155498,Specimen,,11:30.0,,,Aconitum sanyoense Nakai,Nakai,Aconitum sanyoense Nakai,Plantae,,,Ranunculales,Ranunculaceae,Aconitum,Japan,Japan,,Shoboku-cho,,Okayama,Eastern Asia,Japan,,,,,,,,,,,,http://data.gbif.org/occurrences/395734199,http://data.gbif.org/ws/rest/occurrence/get?key=395734199
"National Museum of Nature and Science, Japan",Plant Specimens of Kurashiki Museum of Natural History,,,,,,,KURA,KURA,60237,Specimen,,11:28.0,,,Aconitum sanyoense Nakai,Nakai,Aconitum sanyoense Nakai,Plantae,,,Ranunculales,Ranunculaceae,Aconitum,Japan,Japan,,Kagamino-cho,,Okayama,Eastern Asia,Japan,,,,,,,,,,,,http://data.gbif.org/occurrences/395733855,http://data.gbif.org/ws/rest/occurrence/get?key=395733855
"National Museum of Nature and Science, Japan",Plant Specimens of Kurashiki Museum of Natural History,,,,,,,KURA,KURA,36027,Specimen,,11:28.0,,,Aconitum sanyoense Nakai,Nakai,Aconitum sanyoense Nakai,Plantae,,,Ranunculales,Ranunculaceae,Aconitum,Japan,Japan,,Nagi-cho,,Okayama,Eastern Asia,Japan,,,,,,,,,,,,http://data.gbif.org/occurrences/395733813,http://data.gbif.org/ws/rest/occurrence/get?key=395733813
"National Museum of Nature and Science, Japan",Plant Specimens of Kurashiki Museum of Natural History,,,,,,,KURA,KURA,70679,Specimen,,11:29.0,,,Aconitum sanyoense Nakai,Nakai,Aconitum sanyoense Nakai,Plantae,,,Ranunculales,Ranunculaceae,Aconitum,Japan,Japan,,Kawakami-son,,Okayama,Eastern Asia,Japan,,,,,,,,,,,,http://data.gbif.org/occurrences/395733934,http://data.gbif.org/ws/rest/occurrence/get?key=395733934
"National Museum of Nature and Science, Japan",Plant Specimens of Kurashiki Museum of Natural History,,,,,,,KURA,KURA,86268,Specimen,,11:29.0,,,Aconitum sanyoense Nakai,Nakai,Aconitum sanyoense Nakai,Plantae,,,Ranunculales,Ranunculaceae,Aconitum,Japan,Japan,,Shinjo-son,,Okayama,Eastern Asia,Japan,,,,,,,,,,,,http://data.gbif.org/occurrences/395733967,http://data.gbif.org/ws/rest/occurrence/get?key=395733967
"National Museum of Nature and Science, Japan",Plant Specimens of Kurashiki Museum of Natural History,,,,,,,KURA,KURA,115411,Specimen,,11:29.0,,,Aconitum sanyoense Nakai,Nakai,Aconitum sanyoense Nakai,Plantae,,,Ranunculales,Ranunculaceae,Aconitum,Japan,Japan,,Kagamino-cho,,Okayama,Eastern Asia,Japan,,,,,,,,,,,,http://data.gbif.org/occurrences/395734066,http://data.gbif.org/ws/rest/occurrence/get?key=395734066
"National Museum of Nature and Science, Japan",Plant Specimens of Kurashiki Museum of Natural History,,,,,,,KURA,KURA,15065,Specimen,,11:28.0,,,Aconitum sanyoense Nakai,Nakai,Aconitum sanyoense Nakai,Plantae,,,Ranunculales,Ranunculaceae,Aconitum,Japan,Japan,,Kamisaibara-son,,Okayama,Eastern Asia,Japan,,,,,,,,,,,,http://data.gbif.org/occurrences/395733764,http://data.gbif.org/ws/rest/occurrence/get?key=395733764
"National Museum of Nature and Science, Japan",Plant Specimens of Kurashiki Museum of Natural History,,,,,,,KURA,KURA,99364,Specimen,,11:29.0,,,Aconitum sanyoense Nakai,Nakai,Aconitum sanyoense Nakai,Plantae,,,Ranunculales,Ranunculaceae,Aconitum,Japan,Japan,,Shinjo-son,,Okayama,Eastern Asia,Japan,,,,,,,,,,,,http://data.gbif.org/occurrences/395734018,http://data.gbif.org/ws/rest/occurrence/get?key=395734018
"National Museum of Nature and Science, Japan",Plant Specimens of Kurashiki Museum of Natural History,,,,,,,KURA,KURA,25298,Specimen,,11:28.0,,,Aconitum sanyoense Nakai,Nakai,Aconitum sanyoense Nakai,Plantae,,,Ranunculales,Ranunculaceae,Aconitum,Japan,Japan,,Niimi-shi,,Okayama,Eastern Asia,Japan,,,,,,,,,,,,http://data.gbif.org/occurrences/395733779,http://data.gbif.org/ws/rest/occurrence/get?key=395733779
"National Museum of Nature and Science, Japan",Plant Specimens of Kurashiki Museum of Natural History,,,,,,,KURA,KURA,72681,Specimen,,11:29.0,,,Aconitum sanyoense Nakai,Nakai,Aconitum sanyoense Nakai,Plantae,,,Ranunculales,Ranunculaceae,Aconitum,Japan,Japan,,Shinjo-son,,Okayama,Eastern Asia,Japan,,,,,,,,,,,,http://data.gbif.org/occurrences/395733943,http://data.gbif.org/ws/rest/occurrence/get?key=395733943