Data Publisher,Dataset,Dataset Rights,Collector name,Collector number,Field number,GUID,Date collected,Institution code,Collection code,Catalogue number,Basis of record,Image url,Last indexed,Identifier,Identification date,Scientific name,Author,Scientific name (interpreted),Kingdom,Phylum,Class,Order,Family,Genus,Country,Country (interpreted),Locality,County,Continent or Ocean,State/Province,Region,Publisher country,Latitude,Longitude,Coordinate precision,Cell id,Centi cell id,Min depth,Max depth,Max depth,Min altitude,Max altitude,Altitude precision,GBIF portal url,GBIF webservice url
"National Museum of Nature and Science, Japan","Herbarium Specimens of Tokushima Prefectural Museum, Japan",,,,,,,TKPM,B,SP134347,Specimen,,22:26.0,,,Datura metel L.,L.,Datura metel L.,Plantae,Angiospermae,Dicotyledoneae,Angiospermae,Solanaceae,Datura,Japan,Japan,,Kouchi City,,Kouchi Pref.,Eastern Asia,Japan,,,,,,,,,,,,http://data.gbif.org/occurrences/150133805,http://data.gbif.org/ws/rest/occurrence/get?key=150133805
"National Museum of Nature and Science, Japan","Herbarium Specimens of Tokushima Prefectural Museum, Japan",,,,,,,TKPM,B,SP013989,Specimen,,22:25.0,,,Datura metel L.,L.,Datura metel L.,Plantae,Angiospermae,Dicotyledoneae,Angiospermae,Solanaceae,Datura,Japan,Japan,,Tokushima City,,Tokushima Pref.,Eastern Asia,Japan,,,,,,,,,,,,http://data.gbif.org/occurrences/150133491,http://data.gbif.org/ws/rest/occurrence/get?key=150133491
"National Museum of Nature and Science, Japan","Herbarium Specimens of Tokushima Prefectural Museum, Japan",,,,,,,TKPM,B,SP134343,Specimen,,22:26.0,,,Datura metel L.,L.,Datura metel L.,Plantae,Angiospermae,Dicotyledoneae,Angiospermae,Solanaceae,Datura,Japan,Japan,,Kouchi City,,Kouchi Pref.,Eastern Asia,Japan,,,,,,,,,,,,http://data.gbif.org/occurrences/150133804,http://data.gbif.org/ws/rest/occurrence/get?key=150133804
"National Museum of Nature and Science, Japan","Herbarium Specimens of Tokushima Prefectural Museum, Japan",,,,,,,TKPM,B,SP134349,Specimen,,22:26.0,,,Datura metel L.,L.,Datura metel L.,Plantae,Angiospermae,Dicotyledoneae,Angiospermae,Solanaceae,Datura,Japan,Japan,,Kouchi City,,Kouchi Pref.,Eastern Asia,Japan,,,,,,,,,,,,http://data.gbif.org/occurrences/150133806,http://data.gbif.org/ws/rest/occurrence/get?key=150133806
"National Museum of Nature and Science, Japan","Herbarium Specimens of Tokushima Prefectural Museum, Japan",,,,,,,TKPM,B,SP013990,Specimen,,22:25.0,,,Datura metel L.,L.,Datura metel L.,Plantae,Angiospermae,Dicotyledoneae,Angiospermae,Solanaceae,Datura,Japan,Japan,,Tokushima City,,Tokushima Pref.,Eastern Asia,Japan,,,,,,,,,,,,http://data.gbif.org/occurrences/150133492,http://data.gbif.org/ws/rest/occurrence/get?key=150133492
"National Museum of Nature and Science, Japan","Herbarium Specimens of Tokushima Prefectural Museum, Japan",,,,,,,TKPM,B,SP134342,Specimen,,22:26.0,,,Datura metel L.,L.,Datura metel L.,Plantae,Angiospermae,Dicotyledoneae,Angiospermae,Solanaceae,Datura,Japan,Japan,,Kouchi City,,Kouchi Pref.,Eastern Asia,Japan,,,,,,,,,,,,http://data.gbif.org/occurrences/150133803,http://data.gbif.org/ws/rest/occurrence/get?key=150133803
"National Museum of Nature and Science, Japan","Herbarium Specimens of Museum of Nature and Human Activities, Hyogo Prefecture, Japan",,,,,,,HYO,HYO-C,C1-201902,Specimen,,25:23.0,,,Datura metel L.,L.,Datura metel L.,Plantae,,,,Solanaceae,Datura,Japan,Japan,"Kandechou, Nisiku, Kobe City.",,,Hyogo,Eastern Asia,Japan,,,,,,,,,,,,http://data.gbif.org/occurrences/177351718,http://data.gbif.org/ws/rest/occurrence/get?key=177351718
"Netherlands Centre for Biodiversity Naturalis, section National Herbarium of the Netherlands",Nationaal Herbarium Nederland,,"Siebold, PF von",,s.n.,,,L,L,1095208,Specimen,,52:30.0,"Adelbert, A.G.L.",,Datura metel L.,,Datura metel L.,,,,,Solanaceae,Datura,Japan,Japan,,,,,Eastern Asia,Netherlands,,,,,,,,,,,,http://data.gbif.org/occurrences/250955010,http://data.gbif.org/ws/rest/occurrence/get?key=250955010
"Netherlands Centre for Biodiversity Naturalis, section National Herbarium of the Netherlands",Nationaal Herbarium Nederland,,"Pierot, J",,44,,,L,L,1095204,Specimen,,52:29.0,"Adelbert, A.G.L.",,Datura metel L.,,Datura metel L.,,,,,Solanaceae,Datura,Japan,Japan,Nagasaki,,,,Eastern Asia,Netherlands,,,,,,,,,,,,http://data.gbif.org/occurrences/250954960,http://data.gbif.org/ws/rest/occurrence/get?key=250954960
"Netherlands Centre for Biodiversity Naturalis, section National Herbarium of the Netherlands",Nationaal Herbarium Nederland,,"B?rger, H",,s.n.,,,L,L,1095205,Specimen,,52:29.0,"Adelbert, A.G.L.",,Datura metel L.,,Datura metel L.,,,,,Solanaceae,Datura,Japan,Japan,,,,,Eastern Asia,Netherlands,,,,,,,,,,,,http://data.gbif.org/occurrences/250955007,http://data.gbif.org/ws/rest/occurrence/get?key=250955007
"Netherlands Centre for Biodiversity Naturalis, section National Herbarium of the Netherlands",Nationaal Herbarium Nederland,,"B?rger, H",,s.n.,,,L,L,1095206,Specimen,,52:29.0,"Adelbert, A.G.L.",,Datura metel L.,,Datura metel L.,,,,,Solanaceae,Datura,Japan,Japan,,,,,Eastern Asia,Netherlands,,,,,,,,,,,,http://data.gbif.org/occurrences/250955008,http://data.gbif.org/ws/rest/occurrence/get?key=250955008
"Netherlands Centre for Biodiversity Naturalis, section National Herbarium of the Netherlands",Nationaal Herbarium Nederland,,"Siebold, PF von",,s.n.,,,L,L,1095209,Specimen,,52:30.0,"Adelbert, A.G.L.",,Datura metel L.,,Datura metel L.,,,,,Solanaceae,Datura,Japan,Japan,,,,,Eastern Asia,Netherlands,,,,,,,,,,,,http://data.gbif.org/occurrences/250955011,http://data.gbif.org/ws/rest/occurrence/get?key=250955011
"Netherlands Centre for Biodiversity Naturalis, section National Herbarium of the Netherlands",Nationaal Herbarium Nederland,,"Siebold, PF von",,s.n.,,,L,L,1095207,Specimen,,52:30.0,"Adelbert, A.G.L.",,Datura metel L.,,Datura metel L.,,,,,Solanaceae,Datura,Japan,Japan,,,,,Eastern Asia,Netherlands,,,,,,,,,,,,http://data.gbif.org/occurrences/250955009,http://data.gbif.org/ws/rest/occurrence/get?key=250955009
"National Museum of Nature and Science, Japan",Plant Specimens of Kurashiki Museum of Natural History,,,,,,,KURA,KURA,kt133511,Specimen,,13:44.0,,,Datura metel L.,L.,Datura metel L.,Plantae,,,Tubiflorae,Solanaceae,Datura,Japan,Japan,,San'yo-cho,,Okayama,Eastern Asia,Japan,,,,,,,,,,,,http://data.gbif.org/occurrences/204270133,http://data.gbif.org/ws/rest/occurrence/get?key=204270133
Staatliche Naturwissenschaftliche Sammlungen Bayerns,The Vascular Plant Collection at the Botanische Staatssammlung M?nchen,? Botanische Staatssammlung M?nchen,"Siebold, P.F. von",,,http://id.snsb.info/Collection/440210-540278-222892,,M,BSMvplantscoll,M-0172075 / 540278 / 222892,Specimen,http://pictures.snsb.info/BSMvplantscoll/web/M-0172/M-0172075_20111215_123120.jpg,17:38.0,,,Datura metel L.,,Datura metel L.,,,,,,,Japan,Japan,Legit in Japonia etc.,,,,Eastern Asia,Germany,,,,,,,,,,,,http://data.gbif.org/occurrences/684192380,http://data.gbif.org/ws/rest/occurrence/get?key=684192380
