Data Publisher,Dataset,Dataset Rights,Collector name,Collector number,Field number,GUID,Date collected,Institution code,Collection code,Catalogue number,Basis of record,Image url,Last indexed,Identifier,Identification date,Scientific name,Author,Scientific name (interpreted),Kingdom,Phylum,Class,Order,Family,Genus,Country,Country (interpreted),Locality,County,Continent or Ocean,State/Province,Region,Publisher country,Latitude,Longitude,Coordinate precision,Cell id,Centi cell id,Min depth,Max depth,Max depth,Min altitude,Max altitude,Altitude precision,GBIF portal url,GBIF webservice url
"National Museum of Nature and Science, Japan",Kochi Prefectural Makino Botanical Garden,,,,,,,MBK,MBK,174394,Specimen,,02:47.0,,,Arisaema iyoanum Makino subsp. nakaianum (Kitag. et Ohba) H.Ohashi et J.Murata,,Arisaema iyoanum subsp. nakaianum (Kitag. & Ohba) H.Ohashi & J.Murata,Plantae,,,Spathiflorae,Araceae,Arisaema,Japan,Japan,,,,Pref. Kochi,Eastern Asia,Japan,,,,,,,,,,,,http://data.gbif.org/occurrences/143958396,http://data.gbif.org/ws/rest/occurrence/get?key=143958396
"National Museum of Nature and Science, Japan",Kochi Prefectural Makino Botanical Garden,,,,,,,MBK,MBK,16966,Specimen,,02:43.0,,,Arisaema iyoanum Makino subsp. nakaianum (Kitag. et Ohba) H.Ohashi et J.Murata,,Arisaema iyoanum subsp. nakaianum (Kitag. & Ohba) H.Ohashi & J.Murata,Plantae,,,Spathiflorae,Araceae,Arisaema,Japan,Japan,,,,Pref. Kochi,Eastern Asia,Japan,,,,,,,,,,,,http://data.gbif.org/occurrences/143957567,http://data.gbif.org/ws/rest/occurrence/get?key=143957567
"National Museum of Nature and Science, Japan",Kochi Prefectural Makino Botanical Garden,,,,,,,MBK,MBK,114031,Specimen,,02:46.0,,,Arisaema iyoanum Makino subsp. nakaianum (Kitag. et Ohba) H.Ohashi et J.Murata,,Arisaema iyoanum subsp. nakaianum (Kitag. & Ohba) H.Ohashi & J.Murata,Plantae,,,Spathiflorae,Araceae,Arisaema,Japan,Japan,,,,Pref. Kochi,Eastern Asia,Japan,,,,,,,,,,,,http://data.gbif.org/occurrences/143958251,http://data.gbif.org/ws/rest/occurrence/get?key=143958251
"National Museum of Nature and Science, Japan",Kochi Prefectural Makino Botanical Garden,,,,,,,MBK,MBK,16961,Specimen,,02:43.0,,,Arisaema iyoanum Makino subsp. nakaianum (Kitag. et Ohba) H.Ohashi et J.Murata,,Arisaema iyoanum subsp. nakaianum (Kitag. & Ohba) H.Ohashi & J.Murata,Plantae,,,Spathiflorae,Araceae,Arisaema,Japan,Japan,,,,Pref. Kochi,Eastern Asia,Japan,,,,,,,,,,,,http://data.gbif.org/occurrences/143957562,http://data.gbif.org/ws/rest/occurrence/get?key=143957562
"National Museum of Nature and Science, Japan",Kochi Prefectural Makino Botanical Garden,,,,,,,MBK,MBK,16963,Specimen,,02:43.0,,,Arisaema iyoanum Makino subsp. nakaianum (Kitag. et Ohba) H.Ohashi et J.Murata,,Arisaema iyoanum subsp. nakaianum (Kitag. & Ohba) H.Ohashi & J.Murata,Plantae,,,Spathiflorae,Araceae,Arisaema,Japan,Japan,,,,Pref. Kochi,Eastern Asia,Japan,,,,,,,,,,,,http://data.gbif.org/occurrences/143957564,http://data.gbif.org/ws/rest/occurrence/get?key=143957564
"National Museum of Nature and Science, Japan",Kochi Prefectural Makino Botanical Garden,,,,,,,MBK,MBK,16965,Specimen,,02:43.0,,,Arisaema iyoanum Makino subsp. nakaianum (Kitag. et Ohba) H.Ohashi et J.Murata,,Arisaema iyoanum subsp. nakaianum (Kitag. & Ohba) H.Ohashi & J.Murata,Plantae,,,Spathiflorae,Araceae,Arisaema,Japan,Japan,,,,Pref. Kochi,Eastern Asia,Japan,,,,,,,,,,,,http://data.gbif.org/occurrences/143957566,http://data.gbif.org/ws/rest/occurrence/get?key=143957566
"National Museum of Nature and Science, Japan",Kochi Prefectural Makino Botanical Garden,,,,,,,MBK,MBK,51360,Specimen,,02:46.0,,,Arisaema iyoanum Makino subsp. nakaianum (Kitag. et Ohba) H.Ohashi et J.Murata,,Arisaema iyoanum subsp. nakaianum (Kitag. & Ohba) H.Ohashi & J.Murata,Plantae,,,Spathiflorae,Araceae,Arisaema,Japan,Japan,,,,Pref. Kochi,Eastern Asia,Japan,,,,,,,,,,,,http://data.gbif.org/occurrences/143958120,http://data.gbif.org/ws/rest/occurrence/get?key=143958120
"National Museum of Nature and Science, Japan",Kochi Prefectural Makino Botanical Garden,,,,,,,MBK,MBK,16962,Specimen,,02:43.0,,,Arisaema iyoanum Makino subsp. nakaianum (Kitag. et Ohba) H.Ohashi et J.Murata,,Arisaema iyoanum subsp. nakaianum (Kitag. & Ohba) H.Ohashi & J.Murata,Plantae,,,Spathiflorae,Araceae,Arisaema,Japan,Japan,,,,Pref. Kochi,Eastern Asia,Japan,,,,,,,,,,,,http://data.gbif.org/occurrences/143957563,http://data.gbif.org/ws/rest/occurrence/get?key=143957563
"National Museum of Nature and Science, Japan",Kochi Prefectural Makino Botanical Garden,,,,,,,MBK,MBK,16964,Specimen,,02:43.0,,,Arisaema iyoanum Makino subsp. nakaianum (Kitag. et Ohba) H.Ohashi et J.Murata,,Arisaema iyoanum subsp. nakaianum (Kitag. & Ohba) H.Ohashi & J.Murata,Plantae,,,Spathiflorae,Araceae,Arisaema,Japan,Japan,,,,Pref. Kochi,Eastern Asia,Japan,,,,,,,,,,,,http://data.gbif.org/occurrences/143957565,http://data.gbif.org/ws/rest/occurrence/get?key=143957565
"Royal Botanic Gardens, Kew","Royal Botanic Gardens, Kew",http://www.kew.org/aboutus/legal.html,"Murata, J.",,,,,K,Spirit Collection,49898,Specimen,,55:04.0,,,Arisaema iyoanum Makino subsp. nakaianum (Ohno) Ohashi & J.Murata,(Ohno) Ohashi & J.Murata,Arisaema iyoanum subsp. nakaianum (Ohno) Ohashi & J.Murata,Plantae,,,,ARACEAE,Arisaema,Japan,Japan,Shikoku,,,,Eastern Asia,United Kingdom,,,,,,,,,,,,http://data.gbif.org/occurrences/230625476,http://data.gbif.org/ws/rest/occurrence/get?key=230625476
