Data Publisher,Dataset,Dataset Rights,Collector name,Collector number,Field number,GUID,Date collected,Institution code,Collection code,Catalogue number,Basis of record,Image url,Last indexed,Identifier,Identification date,Scientific name,Author,Scientific name (interpreted),Kingdom,Phylum,Class,Order,Family,Genus,Country,Country (interpreted),Locality,County,Continent or Ocean,State/Province,Region,Publisher country,Latitude,Longitude,Coordinate precision,Cell id,Centi cell id,Min depth,Max depth,Max depth,Min altitude,Max altitude,Altitude precision,GBIF portal url,GBIF webservice url
"National Museum of Nature and Science, Japan",Vascular Plants Collection of National Museum of Nature and Science,,,,,,,TNS,VS,727206,Specimen,,17:20.0,,,Arisaema nikoense,,Arisaema nikoense,Plantae,,,,Araceae,Arisaema,Japan,Japan,,,,Shizuoka,Eastern Asia,Japan,,,,,,,,,,,,http://data.gbif.org/occurrences/42942527,http://data.gbif.org/ws/rest/occurrence/get?key=42942527
"National Museum of Nature and Science, Japan",Angiospermatatophytina Collection of Saitama Museum of Natural History,,,,,,,SMNH,As,20275,Specimen,,52:12.0,,,Arisaema nikoense Nakai,Nakai,Arisaema nikoense Nakai,Plantae,Angiospermae,Dicotyledoneae,Spathiflorae,Araceae,Arisaema,Japan,Japan,Mt. Kumakura-san,Chichibu-gun Arakawamura,,Saitama,Eastern Asia,Japan,,,,,,,,,,,,http://data.gbif.org/occurrences/393091422,http://data.gbif.org/ws/rest/occurrence/get?key=393091422
"National Museum of Nature and Science, Japan",Angiospermatatophytina Collection of Saitama Museum of Natural History,,,,,,,SMNH,As,20278,Specimen,,52:12.0,,,Arisaema nikoense Nakai,Nakai,Arisaema nikoense Nakai,Plantae,Angiospermae,Dicotyledoneae,Spathiflorae,Araceae,Arisaema,Japan,Japan,Irikawa-dani valley,Chichibu-gun Otakimura,,Saitama,Eastern Asia,Japan,,,,,,,,,,,,http://data.gbif.org/occurrences/393091427,http://data.gbif.org/ws/rest/occurrence/get?key=393091427
"National Museum of Nature and Science, Japan",Angiospermatatophytina Collection of Saitama Museum of Natural History,,,,,,,SMNH,As,20280,Specimen,,52:12.0,,,Arisaema nikoense Nakai,Nakai,Arisaema nikoense Nakai,Plantae,Angiospermae,Dicotyledoneae,Spathiflorae,Araceae,Arisaema,Japan,Japan,Mtanosawa valley,Chichibu-gun Otakimura,,Saitama,Eastern Asia,Japan,,,,,,,,,,,,http://data.gbif.org/occurrences/393091430,http://data.gbif.org/ws/rest/occurrence/get?key=393091430
"National Museum of Nature and Science, Japan",Angiospermatatophytina Collection of Saitama Museum of Natural History,,,,,,,SMNH,As,20282,Specimen,,52:12.0,,,Arisaema nikoense Nakai,Nakai,Arisaema nikoense Nakai,Plantae,Angiospermae,Dicotyledoneae,Spathiflorae,Araceae,Arisaema,Japan,Japan,Mt. Jomine-san,Kodama-gun Kamiizumimura,,Saitama,Eastern Asia,Japan,,,,,,,,,,,,http://data.gbif.org/occurrences/393091434,http://data.gbif.org/ws/rest/occurrence/get?key=393091434
"National Museum of Nature and Science, Japan",Angiospermatatophytina Collection of Saitama Museum of Natural History,,,,,,,SMNH,As,24571,Specimen,,52:13.0,,,Arisaema nikoense Nakai,Nakai,Arisaema nikoense Nakai,Plantae,Angiospermae,Dicotyledoneae,Spathiflorae,Araceae,Arisaema,Japan,Japan,Jumonji-toge Pass,Chichibu-gun Otakimura,,Saitama,Eastern Asia,Japan,,,,,,,,,,,,http://data.gbif.org/occurrences/393091673,http://data.gbif.org/ws/rest/occurrence/get?key=393091673
"National Museum of Nature and Science, Japan",Angiospermatatophytina Collection of Saitama Museum of Natural History,,,,,,,SMNH,As,22352,Specimen,,52:12.0,,,Arisaema nikoense Nakai,Nakai,Arisaema nikoense Nakai,Plantae,Angiospermae,Dicotyledoneae,Spathiflorae,Araceae,Arisaema,Japan,Japan,Nippara,Nishitama-gun Okutamamachi,,Tokyo,Eastern Asia,Japan,,,,,,,,,,,,http://data.gbif.org/occurrences/393091554,http://data.gbif.org/ws/rest/occurrence/get?key=393091554
"National Museum of Nature and Science, Japan",Angiospermatatophytina Collection of Saitama Museum of Natural History,,,,,,,SMNH,As,20283,Specimen,,52:12.0,,,Arisaema nikoense Nakai,Nakai,Arisaema nikoense Nakai,Plantae,Angiospermae,Dicotyledoneae,Spathiflorae,Araceae,Arisaema,Japan,Japan,Mt. Tenmaru-yama,Tano-gun Uenomura,,Gunma,Eastern Asia,Japan,,,,,,,,,,,,http://data.gbif.org/occurrences/393091435,http://data.gbif.org/ws/rest/occurrence/get?key=393091435
"National Museum of Nature and Science, Japan",Angiospermatatophytina Collection of Saitama Museum of Natural History,,,,,,,SMNH,As,20276,Specimen,,52:12.0,,,Arisaema nikoense Nakai,Nakai,Arisaema nikoense Nakai,Plantae,Angiospermae,Dicotyledoneae,Spathiflorae,Araceae,Arisaema,Japan,Japan,Mt. Kumakura-san,Chichibu-gun Arakawamura,,Saitama,Eastern Asia,Japan,,,,,,,,,,,,http://data.gbif.org/occurrences/393091424,http://data.gbif.org/ws/rest/occurrence/get?key=393091424
"National Museum of Nature and Science, Japan",Angiospermatatophytina Collection of Saitama Museum of Natural History,,,,,,,SMNH,As,22351,Specimen,,52:12.0,,,Arisaema nikoense Nakai,Nakai,Arisaema nikoense Nakai,Plantae,Angiospermae,Dicotyledoneae,Spathiflorae,Araceae,Arisaema,Japan,Japan,Nippara,Nishitama-gun Okutamamachi,,Tokyo,Eastern Asia,Japan,,,,,,,,,,,,http://data.gbif.org/occurrences/393091552,http://data.gbif.org/ws/rest/occurrence/get?key=393091552
"National Museum of Nature and Science, Japan",Angiospermatatophytina Collection of Saitama Museum of Natural History,,,,,,,SMNH,As,20277,Specimen,,52:12.0,,,Arisaema nikoense Nakai,Nakai,Arisaema nikoense Nakai,Plantae,Angiospermae,Dicotyledoneae,Spathiflorae,Araceae,Arisaema,Japan,Japan,Mt. Ryokami-san,Chichibu-gun Ryokamimura,,Saitama,Eastern Asia,Japan,,,,,,,,,,,,http://data.gbif.org/occurrences/393091425,http://data.gbif.org/ws/rest/occurrence/get?key=393091425
"National Museum of Nature and Science, Japan",Angiospermatatophytina Collection of Saitama Museum of Natural History,,,,,,,SMNH,As,20281,Specimen,,52:12.0,,,Arisaema nikoense Nakai,Nakai,Arisaema nikoense Nakai,Plantae,Angiospermae,Dicotyledoneae,Spathiflorae,Araceae,Arisaema,Japan,Japan,Mt. Mae-shiraiwa-san,Chichibu-gun Otakimura,,Saitama,Eastern Asia,Japan,,,,,,,,,,,,http://data.gbif.org/occurrences/393091432,http://data.gbif.org/ws/rest/occurrence/get?key=393091432
"National Museum of Nature and Science, Japan",Angiospermatatophytina Collection of Saitama Museum of Natural History,,,,,,,SMNH,As,20279,Specimen,,52:12.0,,,Arisaema nikoense Nakai,Nakai,Arisaema nikoense Nakai,Plantae,Angiospermae,Dicotyledoneae,Spathiflorae,Araceae,Arisaema,Japan,Japan,Mt. Akazawa-dake,Chichibu-gun Otakimura,,Saitama,Eastern Asia,Japan,,,,,,,,,,,,http://data.gbif.org/occurrences/393091429,http://data.gbif.org/ws/rest/occurrence/get?key=393091429
"National Museum of Nature and Science, Japan",Angiospermatatophytina Collection of Saitama Museum of Natural History,,,,,,,SMNH,As,21970,Specimen,,52:12.0,,,Arisaema nikoense Nakai,Nakai,Arisaema nikoense Nakai,Plantae,Angiospermae,Dicotyledoneae,Spathiflorae,Araceae,Arisaema,Japan,Japan,Northern slope of Mt. Hakutai-san,Chichibu-gun Otakimura,,Saitama,Eastern Asia,Japan,,,,,,,,,,,,http://data.gbif.org/occurrences/393091515,http://data.gbif.org/ws/rest/occurrence/get?key=393091515
"National Museum of Nature and Science, Japan","Ibaraki Nature Museum, Vascular Plants collection",,,,,,,INM,Va,137344,Specimen,,48:32.0,,,Arisaema nikoense Nakai,Nakai,Arisaema nikoense Nakai,Plantae,SPERMATOPHYTAANGIOSPERMAE,MONOCOTYLEDONEAE,,ARACEAE,Arisaema,Japan,Japan,,Nikko-shi,,Tochigi,Eastern Asia,Japan,,,,,,,,,,,,http://data.gbif.org/occurrences/381785910,http://data.gbif.org/ws/rest/occurrence/get?key=381785910
"Royal Botanic Gardens, Kew","Royal Botanic Gardens, Kew",http://www.kew.org/aboutus/legal.html,,,,,,K,Spirit Collection,55951,Specimen,,55:04.0,,,Arisaema nikoense Nakai,Nakai,Arisaema nikoense Nakai,Plantae,,,,ARACEAE,Arisaema,Japan,Japan,"Honshu,Nikko",,,,Eastern Asia,United Kingdom,,,,,,,,,1300,,,http://data.gbif.org/occurrences/237557780,http://data.gbif.org/ws/rest/occurrence/get?key=237557780
University of British Columbia,University of British Columbia Herbarium (UBC) - Vascular Plant Collection,http://creativecommons.org/publicdomain/zero/1.0/ & http://www.canadensys.net/norms,Tetsuo Koyama,8060,,,,University of British Columbia,UBC,V102832,Specimen,,57:52.0,T.K. 1961,,Arisaema nikoense Nakai,Nakai,Arisaema nikoense Nakai,Plantae,,,,Araceae,Arisaema,Japan,Japan,"above inago hot spring, foot of Mountain yatsugatake",,,Nagano,Eastern Asia,Canada,,,,,,,,,,,,http://data.gbif.org/occurrences/466076990,http://data.gbif.org/ws/rest/occurrence/get?key=466076990
"National Museum of Nature and Science, Japan",Vascular Plant Specimen Database of Kanagawa Prefectural Museum of Natural History,,,,,,,KPM,NA,KPM-NA1067773,Specimen,,22:11.0,,,Arisaema nikoense Nakai,,Arisaema nikoense Nakai,Plantae,Angiospermae,Monocotyledoneae,,ARACEAE,Arisaema,Japan,Japan,,"Ashigarashimo-gun, Hakone-machi",,Kanagawa Prefecture,Eastern Asia,Japan,35.2158,138.978,,45318,29,,,,,,,http://data.gbif.org/occurrences/245532159,http://data.gbif.org/ws/rest/occurrence/get?key=245532159
"National Museum of Nature and Science, Japan",Vascular Plant Specimen Database of Kanagawa Prefectural Museum of Natural History,,,,,,,KPM,NA,KPM-NA0011172,Specimen,,22:12.0,,,Arisaema nikoense Nakai,,Arisaema nikoense Nakai,Plantae,Angiospermae,Monocotyledoneae,,ARACEAE,Arisaema,Japan,Japan,,"Ashigarashimo-gun, Hakone-machi",,Kanagawa Prefecture,Eastern Asia,Japan,35.2324,139.016,,45319,20,,,,,,,http://data.gbif.org/occurrences/245532421,http://data.gbif.org/ws/rest/occurrence/get?key=245532421
"National Museum of Nature and Science, Japan",Vascular Plant Specimen Database of Kanagawa Prefectural Museum of Natural History,,,,,,,KPM,NA,KPM-NA1067775,Specimen,,22:11.0,,,Arisaema nikoense Nakai,,Arisaema nikoense Nakai,Plantae,Angiospermae,Monocotyledoneae,,ARACEAE,Arisaema,Japan,Japan,,"Aikou-gun, Kiyokawa-mura",,Kanagawa Prefecture,Eastern Asia,Japan,35.4741,139.166,,45319,41,,,,,,,http://data.gbif.org/occurrences/245532161,http://data.gbif.org/ws/rest/occurrence/get?key=245532161
"National Museum of Nature and Science, Japan",Vascular Plant Specimen Database of Kanagawa Prefectural Museum of Natural History,,,,,,,KPM,NA,KPM-NA1067774,Specimen,,22:11.0,,,Arisaema nikoense Nakai,,Arisaema nikoense Nakai,Plantae,Angiospermae,Monocotyledoneae,,ARACEAE,Arisaema,Japan,Japan,,"Aikou-gun, Kiyokawa-mura",,Kanagawa Prefecture,Eastern Asia,Japan,35.4741,139.166,,45319,41,,,,,,,http://data.gbif.org/occurrences/245532160,http://data.gbif.org/ws/rest/occurrence/get?key=245532160
