Data Publisher,Dataset,Dataset Rights,Collector name,Collector number,Field number,GUID,Date collected,Institution code,Collection code,Catalogue number,Basis of record,Image url,Last indexed,Identifier,Identification date,Scientific name,Author,Scientific name (interpreted),Kingdom,Phylum,Class,Order,Family,Genus,Country,Country (interpreted),Locality,County,Continent or Ocean,State/Province,Region,Publisher country,Latitude,Longitude,Coordinate precision,Cell id,Centi cell id,Min depth,Max depth,Max depth,Min altitude,Max altitude,Altitude precision,GBIF portal url,GBIF webservice url
"National Museum of Nature and Science, Japan",Kochi Prefectural Makino Botanical Garden,,,,,,,MBK,MBK,114112,Specimen,,02:46.0,,,Arisaema thunbergii Blume subsp. thunbergii,,Arisaema thunbergii subsp. thunbergii,Plantae,,,Spathiflorae,Araceae,Arisaema,Japan,Japan,,,,Pref. Kochi,Eastern Asia,Japan,,,,,,,,,,,,http://data.gbif.org/occurrences/143958257,http://data.gbif.org/ws/rest/occurrence/get?key=143958257
"National Museum of Nature and Science, Japan",Kochi Prefectural Makino Botanical Garden,,,,,,,MBK,MBK,17014,Specimen,,02:43.0,,,Arisaema thunbergii Blume subsp. thunbergii,,Arisaema thunbergii subsp. thunbergii,Plantae,,,Spathiflorae,Araceae,Arisaema,Japan,Japan,,,,Pref. Kochi,Eastern Asia,Japan,,,,,,,,,,,,http://data.gbif.org/occurrences/143957596,http://data.gbif.org/ws/rest/occurrence/get?key=143957596
"National Museum of Nature and Science, Japan",Kochi Prefectural Makino Botanical Garden,,,,,,,MBK,MBK,79316,Specimen,,02:46.0,,,Arisaema thunbergii Blume subsp. thunbergii,,Arisaema thunbergii subsp. thunbergii,Plantae,,,Spathiflorae,Araceae,Arisaema,Japan,Japan,,,,Pref. Kochi,Eastern Asia,Japan,,,,,,,,,,,,http://data.gbif.org/occurrences/143958234,http://data.gbif.org/ws/rest/occurrence/get?key=143958234
"National Museum of Nature and Science, Japan",Plant Specimens of The Shimane Nature Museum of Mt. Sanbe,,,,,,,SNMS,P,18548,Specimen,,45:21.0,,,Arisaema thunbergii Blume subsp. thunbergii,Blume,Arisaema thunbergii subsp. thunbergii,Plantae,,,Spathiflorae,Araceae,Arisaema,Japan,Japan,Sagiura,"Taisha-cho, Hikawa-gun",,Shimane Pref.,Eastern Asia,Japan,,,,,,,,,,,,http://data.gbif.org/occurrences/390981147,http://data.gbif.org/ws/rest/occurrence/get?key=390981147
"National Museum of Nature and Science, Japan",Plant Specimens of The Shimane Nature Museum of Mt. Sanbe,,,,,,,SNMS,P,7966,Specimen,,45:18.0,,,Arisaema thunbergii Blume subsp. thunbergii,Blume,Arisaema thunbergii subsp. thunbergii,Plantae,,,Spathiflorae,Araceae,Arisaema,Japan,Japan,,"Misumi-cho, Naka-gun",,Shimane Pref.,Eastern Asia,Japan,,,,,,,,,,,,http://data.gbif.org/occurrences/287398850,http://data.gbif.org/ws/rest/occurrence/get?key=287398850
"National Museum of Nature and Science, Japan",Plant Specimens of The Shimane Nature Museum of Mt. Sanbe,,,,,,,SNMS,P,7967,Specimen,,45:18.0,,,Arisaema thunbergii Blume subsp. thunbergii,Blume,Arisaema thunbergii subsp. thunbergii,Plantae,,,Spathiflorae,Araceae,Arisaema,Japan,Japan,,"Misumi-cho, Naka-gun",,Shimane Pref.,Eastern Asia,Japan,,,,,,,,,,,,http://data.gbif.org/occurrences/287398851,http://data.gbif.org/ws/rest/occurrence/get?key=287398851
"National Institute of Genetics, ROIS","Herbarium Specimens of Museum of Nature and Human Activities, Hyogo Pref., Japan",,,,,,,HYO,VP,C1-119649,Specimen,,27:46.0,,,Arisaema thunbergii subsp. thunbergii,,Arisaema thunbergii subsp. thunbergii,Plantae,Magnoliophyta,,,Araceae,Arisaema,Japan,Japan,"Yakushima Isl., Miyanoura",,,Kagoshima,Eastern Asia,Japan,,,,,,,,,,,,http://data.gbif.org/occurrences/323530145,http://data.gbif.org/ws/rest/occurrence/get?key=323530145
"National Institute of Genetics, ROIS","Herbarium Specimens of Museum of Nature and Human Activities, Hyogo Pref., Japan",,,,,,,HYO,VP,C1-164815,Specimen,,19:59.0,,,Arisaema thunbergii subsp. thunbergii,,Arisaema thunbergii subsp. thunbergii,Plantae,Magnoliophyta,,,Araceae,Arisaema,Japan,Japan,"Hyogo Pref.; Mihara-gun, Seidan-cho, Matsuho",,,Hyogo,Eastern Asia,Japan,134.9,34.2833,,,,,,,200,570,,http://data.gbif.org/occurrences/323474190,http://data.gbif.org/ws/rest/occurrence/get?key=323474190
"National Institute of Genetics, ROIS","Herbarium Specimens of Museum of Nature and Human Activities, Hyogo Pref., Japan",,,,,,,HYO,VP,C1-025424,Specimen,,19:52.0,,,Arisaema thunbergii subsp. thunbergii,,Arisaema thunbergii subsp. thunbergii,Plantae,Magnoliophyta,,,Araceae,Arisaema,Japan,Japan,"Hyogo Pref.; Mihara-gun, Seidan-cho, Matsuho",,,Hyogo,Eastern Asia,Japan,134.85,34.2667,,,,,,,200,400,,http://data.gbif.org/occurrences/323472765,http://data.gbif.org/ws/rest/occurrence/get?key=323472765
