Data Publisher,Dataset,Dataset Rights,Collector name,Collector number,Field number,GUID,Date collected,Institution code,Collection code,Catalogue number,Basis of record,Image url,Last indexed,Identifier,Identification date,Scientific name,Author,Scientific name (interpreted),Kingdom,Phylum,Class,Order,Family,Genus,Country,Country (interpreted),Locality,County,Continent or Ocean,State/Province,Region,Publisher country,Latitude,Longitude,Coordinate precision,Cell id,Centi cell id,Min depth,Max depth,Max depth,Min altitude,Max altitude,Altitude precision,GBIF portal url,GBIF webservice url
"National Museum of Nature and Science, Japan","Plant specimens depodited in Osaka Museum of Natural History, Japan.",,,,,,,OSA,C,OSA53249,Specimen,,15:37.0,,,Arisaema heterophyllum Bl.,Bl.,Arisaema heterophyllum Bl.,Plantae,,,,Araceae,Arisaema,Japan,Japan,,Tomata-gun,,Okayama Prefecture,Eastern Asia,Japan,,,,,,,,,,,,http://data.gbif.org/occurrences/295107407,http://data.gbif.org/ws/rest/occurrence/get?key=295107407
"National Museum of Nature and Science, Japan","Plant specimens depodited in Osaka Museum of Natural History, Japan.",,,,,,,OSA,C,OSA52826,Specimen,,15:37.0,,,Arisaema heterophyllum Bl.,Bl.,Arisaema heterophyllum Bl.,Plantae,,,,Araceae,Arisaema,Japan,Japan,,,,Okayama Prefecture,Eastern Asia,Japan,,,,,,,,,,,,http://data.gbif.org/occurrences/295107402,http://data.gbif.org/ws/rest/occurrence/get?key=295107402
"Royal Botanic Gardens, Kew","Royal Botanic Gardens, Kew",http://www.kew.org/aboutus/legal.html,Gallagher,s.n.,,,,K,Spirit Collection,49897,Specimen,,55:04.0,,,Arisaema heterophyllum Bl.,Bl.,Arisaema heterophyllum Bl.,Plantae,,,,ARACEAE,Arisaema,Japan,Japan,Daechong-Do,,,,Eastern Asia,United Kingdom,,,,,,,,,,,,http://data.gbif.org/occurrences/230625475,http://data.gbif.org/ws/rest/occurrence/get?key=230625475
"National Museum of Nature and Science, Japan","Ibaraki Nature Museum, Vascular Plants collection",,,,,,,INM,Va,36932,Specimen,,48:19.0,,,Arisaema heterophyllum Blume,Blume,Arisaema heterophyllum Blume,Plantae,ANGIOSPERMAE,MONOCOTYLEDONEAE,,ARACEAE,Arisaema,Japan,Japan,,Yuuki-gun Ishigemachi,,Ibaraki,Eastern Asia,Japan,,,,,,,,,10,,,http://data.gbif.org/occurrences/381784531,http://data.gbif.org/ws/rest/occurrence/get?key=381784531
"National Museum of Nature and Science, Japan","Ibaraki Nature Museum, Vascular Plants collection",,,,,,,INM,Va,27525,Specimen,,48:18.0,,,Arisaema heterophyllum Blume,Blume,Arisaema heterophyllum Blume,Plantae,ANGIOSPERMAE,MONOCOTYLEDONEAE,,ARACEAE,Arisaema,Japan,Japan,,Yuuki-gun Ishigemachi,,Ibaraki,Eastern Asia,Japan,,,,,,,,,10,,,http://data.gbif.org/occurrences/381784421,http://data.gbif.org/ws/rest/occurrence/get?key=381784421
"National Museum of Nature and Science, Japan","Ibaraki Nature Museum, Vascular Plants collection",,,,,,,INM,Va,27441,Specimen,,48:18.0,,,Arisaema heterophyllum Blume,Blume,Arisaema heterophyllum Blume,Plantae,ANGIOSPERMAE,MONOCOTYLEDONEAE,,ARACEAE,Arisaema,Japan,Japan,,Yuuki-gun Ishigemachi,,Ibaraki,Eastern Asia,Japan,,,,,,,,,10,,,http://data.gbif.org/occurrences/381784420,http://data.gbif.org/ws/rest/occurrence/get?key=381784420
"National Museum of Nature and Science, Japan","Ibaraki Nature Museum, Vascular Plants collection",,,,,,,INM,Va,27526,Specimen,,48:18.0,,,Arisaema heterophyllum Blume,Blume,Arisaema heterophyllum Blume,Plantae,ANGIOSPERMAE,MONOCOTYLEDONEAE,,ARACEAE,Arisaema,Japan,Japan,,Yuuki-gun Ishigemachi,,Ibaraki,Eastern Asia,Japan,,,,,,,,,10,,,http://data.gbif.org/occurrences/381784422,http://data.gbif.org/ws/rest/occurrence/get?key=381784422
"National Museum of Nature and Science, Japan",Plant Specimens collections of the Kyushu UNniversity Museum,,,,,,,KYUM,FU,NAK00949,Specimen,,16:13.0,,,Arisaema heterophyllum Blume,,Arisaema heterophyllum Blume,Plantae,Magnoliophyta,Liliopsida,Arales,Araceae,Arisaema,Japan,Japan,,,,Ohita Pref.,Eastern Asia,Japan,,,,,,,,,,,,http://data.gbif.org/occurrences/234570197,http://data.gbif.org/ws/rest/occurrence/get?key=234570197
"National Museum of Nature and Science, Japan",Plant Specimens of Kurashiki Museum of Natural History,,,,,,,KURA,KURA,kt5687,Specimen,,11:55.0,,,Arisaema heterophyllum Blume,Blume,Arisaema heterophyllum Blume,Plantae,,,Spathiflorae,Araceae,Arisaema,Japan,Japan,,Mitsu-cho,,Okayama,Eastern Asia,Japan,,,,,,,,,,,,http://data.gbif.org/occurrences/204262206,http://data.gbif.org/ws/rest/occurrence/get?key=204262206
"National Museum of Nature and Science, Japan",Plant Specimens of Kurashiki Museum of Natural History,,,,,,,KURA,KURA,kt30985,Specimen,,11:55.0,,,Arisaema heterophyllum Blume,Blume,Arisaema heterophyllum Blume,Plantae,,,Spathiflorae,Araceae,Arisaema,Japan,Japan,,Mitsu-cho,,Okayama,Eastern Asia,Japan,,,,,,,,,,,,http://data.gbif.org/occurrences/204262210,http://data.gbif.org/ws/rest/occurrence/get?key=204262210
"National Museum of Nature and Science, Japan",Plant Specimens of Kurashiki Museum of Natural History,,,,,,,KURA,KURA,92564,Specimen,,11:55.0,,,Arisaema heterophyllum Blume,Blume,Arisaema heterophyllum Blume,Plantae,,,Spathiflorae,Araceae,Arisaema,Japan,Japan,,Kamisaibara-son,,Okayama,Eastern Asia,Japan,,,,,,,,,,,,http://data.gbif.org/occurrences/395737403,http://data.gbif.org/ws/rest/occurrence/get?key=395737403
"National Museum of Nature and Science, Japan","Plant specimens depodited in Osaka Museum of Natural History, Japan.",,,,,,,OSA,OSA,165672,Specimen,,15:34.0,,,Arisaema heterophyllum Blume,Blume,Arisaema heterophyllum Blume,Plantae,,,,Araceae,Arisaema,Japan,Japan,,Nara-shi,,Nara,Eastern Asia,Japan,34.6599,135.816,,44955,68,,,,,,,http://data.gbif.org/occurrences/204367375,http://data.gbif.org/ws/rest/occurrence/get?key=204367375
"National Museum of Nature and Science, Japan","Plant specimens depodited in Osaka Museum of Natural History, Japan.",,,,,,,OSA,OSA,165671,Specimen,,15:34.0,,,Arisaema heterophyllum Blume,Blume,Arisaema heterophyllum Blume,Plantae,,,,Araceae,Arisaema,Japan,Japan,,Nara-shi,,Nara,Eastern Asia,Japan,34.6599,135.816,,44955,68,,,,,,,http://data.gbif.org/occurrences/204367374,http://data.gbif.org/ws/rest/occurrence/get?key=204367374
"National Museum of Nature and Science, Japan","Plant specimens depodited in Osaka Museum of Natural History, Japan.",,,,,,,OSA,OSA,241375,Specimen,,15:34.0,,,Arisaema heterophyllum Blume,Blume,Arisaema heterophyllum Blume,Plantae,,,,Araceae,Arisaema,Japan,Japan,,Nara-shi,,Nara,Eastern Asia,Japan,34.691,135.77,,44955,67,,,,,,,http://data.gbif.org/occurrences/204367373,http://data.gbif.org/ws/rest/occurrence/get?key=204367373
"National Museum of Nature and Science, Japan","Plant specimens depodited in Osaka Museum of Natural History, Japan.",,,,,,,OSA,OSA,165673,Specimen,,15:34.0,,,Arisaema heterophyllum Blume,Blume,Arisaema heterophyllum Blume,Plantae,,,,Araceae,Arisaema,Japan,Japan,,Nara-shi,,Nara,Eastern Asia,Japan,34.6599,135.816,,44955,68,,,,,,,http://data.gbif.org/occurrences/204367376,http://data.gbif.org/ws/rest/occurrence/get?key=204367376
"National Museum of Nature and Science, Japan",Vascular Plant Specimen Database of Kanagawa Prefectural Museum of Natural History,,,,,,,KPM,NA,KPM-NA0192250,Specimen,,22:14.0,,,Arisaema heterophyllum Blume,,Arisaema heterophyllum Blume,Plantae,Angiospermae,Monocotyledoneae,,ARACEAE,Arisaema,Japan,Japan,,"Shimotsuga-gun, Fujioka-machi",,Tochigi Prefecture,Eastern Asia,Japan,,,,,,,,,,,,http://data.gbif.org/occurrences/388792687,http://data.gbif.org/ws/rest/occurrence/get?key=388792687
"National Museum of Nature and Science, Japan",Vascular Plant Specimen Database of Kanagawa Prefectural Museum of Natural History,,,,,,,KPM,NA,KPM-NA0191804,Specimen,,22:14.0,,,Arisaema heterophyllum Blume,,Arisaema heterophyllum Blume,Plantae,Angiospermae,Monocotyledoneae,,ARACEAE,Arisaema,Japan,Japan,,"Kitasaitama-gun,, Kitakawabe-machi",,Saitama Prefecture,Eastern Asia,Japan,,,,,,,,,,,,http://data.gbif.org/occurrences/388792684,http://data.gbif.org/ws/rest/occurrence/get?key=388792684
"National Museum of Nature and Science, Japan",Vascular Plant Specimen Database of Kanagawa Prefectural Museum of Natural History,,,,,,,KPM,NA,KPM-NA0199082,Specimen,,22:14.0,,,Arisaema heterophyllum Blume,,Arisaema heterophyllum Blume,Plantae,Angiospermae,Monocotyledoneae,,ARACEAE,Arisaema,Japan,Japan,,"Shimotsuga-gun, Fujioka-machi",,Tochigi Prefecture,Eastern Asia,Japan,,,,,,,,,16,,,http://data.gbif.org/occurrences/388792696,http://data.gbif.org/ws/rest/occurrence/get?key=388792696
"National Museum of Nature and Science, Japan",Vascular plant specimens of Akita Prefectural Museum,,,,,,,AKPM,vs,32332,Specimen,,39:09.0,,,Arisaema heterophyllum Blume,Blume,Arisaema heterophyllum Blume,Plantae,Spermatophyta,Monocotyledoneae,,Araceae,Arisaema,Japan,Japan,,Kitaakita-gun Takanosumachi,,Akita,Eastern Asia,Japan,,,,,,,,,,,,http://data.gbif.org/occurrences/296209056,http://data.gbif.org/ws/rest/occurrence/get?key=296209056
"National Museum of Nature and Science, Japan",Vascular plant specimens of Akita Prefectural Museum,,,,,,,AKPM,vs,30268,Specimen,,39:09.0,,,Arisaema heterophyllum Blume,Blume,Arisaema heterophyllum Blume,Plantae,Spermatophyta,Monocotyledoneae,,Araceae,Arisaema,Japan,Japan,,Kitaakita-gun Takanosumachi,,Akita,Eastern Asia,Japan,,,,,,,,,,,,http://data.gbif.org/occurrences/296209023,http://data.gbif.org/ws/rest/occurrence/get?key=296209023
"National Museum of Nature and Science, Japan",Vascular plant specimens of Akita Prefectural Museum,,,,,,,AKPM,vs,30269,Specimen,,39:09.0,,,Arisaema heterophyllum Blume,Blume,Arisaema heterophyllum Blume,Plantae,Spermatophyta,Monocotyledoneae,,Araceae,Arisaema,Japan,Japan,,Kitaakita-gun Takanosumachi,,Akita,Eastern Asia,Japan,,,,,,,,,,,,http://data.gbif.org/occurrences/296209017,http://data.gbif.org/ws/rest/occurrence/get?key=296209017
