Data Publisher,Dataset,Dataset Rights,Collector name,Collector number,Field number,GUID,Date collected,Institution code,Collection code,Catalogue number,Basis of record,Image url,Last indexed,Identifier,Identification date,Scientific name,Author,Scientific name (interpreted),Kingdom,Phylum,Class,Order,Family,Genus,Country,Country (interpreted),Locality,County,Continent or Ocean,State/Province,Region,Publisher country,Latitude,Longitude,Coordinate precision,Cell id,Centi cell id,Min depth,Max depth,Max depth,Min altitude,Max altitude,Altitude precision,GBIF portal url,GBIF webservice url
"National Institute of Genetics, ROIS","Herbarium Specimens of Museum of Nature and Human Activities, Hyogo Pref., Japan",,,,,,,HYO,VP,C1-047661,Specimen,,23:12.0,,,Chimonanthus praecox,,Chimonanthus praecox,Plantae,Magnoliophyta,,,Calycanthaceae,Chimonanthus,Japan,Japan,"Honshu,Pref.Kyoto:In Oomoto Kameyama Botanic-cal Garden,Ten'onkyo,Kameoka-shi.",,,Kyoto,Eastern Asia,Japan,,,,,,,,,300,300,,http://data.gbif.org/occurrences/323504431,http://data.gbif.org/ws/rest/occurrence/get?key=323504431
Yale University Peabody Museum,Peabody Paleoportal DiGIR Service (PB),"Peabody Museum data records may be used by individual researchers or research groups, but they may not be repackaged, resold, or redistributed in any form without the express written consent of a curatorial staff member of the museum. If any of these records are used in an analysis or report, the provenance of the original data must be acknowledged and the Peabody notified. Yale University and the Peabody Museum of Natural History and its staff are not responsible for damages, injury or loss due to the use of these data.",,,,,,YPM,PB,YPM PB 161246,Specimen,,45:52.0,,,Chimonanthus praecox,(L.) Link,Chimonanthus praecox,Plantae,Tracheophyta,,Laurales,Calycanthaceae,Chimonanthus,Japan,Japan,,,Asia,,Eastern Asia,United States,,,,,,,,,,,,http://data.gbif.org/occurrences/352134236,http://data.gbif.org/ws/rest/occurrence/get?key=352134236
Yale University Peabody Museum,Peabody Paleoportal DiGIR Service (PB),"Peabody Museum data records may be used by individual researchers or research groups, but they may not be repackaged, resold, or redistributed in any form without the express written consent of a curatorial staff member of the museum. If any of these records are used in an analysis or report, the provenance of the original data must be acknowledged and the Peabody notified. Yale University and the Peabody Museum of Natural History and its staff are not responsible for damages, injury or loss due to the use of these data.",,,,,,YPM,PB,PB.161246,Specimen,,11:26.0,,,Chimonanthus praecox,(L.) Link,Chimonanthus praecox,Plantae,Tracheophyta,,Laurales,Calycanthaceae,Chimonanthus,Japan,Japan,,,Asia,,Eastern Asia,United States,,,,,,,,,,,,http://data.gbif.org/occurrences/203331364,http://data.gbif.org/ws/rest/occurrence/get?key=203331364
Yale University Peabody Museum,Peabody Paleobotany DiGIR Service,"Peabody Museum data records may be used by individual researchers or research groups, but they may not be repackaged, resold, or redistributed in any form without the express written consent of a curatorial staff member of the museum. If any of these records are used in an analysis or report, the provenance of the original data must be acknowledged and the Peabody notified. Yale University and the Peabody Museum of Natural History and its staff are not responsible for damages, injury or loss due to the use of these data.",,,,,,YPM,PB,YPM PB 161246,Specimen,,08:29.0,,,Chimonanthus praecox,(L.) Link,Chimonanthus praecox,Plantae,Tracheophyta,,Laurales,Calycanthaceae,Chimonanthus,Japan,Japan,,,Asia,,Eastern Asia,United States,,,,,,,,,,,,http://data.gbif.org/occurrences/352246089,http://data.gbif.org/ws/rest/occurrence/get?key=352246089
Yale University Peabody Museum,Peabody Paleobotany DiGIR Service,"Peabody Museum data records may be used by individual researchers or research groups, but they may not be repackaged, resold, or redistributed in any form without the express written consent of a curatorial staff member of the museum. If any of these records are used in an analysis or report, the provenance of the original data must be acknowledged and the Peabody notified. Yale University and the Peabody Museum of Natural History and its staff are not responsible for damages, injury or loss due to the use of these data.",,,,,,YPM,PB,PB.161246,Specimen,,41:53.0,,,Chimonanthus praecox,(L.) Link,Chimonanthus praecox,Plantae,Tracheophyta,,Laurales,Calycanthaceae,Chimonanthus,Japan,Japan,,,Asia,,Eastern Asia,United States,,,,,,,,,,,,http://data.gbif.org/occurrences/202606878,http://data.gbif.org/ws/rest/occurrence/get?key=202606878
"National Museum of Nature and Science, Japan","Plant specimens depodited in Osaka Museum of Natural History, Japan.",,,,,,,OSA,C,OSA67671,Specimen,,17:22.0,,,Chimonanthus praecox (L. )Link.,,Chimonanthus praecox (L.) Link.,Plantae,,,,Calycanthaceae,Chimonanthus,Japan,Japan,,Kameoka-shi,,Kyoto,Eastern Asia,Japan,,,,,,,,,,,,http://data.gbif.org/occurrences/295119316,http://data.gbif.org/ws/rest/occurrence/get?key=295119316
"National Museum of Nature and Science, Japan","Botanical specimens database of Mr. Jiro Ito collection, Shizuoka Prefecture Museum of Natural History",,,,,,,SPMN,a,SPMN-a-309,Specimen,,37:35.0,,,Chimonanthus praecox (L.) Link,(L.) Link,Chimonanthus praecox (L.) Link,Plantae,Magnoliophyta,Magnoliopsida,Laurales,Calycanthaceae,Chimonanthus,Japan,Japan,,Shizuoka-shi,,Shizuoka,Eastern Asia,Japan,,,,,,,,,,,,http://data.gbif.org/occurrences/380182045,http://data.gbif.org/ws/rest/occurrence/get?key=380182045
"National Museum of Nature and Science, Japan","Botanical specimens database of Mr. Jiro Ito collection, Shizuoka Prefecture Museum of Natural History",,,,,,,SPMN,a,SPMN-a-310,Specimen,,37:35.0,,,Chimonanthus praecox (L.) Link,(L.) Link,Chimonanthus praecox (L.) Link,Plantae,Magnoliophyta,Magnoliopsida,Laurales,Calycanthaceae,Chimonanthus,Japan,Japan,Oiwa,Shizuoka-shi,,Shizuoka,Eastern Asia,Japan,,,,,,,,,,,,http://data.gbif.org/occurrences/380182046,http://data.gbif.org/ws/rest/occurrence/get?key=380182046
University of Connecticut,CONN,,Tomitar? Makino,220568,,,,UConn,CONN,CONN00057914,Specimen,,26:12.0,,,Chimonanthus praecox (L.) Link,,Chimonanthus praecox (L.) Link,,,,Laurales,Calycanthaceae,Chimonanthus,JP,Japan,Oizumi,,,Honshu,Eastern Asia,United States,,,,,,,,,,,,http://data.gbif.org/occurrences/415934648,http://data.gbif.org/ws/rest/occurrence/get?key=415934648
"National Museum of Nature and Science, Japan","FKSE-Herbarium specimens of Faculty of Symbiotic Systems Science, Fukushima University, Japan",,,,,,,FKSE,Plant,4588,Specimen,,51:26.0,,,Chimonanthus praecox (L.) Link,(L.) Link,Chimonanthus praecox (L.) Link,Plantae,,,,CALYCANTHACEAE,Chimonanthus,Japan,Japan,"Honshu, Tohoku Distr., Fukushima Pref., Nihonmatsu-shi, Kasumigajyo",,,,Eastern Asia,Japan,,,,,,,,,,,,http://data.gbif.org/occurrences/238091522,http://data.gbif.org/ws/rest/occurrence/get?key=238091522
"National Museum of Nature and Science, Japan","Herbarium Specimens of Tokushima Prefectural Museum, Japan",,,,,,,TKPM,B,SP139004,Specimen,,22:17.0,,,Chimonanthus praecox (L.) Link,(L.) Link,Chimonanthus praecox (L.) Link,Plantae,Angiospermae,Dicotyledoneae,Angiospermae,Calycanthaceae,Chimonanthus,Japan,Japan,,Kouchi City,,Kouchi Pref.,Eastern Asia,Japan,,,,,,,,,,,,http://data.gbif.org/occurrences/150129869,http://data.gbif.org/ws/rest/occurrence/get?key=150129869
"National Museum of Nature and Science, Japan","Herbarium Specimens of Tokushima Prefectural Museum, Japan",,,,,,,TKPM,B,SP035914,Specimen,,22:16.0,,,Chimonanthus praecox (L.) Link,(L.) Link,Chimonanthus praecox (L.) Link,Plantae,Angiospermae,Dicotyledoneae,Angiospermae,Calycanthaceae,Chimonanthus,Japan,Japan,,Tokushima City,,Tokushima Pref.,Eastern Asia,Japan,,,,,,,,,,,,http://data.gbif.org/occurrences/150129197,http://data.gbif.org/ws/rest/occurrence/get?key=150129197
"National Institute of Genetics, ROIS","Plant Specimen Database of Tama Forest Science Garden, Forestry and Forest Products Research Institute, Japan",,,,,,,FFPRI,TFA,6718,Specimen,,21:23.0,,,Chimonanthus praecox (L.) Link,,Chimonanthus praecox (L.) Link,Plantae,Magnoliophyta,Magnoliopsida,Laurales,Calycanthaceae,Chimonanthus,Japan,Japan,"Asakawa Experimental Forest, Forestry and Forest Products Research Institute",Hatiozi City,,Tokyo Prefecture,Eastern Asia,Japan,35.646755,139.27286,,45319,62,,,,180,250,,http://data.gbif.org/occurrences/360250013,http://data.gbif.org/ws/rest/occurrence/get?key=360250013
"National Institute of Genetics, ROIS","Plant Specimen Database of Tama Forest Science Garden, Forestry and Forest Products Research Institute, Japan",,,,,,,FFPRI,TFA,6720,Specimen,,21:23.0,,,Chimonanthus praecox (L.) Link,,Chimonanthus praecox (L.) Link,Plantae,Magnoliophyta,Magnoliopsida,Laurales,Calycanthaceae,Chimonanthus,Japan,Japan,"Asakawa Experimental Forest, Forestry and Forest Products Research Institute",Hatiozi City,,Tokyo Prefecture,Eastern Asia,Japan,35.646755,139.27286,,45319,62,,,,180,250,,http://data.gbif.org/occurrences/360250015,http://data.gbif.org/ws/rest/occurrence/get?key=360250015
"National Institute of Genetics, ROIS","Plant Specimen Database of Tama Forest Science Garden, Forestry and Forest Products Research Institute, Japan",,,,,,,FFPRI,TFA,6716,Specimen,,21:23.0,,,Chimonanthus praecox (L.) Link,,Chimonanthus praecox (L.) Link,Plantae,Magnoliophyta,Magnoliopsida,Laurales,Calycanthaceae,Chimonanthus,Japan,Japan,"Asakawa Experimental Forest, Forestry and Forest Products Research Institute",Hatiozi City,,Tokyo Prefecture,Eastern Asia,Japan,35.646755,139.27286,,45319,62,,,,180,250,,http://data.gbif.org/occurrences/360250011,http://data.gbif.org/ws/rest/occurrence/get?key=360250011
"National Institute of Genetics, ROIS","Plant Specimen Database of Tama Forest Science Garden, Forestry and Forest Products Research Institute, Japan",,,,,,,FFPRI,TFA,6719,Specimen,,21:23.0,,,Chimonanthus praecox (L.) Link,,Chimonanthus praecox (L.) Link,Plantae,Magnoliophyta,Magnoliopsida,Laurales,Calycanthaceae,Chimonanthus,Japan,Japan,"Asakawa Experimental Forest, Forestry and Forest Products Research Institute",Hatiozi City,,Tokyo Prefecture,Eastern Asia,Japan,35.646755,139.27286,,45319,62,,,,180,250,,http://data.gbif.org/occurrences/360250014,http://data.gbif.org/ws/rest/occurrence/get?key=360250014
"National Institute of Genetics, ROIS","Plant Specimen Database of Tama Forest Science Garden, Forestry and Forest Products Research Institute, Japan",,,,,,,FFPRI,TFA,6717,Specimen,,21:23.0,,,Chimonanthus praecox (L.) Link,,Chimonanthus praecox (L.) Link,Plantae,Magnoliophyta,Magnoliopsida,Laurales,Calycanthaceae,Chimonanthus,Japan,Japan,"Asakawa Experimental Forest, Forestry and Forest Products Research Institute",Hatiozi City,,Tokyo Prefecture,Eastern Asia,Japan,35.646755,139.27286,,45319,62,,,,180,250,,http://data.gbif.org/occurrences/360250012,http://data.gbif.org/ws/rest/occurrence/get?key=360250012
"National Museum of Nature and Science, Japan","Plant specimens depodited in Osaka Museum of Natural History, Japan.",,,,,,,OSA,C,OSA48247,Specimen,,17:21.0,,,Chimonanthus praecox (L.) Link,(L.) Link,Chimonanthus praecox (L.) Link,Plantae,,,,Calycanthacaea,Chimonanthus,Japan,Japan,"Nagai Botanical Garden, cult.",Osaka-shi,,Osaka Prefecture,Eastern Asia,Japan,,,,,,,,,,,,http://data.gbif.org/occurrences/295119154,http://data.gbif.org/ws/rest/occurrence/get?key=295119154
"National Museum of Nature and Science, Japan","Plant specimens depodited in Osaka Museum of Natural History, Japan.",,,,,,,OSA,C,OSA53915,Specimen,,17:21.0,,,Chimonanthus praecox (L.) Link,(L.) Link,Chimonanthus praecox (L.) Link,Plantae,,,,Calycanthacaea,Chimonanthus,Japan,Japan,Nagai Botanical Garden,Osaka-shi,,Osaka Prefecture,Eastern Asia,Japan,,,,,,,,,,,,http://data.gbif.org/occurrences/295119188,http://data.gbif.org/ws/rest/occurrence/get?key=295119188
"National Museum of Nature and Science, Japan","Ibaraki Nature Museum, Vascular Plants collection",,,,,,,INM,Va,109740,Specimen,,49:59.0,,,Chimonanthus praecox (Linn.) Link,(Linn.) Link,Chimonanthus praecox (Linn.) Link,Plantae,SPERMATOPHYTAANGIOSPERMAE,DICOTYLEDONEAE,,CALYCANTHACEAE,Chimonanthus,Japan,Japan,,Kitaibaraki-shi,,Ibaraki,Eastern Asia,Japan,,,,,,,,,,,,http://data.gbif.org/occurrences/381796863,http://data.gbif.org/ws/rest/occurrence/get?key=381796863
"National Museum of Nature and Science, Japan",Kochi Prefectural Makino Botanical Garden,,,,,,,MBK,MBK,0001793-A,Specimen,,03:12.0,,,Chimonanthus praecox Link,Link,Chimonanthus praecox Link,Plantae,,,,Calycanthaceae,Chimonanthus,Japan,Japan,Oizumi,Nerima-ku,,Tokyo,Eastern Asia,Japan,,,,,,,,,,,,http://data.gbif.org/occurrences/354276396,http://data.gbif.org/ws/rest/occurrence/get?key=354276396
"National Museum of Nature and Science, Japan",Kochi Prefectural Makino Botanical Garden,,,,,,,MBK,MBK,0001796-B,Specimen,,03:12.0,,,Chimonanthus praecox Link,Link,Chimonanthus praecox Link,Plantae,,,,Calycanthaceae,Chimonanthus,Japan,Japan,Oizumi,Nerima-ku,,Tokyo,Eastern Asia,Japan,,,,,,,,,,,,http://data.gbif.org/occurrences/354276388,http://data.gbif.org/ws/rest/occurrence/get?key=354276388
"National Museum of Nature and Science, Japan",Kochi Prefectural Makino Botanical Garden,,,,,,,MBK,MBK,165608,Specimen,,03:12.0,,,Chimonanthus praecox Link,Link,Chimonanthus praecox Link,Plantae,,,,Calycanthaceae,Chimonanthus,Japan,Japan,Cult.,Nerima-ku,,Tokyo,Eastern Asia,Japan,,,,,,,,,,,,http://data.gbif.org/occurrences/354276385,http://data.gbif.org/ws/rest/occurrence/get?key=354276385
"National Museum of Nature and Science, Japan",Kochi Prefectural Makino Botanical Garden,,,,,,,MBK,MBK,0001794-A,Specimen,,03:12.0,,,Chimonanthus praecox Link,Link,Chimonanthus praecox Link,Plantae,,,,Calycanthaceae,Chimonanthus,Japan,Japan,Oizumi,Nerima-ku,,Tokyo,Eastern Asia,Japan,,,,,,,,,,,,http://data.gbif.org/occurrences/354276392,http://data.gbif.org/ws/rest/occurrence/get?key=354276392
"National Museum of Nature and Science, Japan",Kochi Prefectural Makino Botanical Garden,,,,,,,MBK,MBK,1437,Specimen,,37:30.0,,,Chimonanthus praecox Link,Link,Chimonanthus praecox Link,Plantae,,,,Calycanthaceae,Chimonanthus,Japan,Japan,Oizumi,Nerima-ku,,Tokyo,Eastern Asia,Japan,35.7663,139.592,,45319,75,,,,,,,http://data.gbif.org/occurrences/287493594,http://data.gbif.org/ws/rest/occurrence/get?key=287493594
"National Museum of Nature and Science, Japan",Kochi Prefectural Makino Botanical Garden,,,,,,,MBK,MBK,1434,Specimen,,37:29.0,,,Chimonanthus praecox Link,Link,Chimonanthus praecox Link,Plantae,,,,Calycanthaceae,Chimonanthus,Japan,Japan,Oizumi,Nerima-ku,,Tokyo,Eastern Asia,Japan,35.7663,139.592,,45319,75,,,,,,,http://data.gbif.org/occurrences/287493588,http://data.gbif.org/ws/rest/occurrence/get?key=287493588
"National Museum of Nature and Science, Japan",Kochi Prefectural Makino Botanical Garden,,,,,,,MBK,MBK,2108,Specimen,,03:11.0,,,Chimonanthus praecox Link,Link,Chimonanthus praecox Link,Plantae,,,,Calycanthaceae,Chimonanthus,Japan,Japan,Cult.,Nerima-ku,,Tokyo,Eastern Asia,Japan,,,,,,,,,,,,http://data.gbif.org/occurrences/354276323,http://data.gbif.org/ws/rest/occurrence/get?key=354276323
"National Museum of Nature and Science, Japan",Kochi Prefectural Makino Botanical Garden,,,,,,,MBK,MBK,1438,Specimen,,37:30.0,,,Chimonanthus praecox Link,Link,Chimonanthus praecox Link,Plantae,,,,Calycanthaceae,Chimonanthus,Japan,Japan,Oizumi,Nerima-ku,,Tokyo,Eastern Asia,Japan,35.7663,139.592,,45319,75,,,,,,,http://data.gbif.org/occurrences/287493596,http://data.gbif.org/ws/rest/occurrence/get?key=287493596
"National Museum of Nature and Science, Japan",Kochi Prefectural Makino Botanical Garden,,,,,,,MBK,MBK,1432,Specimen,,37:29.0,,,Chimonanthus praecox Link,Link,Chimonanthus praecox Link,Plantae,,,,Calycanthaceae,Chimonanthus,Japan,Japan,Oizumi,Nerima-ku,,Tokyo,Eastern Asia,Japan,35.7663,139.592,,45319,75,,,,,,,http://data.gbif.org/occurrences/287493584,http://data.gbif.org/ws/rest/occurrence/get?key=287493584
"National Museum of Nature and Science, Japan",Kochi Prefectural Makino Botanical Garden,,,,,,,MBK,MBK,1436,Specimen,,37:30.0,,,Chimonanthus praecox Link,Link,Chimonanthus praecox Link,Plantae,,,,Calycanthaceae,Chimonanthus,Japan,Japan,Oizumi,Nerima-ku,,Tokyo,Eastern Asia,Japan,35.7663,139.592,,45319,75,,,,,,,http://data.gbif.org/occurrences/287493592,http://data.gbif.org/ws/rest/occurrence/get?key=287493592
"National Museum of Nature and Science, Japan",Kochi Prefectural Makino Botanical Garden,,,,,,,MBK,MBK,0001794-B,Specimen,,03:12.0,,,Chimonanthus praecox Link,Link,Chimonanthus praecox Link,Plantae,,,,Calycanthaceae,Chimonanthus,Japan,Japan,Oizumi,Nerima-ku,,Tokyo,Eastern Asia,Japan,,,,,,,,,,,,http://data.gbif.org/occurrences/354276394,http://data.gbif.org/ws/rest/occurrence/get?key=354276394
"National Museum of Nature and Science, Japan",Kochi Prefectural Makino Botanical Garden,,,,,,,MBK,MBK,896,Specimen,,37:28.0,,,Chimonanthus praecox Link,Link,Chimonanthus praecox Link,Plantae,,,,Calycanthaceae,Chimonanthus,Japan,Japan,Cult.,Nerima-ku,,Tokyo,Eastern Asia,Japan,35.7663,139.592,,45319,75,,,,,,,http://data.gbif.org/occurrences/287493502,http://data.gbif.org/ws/rest/occurrence/get?key=287493502
"National Museum of Nature and Science, Japan",Kochi Prefectural Makino Botanical Garden,,,,,,,MBK,MBK,1795,Specimen,,03:12.0,,,Chimonanthus praecox Link,Link,Chimonanthus praecox Link,Plantae,,,,Calycanthaceae,Chimonanthus,Japan,Japan,Oizumi,Nerima-ku,,Tokyo,Eastern Asia,Japan,,,,,,,,,,,,http://data.gbif.org/occurrences/354276391,http://data.gbif.org/ws/rest/occurrence/get?key=354276391
"National Museum of Nature and Science, Japan",Kochi Prefectural Makino Botanical Garden,,,,,,,MBK,MBK,0001793-B,Specimen,,03:12.0,,,Chimonanthus praecox Link,Link,Chimonanthus praecox Link,Plantae,,,,Calycanthaceae,Chimonanthus,Japan,Japan,Oizumi,Nerima-ku,,Tokyo,Eastern Asia,Japan,,,,,,,,,,,,http://data.gbif.org/occurrences/354276397,http://data.gbif.org/ws/rest/occurrence/get?key=354276397
"National Museum of Nature and Science, Japan",Kochi Prefectural Makino Botanical Garden,,,,,,,MBK,MBK,185380,Specimen,,03:12.0,,,Chimonanthus praecox Link,Link,Chimonanthus praecox Link,Plantae,,,,Calycanthaceae,Chimonanthus,Japan,Japan,Oizumi,Nerima-ku,,Tokyo,Eastern Asia,Japan,,,,,,,,,,,,http://data.gbif.org/occurrences/354276399,http://data.gbif.org/ws/rest/occurrence/get?key=354276399
"National Museum of Nature and Science, Japan",Kochi Prefectural Makino Botanical Garden,,,,,,,MBK,MBK,1435,Specimen,,37:30.0,,,Chimonanthus praecox Link,Link,Chimonanthus praecox Link,Plantae,,,,Calycanthaceae,Chimonanthus,Japan,Japan,Oizumi,Nerima-ku,,Tokyo,Eastern Asia,Japan,35.7663,139.592,,45319,75,,,,,,,http://data.gbif.org/occurrences/287493589,http://data.gbif.org/ws/rest/occurrence/get?key=287493589
"National Museum of Nature and Science, Japan",Kochi Prefectural Makino Botanical Garden,,,,,,,MBK,MBK,1431,Specimen,,37:29.0,,,Chimonanthus praecox Link,Link,Chimonanthus praecox Link,Plantae,,,,Calycanthaceae,Chimonanthus,Japan,Japan,Oizumi,Nerima-ku,,Tokyo,Eastern Asia,Japan,35.7663,139.592,,45319,75,,,,,,,http://data.gbif.org/occurrences/287493581,http://data.gbif.org/ws/rest/occurrence/get?key=287493581
"National Museum of Nature and Science, Japan",Kochi Prefectural Makino Botanical Garden,,,,,,,MBK,MBK,0001796-A,Specimen,,03:12.0,,,Chimonanthus praecox Link,Link,Chimonanthus praecox Link,Plantae,,,,Calycanthaceae,Chimonanthus,Japan,Japan,Oizumi,Nerima-ku,,Tokyo,Eastern Asia,Japan,,,,,,,,,,,,http://data.gbif.org/occurrences/354276387,http://data.gbif.org/ws/rest/occurrence/get?key=354276387
"National Museum of Nature and Science, Japan",Kochi Prefectural Makino Botanical Garden,,,,,,,MBK,MBK,1433,Specimen,,37:29.0,,,Chimonanthus praecox Link,Link,Chimonanthus praecox Link,Plantae,,,,Calycanthaceae,Chimonanthus,Japan,Japan,Oizumi,Nerima-ku,,Tokyo,Eastern Asia,Japan,35.7663,139.592,,45319,75,,,,,,,http://data.gbif.org/occurrences/287493586,http://data.gbif.org/ws/rest/occurrence/get?key=287493586
"National Museum of Nature and Science, Japan",Kochi Prefectural Makino Botanical Garden,,,,,,,MBK,MBK,1430,Specimen,,37:29.0,,,Chimonanthus praecox Link,Link,Chimonanthus praecox Link,Plantae,,,,Calycanthaceae,Chimonanthus,Japan,Japan,Cult.,Nerima-ku,,Tokyo,Eastern Asia,Japan,35.7663,139.592,,45319,75,,,,,,,http://data.gbif.org/occurrences/287493579,http://data.gbif.org/ws/rest/occurrence/get?key=287493579
