Data Publisher,Dataset,Dataset Rights,Collector name,Collector number,Field number,GUID,Date collected,Institution code,Collection code,Catalogue number,Basis of record,Image url,Last indexed,Identifier,Identification date,Scientific name,Author,Scientific name (interpreted),Kingdom,Phylum,Class,Order,Family,Genus,Country,Country (interpreted),Locality,County,Continent or Ocean,State/Province,Region,Publisher country,Latitude,Longitude,Coordinate precision,Cell id,Centi cell id,Min depth,Max depth,Max depth,Min altitude,Max altitude,Altitude precision,GBIF portal url,GBIF webservice url
"National Museum of Nature and Science, Japan","Plant specimens depodited in Osaka Museum of Natural History, Japan.",,,,,,,OSA,C,OSA15728,Specimen,,25:10.0,,,Triumfetta japonica Mak.,Mak.,Triumfetta japonica Mak.,Plantae,,,,Tiliaceae,Triumfetta,Japan,Japan,,Owase-shi,,Mie Prefecture,Eastern Asia,Japan,,,,,,,,,,,,http://data.gbif.org/occurrences/295177117,http://data.gbif.org/ws/rest/occurrence/get?key=295177117
"National Museum of Nature and Science, Japan",Angiosperm specimens of Iwate Prefectural Museum,,,,,,,IPMM,PA,74208,Specimen,,00:21.0,,,Triumfetta japonica Makino,Makino,Triumfetta japonica Makino,Plantae,Angiospermae,Dicotyledoneae,,Tiliaceae,Triumfetta,Japan,Japan,,Shuuso-gun Tanbaracho,,Ehime,Eastern Asia,Japan,,,,,,,,,,,,http://data.gbif.org/occurrences/93896507,http://data.gbif.org/ws/rest/occurrence/get?key=93896507
"National Museum of Nature and Science, Japan","Herbarium Specimens of Tokushima Prefectural Museum, Japan",,,,,,,TKPM,B,SP030907,Specimen,,23:52.0,,,Triumfetta japonica Makino,Makino,Triumfetta japonica Makino,Plantae,Angiospermae,Dicotyledoneae,Angiospermae,Tiliaceae,Triumfetta,Japan,Japan,,Kamikatsu-cho,,Tokushima Pref.,Eastern Asia,Japan,,,,,,,,,,,,http://data.gbif.org/occurrences/150150968,http://data.gbif.org/ws/rest/occurrence/get?key=150150968
"National Museum of Nature and Science, Japan","Herbarium Specimens of Tokushima Prefectural Museum, Japan",,,,,,,TKPM,B,SP010306,Specimen,,23:51.0,,,Triumfetta japonica Makino,Makino,Triumfetta japonica Makino,Plantae,Angiospermae,Dicotyledoneae,Angiospermae,Tiliaceae,Triumfetta,Japan,Japan,,Wajiki-cho,,Tokushima Pref.,Eastern Asia,Japan,,,,,,,,,,,,http://data.gbif.org/occurrences/150150816,http://data.gbif.org/ws/rest/occurrence/get?key=150150816
"National Museum of Nature and Science, Japan","Herbarium Specimens of Tokushima Prefectural Museum, Japan",,,,,,,TKPM,B,SP046845,Specimen,,23:52.0,,,Triumfetta japonica Makino,Makino,Triumfetta japonica Makino,Plantae,Angiospermae,Dicotyledoneae,Angiospermae,Tiliaceae,Triumfetta,Japan,Japan,,Muroto City,,Kouchi Pref.,Eastern Asia,Japan,,,,,,,,,,,,http://data.gbif.org/occurrences/150151107,http://data.gbif.org/ws/rest/occurrence/get?key=150151107
"National Museum of Nature and Science, Japan","Herbarium Specimens of Tokushima Prefectural Museum, Japan",,,,,,,TKPM,B,SP134894,Specimen,,23:53.0,,,Triumfetta japonica Makino,Makino,Triumfetta japonica Makino,Plantae,Angiospermae,Dicotyledoneae,Angiospermae,Tiliaceae,Triumfetta,Japan,Japan,,Haruno-cho,,Kouchi Pref.,Eastern Asia,Japan,,,,,,,,,,,,http://data.gbif.org/occurrences/150151256,http://data.gbif.org/ws/rest/occurrence/get?key=150151256
"National Museum of Nature and Science, Japan","Herbarium Specimens of Tokushima Prefectural Museum, Japan",,,,,,,TKPM,B,SP134897,Specimen,,23:53.0,,,Triumfetta japonica Makino,Makino,Triumfetta japonica Makino,Plantae,Angiospermae,Dicotyledoneae,Angiospermae,Tiliaceae,Triumfetta,Japan,Japan,,Kouchi City,,Kouchi Pref.,Eastern Asia,Japan,,,,,,,,,,,,http://data.gbif.org/occurrences/150151259,http://data.gbif.org/ws/rest/occurrence/get?key=150151259
"National Museum of Nature and Science, Japan","Herbarium Specimens of Tokushima Prefectural Museum, Japan",,,,,,,TKPM,B,SP038557,Specimen,,23:52.0,,,Triumfetta japonica Makino,Makino,Triumfetta japonica Makino,Plantae,Angiospermae,Dicotyledoneae,Angiospermae,Tiliaceae,Triumfetta,Japan,Japan,,Kaminaka-cho,,Tokushima Pref.,Eastern Asia,Japan,,,,,,,,,,,,http://data.gbif.org/occurrences/150150985,http://data.gbif.org/ws/rest/occurrence/get?key=150150985
"National Museum of Nature and Science, Japan","Herbarium Specimens of Tokushima Prefectural Museum, Japan",,,,,,,TKPM,B,SP134891,Specimen,,23:53.0,,,Triumfetta japonica Makino,Makino,Triumfetta japonica Makino,Plantae,Angiospermae,Dicotyledoneae,Angiospermae,Tiliaceae,Triumfetta,Japan,Japan,,Haruno-cho,,Kouchi Pref.,Eastern Asia,Japan,,,,,,,,,,,,http://data.gbif.org/occurrences/150151254,http://data.gbif.org/ws/rest/occurrence/get?key=150151254
"National Museum of Nature and Science, Japan","Herbarium Specimens of Tokushima Prefectural Museum, Japan",,,,,,,TKPM,B,SP134896,Specimen,,23:53.0,,,Triumfetta japonica Makino,Makino,Triumfetta japonica Makino,Plantae,Angiospermae,Dicotyledoneae,Angiospermae,Tiliaceae,Triumfetta,Japan,Japan,,Kouchi City,,Kouchi Pref.,Eastern Asia,Japan,,,,,,,,,,,,http://data.gbif.org/occurrences/150151258,http://data.gbif.org/ws/rest/occurrence/get?key=150151258
"National Museum of Nature and Science, Japan","Herbarium Specimens of Tokushima Prefectural Museum, Japan",,,,,,,TKPM,B,SP041086,Specimen,,23:52.0,,,Triumfetta japonica Makino,Makino,Triumfetta japonica Makino,Plantae,Angiospermae,Dicotyledoneae,Angiospermae,Tiliaceae,Triumfetta,Japan,Japan,,Mugi-cho,,Tokushima Pref.,Eastern Asia,Japan,,,,,,,,,,,,http://data.gbif.org/occurrences/150151004,http://data.gbif.org/ws/rest/occurrence/get?key=150151004
"National Museum of Nature and Science, Japan","Herbarium Specimens of Tokushima Prefectural Museum, Japan",,,,,,,TKPM,B,SP134899,Specimen,,23:53.0,,,Triumfetta japonica Makino,Makino,Triumfetta japonica Makino,Plantae,Angiospermae,Dicotyledoneae,Angiospermae,Tiliaceae,Triumfetta,Japan,Japan,,Kouchi City,,Kouchi Pref.,Eastern Asia,Japan,,,,,,,,,,,,http://data.gbif.org/occurrences/150151260,http://data.gbif.org/ws/rest/occurrence/get?key=150151260
"National Museum of Nature and Science, Japan","Herbarium Specimens of Tokushima Prefectural Museum, Japan",,,,,,,TKPM,B,SP043895,Specimen,,23:52.0,,,Triumfetta japonica Makino,Makino,Triumfetta japonica Makino,Plantae,Angiospermae,Dicotyledoneae,Angiospermae,Tiliaceae,Triumfetta,Japan,Japan,,Kainan-cho,,Tokushima Pref.,Eastern Asia,Japan,,,,,,,,,,,,http://data.gbif.org/occurrences/150151080,http://data.gbif.org/ws/rest/occurrence/get?key=150151080
"National Museum of Nature and Science, Japan","Herbarium Specimens of Tokushima Prefectural Museum, Japan",,,,,,,TKPM,B,SP134895,Specimen,,23:53.0,,,Triumfetta japonica Makino,Makino,Triumfetta japonica Makino,Plantae,Angiospermae,Dicotyledoneae,Angiospermae,Tiliaceae,Triumfetta,Japan,Japan,,Kouchi City,,Kouchi Pref.,Eastern Asia,Japan,,,,,,,,,,,,http://data.gbif.org/occurrences/150151257,http://data.gbif.org/ws/rest/occurrence/get?key=150151257
"National Museum of Nature and Science, Japan","Herbarium Specimens of Tokushima Prefectural Museum, Japan",,,,,,,TKPM,B,SP134892,Specimen,,23:53.0,,,Triumfetta japonica Makino,Makino,Triumfetta japonica Makino,Plantae,Angiospermae,Dicotyledoneae,Angiospermae,Tiliaceae,Triumfetta,Japan,Japan,,Susaki City,,Kouchi Pref.,Eastern Asia,Japan,,,,,,,,,,,,http://data.gbif.org/occurrences/150151255,http://data.gbif.org/ws/rest/occurrence/get?key=150151255
"National Museum of Nature and Science, Japan","Herbarium Specimens of Tokushima Prefectural Museum, Japan",,,,,,,TKPM,B,SP042486,Specimen,,23:52.0,,,Triumfetta japonica Makino,Makino,Triumfetta japonica Makino,Plantae,Angiospermae,Dicotyledoneae,Angiospermae,Tiliaceae,Triumfetta,Japan,Japan,,Kaminaka-cho,,Tokushima Pref.,Eastern Asia,Japan,,,,,,,,,,,,http://data.gbif.org/occurrences/150151024,http://data.gbif.org/ws/rest/occurrence/get?key=150151024
"National Museum of Nature and Science, Japan","Herbarium Specimens of Tokushima Prefectural Museum, Japan",,,,,,,TKPM,B,SP010305,Specimen,,23:51.0,,,Triumfetta japonica Makino,Makino,Triumfetta japonica Makino,Plantae,Angiospermae,Dicotyledoneae,Angiospermae,Tiliaceae,Triumfetta,Japan,Japan,,Kainan-cho,,Tokushima Pref.,Eastern Asia,Japan,,,,,,,,,,,,http://data.gbif.org/occurrences/150150815,http://data.gbif.org/ws/rest/occurrence/get?key=150150815
"National Museum of Nature and Science, Japan","Herbarium Specimens of Tokushima Prefectural Museum, Japan",,,,,,,TKPM,B,SP041085,Specimen,,23:52.0,,,Triumfetta japonica Makino,Makino,Triumfetta japonica Makino,Plantae,Angiospermae,Dicotyledoneae,Angiospermae,Tiliaceae,Triumfetta,Japan,Japan,,Mugi-cho,,Tokushima Pref.,Eastern Asia,Japan,,,,,,,,,,,,http://data.gbif.org/occurrences/150151005,http://data.gbif.org/ws/rest/occurrence/get?key=150151005
"National Museum of Nature and Science, Japan",Kochi Prefectural Makino Botanical Garden,,,,,,,MBK,MBK,10795,Specimen,,04:49.0,,,Triumfetta japonica Makino,,Triumfetta japonica Makino,Plantae,,,Malvales,Tiliaceae,Triumfetta,Japan,Japan,,Kochi City,,Pref. Kochi,Eastern Asia,Japan,33.5458,133.581,,44593,55,,,,,,,http://data.gbif.org/occurrences/143974750,http://data.gbif.org/ws/rest/occurrence/get?key=143974750
"National Museum of Nature and Science, Japan",Kochi Prefectural Makino Botanical Garden,,,,,,,MBK,MBK,10800,Specimen,,04:50.0,,,Triumfetta japonica Makino,,Triumfetta japonica Makino,Plantae,,,Malvales,Tiliaceae,Triumfetta,Japan,Japan,,Kochi City,,Pref. Kochi,Eastern Asia,Japan,33.6042,133.569,,44593,65,,,,,,,http://data.gbif.org/occurrences/143974755,http://data.gbif.org/ws/rest/occurrence/get?key=143974755
"National Museum of Nature and Science, Japan",Kochi Prefectural Makino Botanical Garden,,,,,,,MBK,MBK,4183,Specimen,,04:53.0,,,Triumfetta japonica Makino,Makino,Triumfetta japonica Makino,Plantae,,,,Tiliaceae,Triumfetta,Japan,Japan,Oizumi,Nerima-ku,,Tokyo,Eastern Asia,Japan,,,,,,,,,,,,http://data.gbif.org/occurrences/354284408,http://data.gbif.org/ws/rest/occurrence/get?key=354284408
"National Museum of Nature and Science, Japan",Kochi Prefectural Makino Botanical Garden,,,,,,,MBK,MBK,707,Specimen,,23:23.0,,,Triumfetta japonica Makino,Makino,Triumfetta japonica Makino,Plantae,,,,Tiliaceae,Triumfetta,Japan,Japan,Oizumi,Nerima-ku,,Tokyo,Eastern Asia,Japan,35.7663,139.592,,45319,75,,,,,,,http://data.gbif.org/occurrences/287515170,http://data.gbif.org/ws/rest/occurrence/get?key=287515170
"National Museum of Nature and Science, Japan",Kochi Prefectural Makino Botanical Garden,,,,,,,MBK,MBK,10796,Specimen,,04:49.0,,,Triumfetta japonica Makino,,Triumfetta japonica Makino,Plantae,,,Malvales,Tiliaceae,Triumfetta,Japan,Japan,,Kahoku Town,,Pref. Kochi,Eastern Asia,Japan,33.6875,133.769,,44593,67,,,,,,,http://data.gbif.org/occurrences/143974751,http://data.gbif.org/ws/rest/occurrence/get?key=143974751
"National Museum of Nature and Science, Japan",Kochi Prefectural Makino Botanical Garden,,,,,,,MBK,MBK,10798,Specimen,,04:49.0,,,Triumfetta japonica Makino,,Triumfetta japonica Makino,Plantae,,,Malvales,Tiliaceae,Triumfetta,Japan,Japan,,Kochi City,,Pref. Kochi,Eastern Asia,Japan,33.5625,133.519,,44593,55,,,,,,,http://data.gbif.org/occurrences/143974753,http://data.gbif.org/ws/rest/occurrence/get?key=143974753
"National Museum of Nature and Science, Japan",Kochi Prefectural Makino Botanical Garden,,,,,,,MBK,MBK,2003,Specimen,,04:53.0,,,Triumfetta japonica Makino,Makino,Triumfetta japonica Makino,Plantae,,,,Tiliaceae,Triumfetta,Japan,Japan,Oizumi,Nerima-ku,,Tokyo,Eastern Asia,Japan,,,,,,,,,,,,http://data.gbif.org/occurrences/354284314,http://data.gbif.org/ws/rest/occurrence/get?key=354284314
"National Museum of Nature and Science, Japan",Kochi Prefectural Makino Botanical Garden,,,,,,,MBK,MBK,10799,Specimen,,04:50.0,,,Triumfetta japonica Makino,,Triumfetta japonica Makino,Plantae,,,Malvales,Tiliaceae,Triumfetta,Japan,Japan,,Kochi City,,Pref. Kochi,Eastern Asia,Japan,,,,,,,,,,,,http://data.gbif.org/occurrences/143974754,http://data.gbif.org/ws/rest/occurrence/get?key=143974754
"National Museum of Nature and Science, Japan",Kochi Prefectural Makino Botanical Garden,,,,,,,MBK,MBK,2296,Specimen,,23:25.0,,,Triumfetta japonica Makino,Makino,Triumfetta japonica Makino,Plantae,,,,Tiliaceae,Triumfetta,Japan,Japan,Oizumi,Nerima-ku,,Tokyo,Eastern Asia,Japan,35.7663,139.592,,45319,75,,,,,,,http://data.gbif.org/occurrences/287515272,http://data.gbif.org/ws/rest/occurrence/get?key=287515272
"National Museum of Nature and Science, Japan",Kochi Prefectural Makino Botanical Garden,,,,,,,MBK,MBK,4184,Specimen,,04:54.0,,,Triumfetta japonica Makino,Makino,Triumfetta japonica Makino,Plantae,,,,Tiliaceae,Triumfetta,Japan,Japan,,Kochi-shi,,Kochi,Eastern Asia,Japan,,,,,,,,,,,,http://data.gbif.org/occurrences/354284694,http://data.gbif.org/ws/rest/occurrence/get?key=354284694
"National Museum of Nature and Science, Japan",Kochi Prefectural Makino Botanical Garden,,,,,,,MBK,MBK,10794,Specimen,,04:49.0,,,Triumfetta japonica Makino,,Triumfetta japonica Makino,Plantae,,,Malvales,Tiliaceae,Triumfetta,Japan,Japan,,Kochi City,,Pref. Kochi,Eastern Asia,Japan,33.5458,133.581,,44593,55,,,,,,,http://data.gbif.org/occurrences/143974749,http://data.gbif.org/ws/rest/occurrence/get?key=143974749
"National Museum of Nature and Science, Japan",Kochi Prefectural Makino Botanical Garden,,,,,,,MBK,MBK,10797,Specimen,,04:49.0,,,Triumfetta japonica Makino,,Triumfetta japonica Makino,Plantae,,,Malvales,Tiliaceae,Triumfetta,Japan,Japan,,Gohoku Village,,Pref. Kochi,Eastern Asia,Japan,33.7042,133.356,,44593,73,,,,900,,,http://data.gbif.org/occurrences/143974752,http://data.gbif.org/ws/rest/occurrence/get?key=143974752
"National Museum of Nature and Science, Japan",Plant Specimens of Kurashiki Museum of Natural History,,,,,,,KURA,KURA,kt162648,Specimen,,19:27.0,,,Triumfetta japonica Makino,Makino,Triumfetta japonica Makino,Plantae,,,Malvales,Tiliaceae,Triumfetta,Japan,Japan,,Setouchi-shi,,Okayama,Eastern Asia,Japan,,,,,,,,,,,,http://data.gbif.org/occurrences/204296185,http://data.gbif.org/ws/rest/occurrence/get?key=204296185
"National Museum of Nature and Science, Japan",Plant Specimens of Kurashiki Museum of Natural History,,,,,,,KURA,KURA,121307,Specimen,,19:24.0,,,Triumfetta japonica Makino,Makino,Triumfetta japonica Makino,Plantae,,,,Tiliaceae,Triumfetta,Japan,Japan,,,,Kumamoto,Eastern Asia,Japan,,,,,,,,,,,,http://data.gbif.org/occurrences/43181861,http://data.gbif.org/ws/rest/occurrence/get?key=43181861
"National Museum of Nature and Science, Japan",Plant Specimens of Kurashiki Museum of Natural History,,,,,,,KURA,KURA,121306,Specimen,,19:24.0,,,Triumfetta japonica Makino,Makino,Triumfetta japonica Makino,Plantae,,,,Tiliaceae,Triumfetta,Japan,Japan,,,,Kumamoto,Eastern Asia,Japan,,,,,,,,,,,,http://data.gbif.org/occurrences/43181848,http://data.gbif.org/ws/rest/occurrence/get?key=43181848
"National Museum of Nature and Science, Japan",Plant Specimens of Kurashiki Museum of Natural History,,,,,,,KURA,KURA,121308,Specimen,,19:24.0,,,Triumfetta japonica Makino,Makino,Triumfetta japonica Makino,Plantae,,,,Tiliaceae,Triumfetta,Japan,Japan,,,,Kumamoto,Eastern Asia,Japan,,,,,,,,,,,,http://data.gbif.org/occurrences/43181865,http://data.gbif.org/ws/rest/occurrence/get?key=43181865
"National Museum of Nature and Science, Japan",Plant Specimens of Kurashiki Museum of Natural History,,,,,,,KURA,KURA,155453,Specimen,,19:28.0,,,Triumfetta japonica Makino,Makino,Triumfetta japonica Makino,Plantae,,,Malvales,Tiliaceae,Triumfetta,Japan,Japan,,Higashiawakura-son,,Okayama,Eastern Asia,Japan,,,,,,,,,,,,http://data.gbif.org/occurrences/395809306,http://data.gbif.org/ws/rest/occurrence/get?key=395809306
"National Museum of Nature and Science, Japan",Plant Specimens of Kurashiki Museum of Natural History,,,,,,,KURA,KURA,121305,Specimen,,19:24.0,,,Triumfetta japonica Makino,Makino,Triumfetta japonica Makino,Plantae,,,,Tiliaceae,Triumfetta,Japan,Japan,,,,Fukuoka,Eastern Asia,Japan,,,,,,,,,,,,http://data.gbif.org/occurrences/43181876,http://data.gbif.org/ws/rest/occurrence/get?key=43181876
"National Museum of Nature and Science, Japan","Plant specimens depodited in Osaka Museum of Natural History, Japan.",,,,,,,OSA,C,OSA62886,Specimen,,25:12.0,,,Triumfetta japonica Makino,Makino,Triumfetta japonica Makino,Plantae,,,,Tiliaceae,Triumfetta,Japan,Japan,,Aira-gun,,Kagoshima Prefecture,Eastern Asia,Japan,,,,,,,,,,,,http://data.gbif.org/occurrences/295177503,http://data.gbif.org/ws/rest/occurrence/get?key=295177503
"National Museum of Nature and Science, Japan","Plant specimens depodited in Osaka Museum of Natural History, Japan.",,,,,,,OSA,C,OSA8544,Specimen,,25:10.0,,,Triumfetta japonica Makino,Makino,Triumfetta japonica Makino,Plantae,,,,Tiliaceae,Triumfetta,Japan,Japan,,Minamimuro-gun,,Mie Prefecture,Eastern Asia,Japan,,,,,,,,,,,,http://data.gbif.org/occurrences/295177052,http://data.gbif.org/ws/rest/occurrence/get?key=295177052
"National Museum of Nature and Science, Japan","Plant specimens depodited in Osaka Museum of Natural History, Japan.",,,,,,,OSA,C,OSA62885,Specimen,,25:12.0,,,Triumfetta japonica Makino,Makino,Triumfetta japonica Makino,Plantae,,,,Tiliaceae,Triumfetta,Japan,Japan,,Aira-gun,,Kagoshima Prefecture,Eastern Asia,Japan,,,,,,,,,,,,http://data.gbif.org/occurrences/295177502,http://data.gbif.org/ws/rest/occurrence/get?key=295177502
"National Museum of Nature and Science, Japan","Plant specimens depodited in Osaka Museum of Natural History, Japan.",,,,,,,OSA,C,OSA62887,Specimen,,25:12.0,,,Triumfetta japonica Makino,Makino,Triumfetta japonica Makino,Plantae,,,,Tiliaceae,Triumfetta,Japan,Japan,,Aira-gun,,Kagoshima Prefecture,Eastern Asia,Japan,,,,,,,,,,,,http://data.gbif.org/occurrences/295177504,http://data.gbif.org/ws/rest/occurrence/get?key=295177504
"National Museum of Nature and Science, Japan","Plant specimens depodited in Osaka Museum of Natural History, Japan.",,,,,,,OSA,C,OSA6068,Specimen,,25:10.0,,,Triumfetta japonica Makino,Makino,Triumfetta japonica Makino,Plantae,,,,Tiliaceae,Triumfetta,Japan,Japan,,Minamimuro-gun,,Mie Prefecture,Eastern Asia,Japan,,,,,,,,,,,,http://data.gbif.org/occurrences/295177042,http://data.gbif.org/ws/rest/occurrence/get?key=295177042
"National Museum of Nature and Science, Japan","Plant specimens depodited in Osaka Museum of Natural History, Japan.",,,,,,,OSA,C,OSA62888,Specimen,,25:12.0,,,Triumfetta japonica Makino,Makino,Triumfetta japonica Makino,Plantae,,,,Tiliaceae,Triumfetta,Japan,Japan,,Aira-gun,,Kagoshima Prefecture,Eastern Asia,Japan,,,,,,,,,,,,http://data.gbif.org/occurrences/295177505,http://data.gbif.org/ws/rest/occurrence/get?key=295177505
"National Museum of Nature and Science, Japan","Plant specimens depodited in Osaka Museum of Natural History, Japan.",,,,,,,OSA,OSA,111922,Specimen,,25:09.0,,,Triumfetta japonica Makino,Makino,Triumfetta japonica Makino,Plantae,,,,Tiliaceae,Triumfetta,Japan,Japan,,Yoshino-gun Totsukawamura,,Nara,Eastern Asia,Japan,34.4069,135.798,,44955,47,,,,,,,http://data.gbif.org/occurrences/204394286,http://data.gbif.org/ws/rest/occurrence/get?key=204394286
"National Museum of Nature and Science, Japan","Plant specimens depodited in Osaka Museum of Natural History, Japan.",,,,,,,OSA,C,OSA71803,Specimen,,25:12.0,,,Triumfetta japonica Makino,,Triumfetta japonica Makino,Plantae,,,,Tiliaceae,Triumfetta,Japan,Japan,,Kitamuro-gun Kiinagashimacho,,Mie,Eastern Asia,Japan,,,,,,,,,,,,http://data.gbif.org/occurrences/295177567,http://data.gbif.org/ws/rest/occurrence/get?key=295177567
