Data Publisher,Dataset,Dataset Rights,Collector name,Collector number,Field number,GUID,Date collected,Institution code,Collection code,Catalogue number,Basis of record,Image url,Last indexed,Identifier,Identification date,Scientific name,Author,Scientific name (interpreted),Kingdom,Phylum,Class,Order,Family,Genus,Country,Country (interpreted),Locality,County,Continent or Ocean,State/Province,Region,Publisher country,Latitude,Longitude,Coordinate precision,Cell id,Centi cell id,Min depth,Max depth,Max depth,Min altitude,Max altitude,Altitude precision,GBIF portal url,GBIF webservice url
"National Museum of Nature and Science, Japan",Herbarium of Kitakyushu Museum of Natural History and Human History,,,,,,,KMNH,KMNH,1994902GR19,Specimen,,12:23.0,,,Viburnum   wrightii   Miq.,,Viburnum wrightii Miq.,Plantae,,,Dipsacales,Caprifoliaceae,Viburnum,Japan,Japan,Shimoobira,"Ogata Town, Oono County",,Ooita  Pref.,Eastern Asia,Japan,,,,,,,,,,,,http://data.gbif.org/occurrences/150199402,http://data.gbif.org/ws/rest/occurrence/get?key=150199402
"National Institute of Genetics, ROIS","Herbarium Specimens of Museum of Nature and Human Activities, Hyogo Pref., Japan",,,,,,,HYO,VP,C1-013170,Specimen,,23:41.0,,,Viburnum wrightii,,Viburnum wrightii,Plantae,Magnoliophyta,,,Caprifoliaceae,Viburnum,Japan,Japan,"HONSHU. Pref.Hyogo: Mt.Takanami-san, Hikami-cho, Hikami-gun.",,,Hyogo,Eastern Asia,Japan,,,,,,,,,,,,http://data.gbif.org/occurrences/323506789,http://data.gbif.org/ws/rest/occurrence/get?key=323506789
"National Museum of Nature and Science, Japan","Plant Specimens of Taga Town Museum, Shiga Pref., Japan",,,,,,,TG,TG-B,TG-B-000929,Specimen,,25:18.0,,,Viburnum wrightii,,Viburnum wrightii,Plantae,SPERMATOPHYTA,DICOTYLEDONEAE,Caprifoliaceae,Caprifoliaceae,Viburnum,Japan,Japan,,"Hikone-city, Nakayama-cho",,Shiga,Eastern Asia,Japan,,,,,,,,,,,,http://data.gbif.org/occurrences/126840331,http://data.gbif.org/ws/rest/occurrence/get?key=126840331
"National Museum of Nature and Science, Japan",Vascular Plants Collection of National Museum of Nature and Science,,,,,,,TNS,VS,727097,Specimen,,17:53.0,,,Viburnum wrightii,,Viburnum wrightii,Plantae,,,,Caprifoliaceae,Viburnum,Japan,Japan,,,,Hyogo,Eastern Asia,Japan,,,,,,,,,,,,http://data.gbif.org/occurrences/42942282,http://data.gbif.org/ws/rest/occurrence/get?key=42942282
"National Museum of Nature and Science, Japan","Plant specimens depodited in Osaka Museum of Natural History, Japan.",,,,,,,OSA,C,OSA13713,Specimen,,25:23.0,,,"Viburnum wrightii Miq,","Miq,",Viburnum wrightii Miq,Plantae,,,,Caprifoliaceae,Viburnum,Japan,Japan,,Kurita-gun Rittocho,,Shiga Prefecture,Eastern Asia,Japan,,,,,,,,,,,,http://data.gbif.org/occurrences/295178801,http://data.gbif.org/ws/rest/occurrence/get?key=295178801
"National Museum of Nature and Science, Japan",Angiosperm specimens of Iwate Prefectural Museum,,,,,,,IPMM,PA,33764,Specimen,,00:25.0,,,Viburnum wrightii Miq.,Miq.,Viburnum wrightii Miq.,Plantae,Angiospermae,Sympetalae,Dipsacales,Caprifoliaceae,Viburnum,Japan,Japan,,Morioka-shi,,Iwate,Eastern Asia,Japan,,,,,,,,,,,,http://data.gbif.org/occurrences/204237421,http://data.gbif.org/ws/rest/occurrence/get?key=204237421
"National Museum of Nature and Science, Japan",Angiospermatatophytina Collection of Saitama Museum of Natural History,,,,,,,SMNH,As,16943,Specimen,,53:56.0,,,Viburnum wrightii Miq.,Miq.,Viburnum wrightii Miq.,Plantae,Angiospermae,Dicotyledoneae,Dipsacales,Caprifoliaceae,Viburnum,Japan,Japan,Mt. Kumakura-san,Chichibu-gun Arakawamura,,Saitama,Eastern Asia,Japan,,,,,,,,,,,,http://data.gbif.org/occurrences/393113344,http://data.gbif.org/ws/rest/occurrence/get?key=393113344
"National Museum of Nature and Science, Japan",Angiospermatatophytina Collection of Saitama Museum of Natural History,,,,,,,SMNH,As,3821,Specimen,,53:54.0,,,Viburnum wrightii Miq.,Miq.,Viburnum wrightii Miq.,Plantae,Angiospermae,Dicotyledoneae,Dipsacales,Caprifoliaceae,Viburnum,Japan,Japan,,Kitakoma-gun Sutamacho,,Yamanashi,Eastern Asia,Japan,,,,,,,,,,,,http://data.gbif.org/occurrences/353568908,http://data.gbif.org/ws/rest/occurrence/get?key=353568908
"National Museum of Nature and Science, Japan",Angiospermatatophytina Collection of Saitama Museum of Natural History,,,,,,,SMNH,As,16950,Specimen,,53:56.0,,,Viburnum wrightii Miq.,Miq.,Viburnum wrightii Miq.,Plantae,Angiospermae,Dicotyledoneae,Dipsacales,Caprifoliaceae,Viburnum,Japan,Japan,Mt. Futago-yama,Chichibu-gun Oganomachi,,Saitama,Eastern Asia,Japan,,,,,,,,,,,,http://data.gbif.org/occurrences/393113356,http://data.gbif.org/ws/rest/occurrence/get?key=393113356
"National Museum of Nature and Science, Japan",Angiospermatatophytina Collection of Saitama Museum of Natural History,,,,,,,SMNH,As,16960,Specimen,,53:56.0,,,Viburnum wrightii Miq.,Miq.,Viburnum wrightii Miq.,Plantae,Angiospermae,Dicotyledoneae,Dipsacales,Caprifoliaceae,Viburnum,Japan,Japan,Mt. Minoyama,Chichibu-gun Minanomachi,,Saitama,Eastern Asia,Japan,,,,,,,,,,,,http://data.gbif.org/occurrences/393113374,http://data.gbif.org/ws/rest/occurrence/get?key=393113374
"National Museum of Nature and Science, Japan",Angiospermatatophytina Collection of Saitama Museum of Natural History,,,,,,,SMNH,As,5534,Specimen,,53:55.0,,,Viburnum wrightii Miq.,Miq.,Viburnum wrightii Miq.,Plantae,Angiospermae,Dicotyledoneae,Dipsacales,Caprifoliaceae,Viburnum,Japan,Japan,,Hiki-gun Tokigawamura,,Saitama,Eastern Asia,Japan,,,,,,,,,,,,http://data.gbif.org/occurrences/353569052,http://data.gbif.org/ws/rest/occurrence/get?key=353569052
"National Museum of Nature and Science, Japan",Angiosperm specimens of Iwate Prefectural Museum,,,,,,,IPMM,PA,78636,Specimen,,00:26.0,,,Viburnum wrightii Miq.,Miq.,Viburnum wrightii Miq.,Plantae,Angiospermae,Sympetalae,Dipsacales,Caprifoliaceae,Viburnum,Japan,Japan,,Nishitsugaru-gun Ajigasawamachi,,Aomori,Eastern Asia,Japan,,,,,,,,,,,,http://data.gbif.org/occurrences/204237536,http://data.gbif.org/ws/rest/occurrence/get?key=204237536
"National Museum of Nature and Science, Japan",Angiospermatatophytina Collection of Saitama Museum of Natural History,,,,,,,SMNH,As,16958,Specimen,,53:56.0,,,Viburnum wrightii Miq.,Miq.,Viburnum wrightii Miq.,Plantae,Angiospermae,Dicotyledoneae,Dipsacales,Caprifoliaceae,Viburnum,Japan,Japan,Mt. Wanagura-san,Chichibu-gun Otakimura,,Saitama,Eastern Asia,Japan,,,,,,,,,,,,http://data.gbif.org/occurrences/393113370,http://data.gbif.org/ws/rest/occurrence/get?key=393113370
"National Museum of Nature and Science, Japan",Angiosperm specimens of Iwate Prefectural Museum,,,,,,,IPMM,PA,33762,Specimen,,00:25.0,,,Viburnum wrightii Miq.,Miq.,Viburnum wrightii Miq.,Plantae,Angiospermae,Sympetalae,Dipsacales,Caprifoliaceae,Viburnum,Japan,Japan,,Kitakami-shi,,Iwate,Eastern Asia,Japan,,,,,,,,,,,,http://data.gbif.org/occurrences/204237419,http://data.gbif.org/ws/rest/occurrence/get?key=204237419
"National Museum of Nature and Science, Japan",Angiosperm specimens of Iwate Prefectural Museum,,,,,,,IPMM,PA,41796,Specimen,,00:25.0,,,Viburnum wrightii Miq.,Miq.,Viburnum wrightii Miq.,Plantae,Angiospermae,Sympetalae,Dipsacales,Caprifoliaceae,Viburnum,Japan,Japan,,Morioka-shi,,Iwate,Eastern Asia,Japan,,,,,,,,,,,,http://data.gbif.org/occurrences/204237502,http://data.gbif.org/ws/rest/occurrence/get?key=204237502
"National Museum of Nature and Science, Japan",Angiosperm specimens of Iwate Prefectural Museum,,,,,,,IPMM,PA,30110,Specimen,,00:25.0,,,Viburnum wrightii Miq.,Miq.,Viburnum wrightii Miq.,Plantae,Angiospermae,Sympetalae,Dipsacales,Caprifoliaceae,Viburnum,Japan,Japan,,Higashitsugaru-gun Sotogahamamachi,,Aomori,Eastern Asia,Japan,,,,,,,,,,,,http://data.gbif.org/occurrences/204237344,http://data.gbif.org/ws/rest/occurrence/get?key=204237344
"National Museum of Nature and Science, Japan",Angiospermatatophytina Collection of Saitama Museum of Natural History,,,,,,,SMNH,As,16954,Specimen,,53:56.0,,,Viburnum wrightii Miq.,Miq.,Viburnum wrightii Miq.,Plantae,Angiospermae,Dicotyledoneae,Dipsacales,Caprifoliaceae,Viburnum,Japan,Japan,Mt. Futago-yama,Chichibu-gun Oganomachi,,Saitama,Eastern Asia,Japan,,,,,,,,,,,,http://data.gbif.org/occurrences/393113363,http://data.gbif.org/ws/rest/occurrence/get?key=393113363
"National Museum of Nature and Science, Japan",Angiosperm specimens of Iwate Prefectural Museum,,,,,,,IPMM,PA,23872,Specimen,,00:24.0,,,Viburnum wrightii Miq.,Miq.,Viburnum wrightii Miq.,Plantae,Angiospermae,Sympetalae,Dipsacales,Caprifoliaceae,Viburnum,Japan,Japan,,Morioka-shi,,Iwate,Eastern Asia,Japan,,,,,,,,,,,,http://data.gbif.org/occurrences/204237186,http://data.gbif.org/ws/rest/occurrence/get?key=204237186
"National Museum of Nature and Science, Japan",Angiospermatatophytina Collection of Saitama Museum of Natural History,,,,,,,SMNH,As,16956,Specimen,,53:56.0,,,Viburnum wrightii Miq.,Miq.,Viburnum wrightii Miq.,Plantae,Angiospermae,Dicotyledoneae,Dipsacales,Caprifoliaceae,Viburnum,Japan,Japan,Akazawa-dani valley,Chichibu-gun Otakimura,,Saitama,Eastern Asia,Japan,,,,,,,,,,,,http://data.gbif.org/occurrences/393113367,http://data.gbif.org/ws/rest/occurrence/get?key=393113367
"National Museum of Nature and Science, Japan",Angiospermatatophytina Collection of Saitama Museum of Natural History,,,,,,,SMNH,As,16963,Specimen,,53:56.0,,,Viburnum wrightii Miq.,Miq.,Viburnum wrightii Miq.,Plantae,Angiospermae,Dicotyledoneae,Dipsacales,Caprifoliaceae,Viburnum,Japan,Japan,Mt. Tenmaru-yama,Tano-gun Uenomura,,Gunma,Eastern Asia,Japan,,,,,,,,,,,,http://data.gbif.org/occurrences/393113379,http://data.gbif.org/ws/rest/occurrence/get?key=393113379
"National Museum of Nature and Science, Japan",Angiospermatatophytina Collection of Saitama Museum of Natural History,,,,,,,SMNH,As,16948,Specimen,,53:56.0,,,Viburnum wrightii Miq.,Miq.,Viburnum wrightii Miq.,Plantae,Angiospermae,Dicotyledoneae,Dipsacales,Caprifoliaceae,Viburnum,Japan,Japan,Urayama,Chichibu-shi,,Saitama,Eastern Asia,Japan,,,,,,,,,,,,http://data.gbif.org/occurrences/393113353,http://data.gbif.org/ws/rest/occurrence/get?key=393113353
"National Museum of Nature and Science, Japan",Angiospermatatophytina Collection of Saitama Museum of Natural History,,,,,,,SMNH,As,16953,Specimen,,53:56.0,,,Viburnum wrightii Miq.,Miq.,Viburnum wrightii Miq.,Plantae,Angiospermae,Dicotyledoneae,Dipsacales,Caprifoliaceae,Viburnum,Japan,Japan,Mt. Jinmi-yama,Chichibu-gun Nagatoromachi,,Saitama,Eastern Asia,Japan,,,,,,,,,,,,http://data.gbif.org/occurrences/393113361,http://data.gbif.org/ws/rest/occurrence/get?key=393113361
"National Museum of Nature and Science, Japan",Angiospermatatophytina Collection of Saitama Museum of Natural History,,,,,,,SMNH,As,16946,Specimen,,53:56.0,,,Viburnum wrightii Miq.,Miq.,Viburnum wrightii Miq.,Plantae,Angiospermae,Dicotyledoneae,Dipsacales,Caprifoliaceae,Viburnum,Japan,Japan,Mt. Ryokami-san,Chichibu-gun Ryokamimura,,Saitama,Eastern Asia,Japan,,,,,,,,,,,,http://data.gbif.org/occurrences/393113349,http://data.gbif.org/ws/rest/occurrence/get?key=393113349
"National Museum of Nature and Science, Japan",Angiosperm specimens of Iwate Prefectural Museum,,,,,,,IPMM,PA,33763,Specimen,,00:25.0,,,Viburnum wrightii Miq.,Miq.,Viburnum wrightii Miq.,Plantae,Angiospermae,Sympetalae,Dipsacales,Caprifoliaceae,Viburnum,Japan,Japan,,Waga-gun Nishiwagamachi,,Iwate,Eastern Asia,Japan,,,,,,,,,,,,http://data.gbif.org/occurrences/204237420,http://data.gbif.org/ws/rest/occurrence/get?key=204237420
"National Museum of Nature and Science, Japan",Angiospermatatophytina Collection of Saitama Museum of Natural History,,,,,,,SMNH,As,24081,Specimen,,53:58.0,,,Viburnum wrightii Miq.,Miq.,Viburnum wrightii Miq.,Plantae,Angiospermae,Dicotyledoneae,Dipsacales,Caprifoliaceae,Viburnum,Japan,Japan,Nagaone hill,Chichibu-shi,,Saitama,Eastern Asia,Japan,,,,,,,,,,,,http://data.gbif.org/occurrences/393113842,http://data.gbif.org/ws/rest/occurrence/get?key=393113842
"National Museum of Nature and Science, Japan",Angiospermatatophytina Collection of Saitama Museum of Natural History,,,,,,,SMNH,As,3817,Specimen,,53:54.0,,,Viburnum wrightii Miq.,Miq.,Viburnum wrightii Miq.,Plantae,Angiospermae,Dicotyledoneae,Dipsacales,Caprifoliaceae,Viburnum,Japan,Japan,,Chichibu-gun Otakimura,,Saitama,Eastern Asia,Japan,,,,,,,,,,,,http://data.gbif.org/occurrences/353568898,http://data.gbif.org/ws/rest/occurrence/get?key=353568898
"National Museum of Nature and Science, Japan",Angiospermatatophytina Collection of Saitama Museum of Natural History,,,,,,,SMNH,As,16949,Specimen,,53:56.0,,,Viburnum wrightii Miq.,Miq.,Viburnum wrightii Miq.,Plantae,Angiospermae,Dicotyledoneae,Dipsacales,Caprifoliaceae,Viburnum,Japan,Japan,Irikawa-dani valley,Chichibu-gun Otakimura,,Saitama,Eastern Asia,Japan,,,,,,,,,,,,http://data.gbif.org/occurrences/393113354,http://data.gbif.org/ws/rest/occurrence/get?key=393113354
"National Museum of Nature and Science, Japan",Angiosperm specimens of Iwate Prefectural Museum,,,,,,,IPMM,PA,23871,Specimen,,00:24.0,,,Viburnum wrightii Miq.,Miq.,Viburnum wrightii Miq.,Plantae,Angiospermae,Sympetalae,Dipsacales,Caprifoliaceae,Viburnum,Japan,Japan,,Kitakami-shi,,Iwate,Eastern Asia,Japan,,,,,,,,,,,,http://data.gbif.org/occurrences/204237185,http://data.gbif.org/ws/rest/occurrence/get?key=204237185
"National Museum of Nature and Science, Japan",Angiosperm specimens of Iwate Prefectural Museum,,,,,,,IPMM,PA,30114,Specimen,,00:25.0,,,Viburnum wrightii Miq.,Miq.,Viburnum wrightii Miq.,Plantae,Angiospermae,Sympetalae,Dipsacales,Caprifoliaceae,Viburnum,Japan,Japan,,Morioka-shi,,Iwate,Eastern Asia,Japan,,,,,,,,,,,,http://data.gbif.org/occurrences/204237348,http://data.gbif.org/ws/rest/occurrence/get?key=204237348
"National Museum of Nature and Science, Japan",Angiospermatatophytina Collection of Saitama Museum of Natural History,,,,,,,SMNH,As,4939,Specimen,,53:54.0,,,Viburnum wrightii Miq.,Miq.,Viburnum wrightii Miq.,Plantae,Angiospermae,Dicotyledoneae,Dipsacales,Caprifoliaceae,Viburnum,Japan,Japan,,Nishitama-gun Okutamamachi,,Tokyo,Eastern Asia,Japan,,,,,,,,,,,,http://data.gbif.org/occurrences/353569005,http://data.gbif.org/ws/rest/occurrence/get?key=353569005
"National Museum of Nature and Science, Japan",Angiosperm specimens of Iwate Prefectural Museum,,,,,,,IPMM,PA,41798,Specimen,,00:25.0,,,Viburnum wrightii Miq.,Miq.,Viburnum wrightii Miq.,Plantae,Angiospermae,Sympetalae,Dipsacales,Caprifoliaceae,Viburnum,Japan,Japan,,Ichinoseki-shi,,Iwate,Eastern Asia,Japan,,,,,,,,,,,,http://data.gbif.org/occurrences/204237504,http://data.gbif.org/ws/rest/occurrence/get?key=204237504
"National Museum of Nature and Science, Japan",Angiospermatatophytina Collection of Saitama Museum of Natural History,,,,,,,SMNH,As,16947,Specimen,,53:56.0,,,Viburnum wrightii Miq.,Miq.,Viburnum wrightii Miq.,Plantae,Angiospermae,Dicotyledoneae,Dipsacales,Caprifoliaceae,Viburnum,Japan,Japan,Mt. Ryokami-san,Chichibu-gun Ryokamimura,,Saitama,Eastern Asia,Japan,,,,,,,,,,,,http://data.gbif.org/occurrences/393113351,http://data.gbif.org/ws/rest/occurrence/get?key=393113351
"National Museum of Nature and Science, Japan",Angiosperm specimens of Iwate Prefectural Museum,,,,,,,IPMM,PA,41799,Specimen,,00:26.0,,,Viburnum wrightii Miq.,Miq.,Viburnum wrightii Miq.,Plantae,Angiospermae,Sympetalae,Dipsacales,Caprifoliaceae,Viburnum,Japan,Japan,,Ninohe-shi,,Iwate,Eastern Asia,Japan,,,,,,,,,,,,http://data.gbif.org/occurrences/204237505,http://data.gbif.org/ws/rest/occurrence/get?key=204237505
"National Museum of Nature and Science, Japan",Angiospermatatophytina Collection of Saitama Museum of Natural History,,,,,,,SMNH,As,3823,Specimen,,53:54.0,,,Viburnum wrightii Miq.,Miq.,Viburnum wrightii Miq.,Plantae,Angiospermae,Dicotyledoneae,Dipsacales,Caprifoliaceae,Viburnum,Japan,Japan,,Tano-gun Nakasatomura,,Gunma,Eastern Asia,Japan,,,,,,,,,,,,http://data.gbif.org/occurrences/353568912,http://data.gbif.org/ws/rest/occurrence/get?key=353568912
"National Museum of Nature and Science, Japan",Angiosperm specimens of Iwate Prefectural Museum,,,,,,,IPMM,PA,30116,Specimen,,00:25.0,,,Viburnum wrightii Miq.,Miq.,Viburnum wrightii Miq.,Plantae,Angiospermae,Sympetalae,Dipsacales,Caprifoliaceae,Viburnum,Japan,Japan,,Soma-gun Odakamachi,,Fukushima,Eastern Asia,Japan,,,,,,,,,,,,http://data.gbif.org/occurrences/204237350,http://data.gbif.org/ws/rest/occurrence/get?key=204237350
"National Museum of Nature and Science, Japan",Angiospermatatophytina Collection of Saitama Museum of Natural History,,,,,,,SMNH,As,3819,Specimen,,53:54.0,,,Viburnum wrightii Miq.,Miq.,Viburnum wrightii Miq.,Plantae,Angiospermae,Dicotyledoneae,Dipsacales,Caprifoliaceae,Viburnum,Japan,Japan,,Chichibu-gun Otakimura,,Saitama,Eastern Asia,Japan,,,,,,,,,,,,http://data.gbif.org/occurrences/353568903,http://data.gbif.org/ws/rest/occurrence/get?key=353568903
"National Museum of Nature and Science, Japan",Angiospermatatophytina Collection of Saitama Museum of Natural History,,,,,,,SMNH,As,3818,Specimen,,53:54.0,,,Viburnum wrightii Miq.,Miq.,Viburnum wrightii Miq.,Plantae,Angiospermae,Dicotyledoneae,Dipsacales,Caprifoliaceae,Viburnum,Japan,Japan,,Chichibu-gun Otakimura,,Saitama,Eastern Asia,Japan,,,,,,,,,,,,http://data.gbif.org/occurrences/353568901,http://data.gbif.org/ws/rest/occurrence/get?key=353568901
"National Museum of Nature and Science, Japan",Angiosperm specimens of Iwate Prefectural Museum,,,,,,,IPMM,PA,30112,Specimen,,00:25.0,,,Viburnum wrightii Miq.,Miq.,Viburnum wrightii Miq.,Plantae,Angiospermae,Sympetalae,Dipsacales,Caprifoliaceae,Viburnum,Japan,Japan,,Hakodate-shi,,Hokkaido,Eastern Asia,Japan,,,,,,,,,,,,http://data.gbif.org/occurrences/204237346,http://data.gbif.org/ws/rest/occurrence/get?key=204237346
"National Museum of Nature and Science, Japan",Angiosperm specimens of Iwate Prefectural Museum,,,,,,,IPMM,PA,41800,Specimen,,00:26.0,,,Viburnum wrightii Miq.,Miq.,Viburnum wrightii Miq.,Plantae,Angiospermae,Sympetalae,Dipsacales,Caprifoliaceae,Viburnum,Japan,Japan,,Sendai-shi,,Miyagi,Eastern Asia,Japan,,,,,,,,,,,,http://data.gbif.org/occurrences/204237506,http://data.gbif.org/ws/rest/occurrence/get?key=204237506
"National Museum of Nature and Science, Japan",Angiosperm specimens of Iwate Prefectural Museum,,,,,,,IPMM,PA,23874,Specimen,,00:24.0,,,Viburnum wrightii Miq.,Miq.,Viburnum wrightii Miq.,Plantae,Angiospermae,Sympetalae,Dipsacales,Caprifoliaceae,Viburnum,Japan,Japan,,Kunohe-gun Hironomachi,,Iwate,Eastern Asia,Japan,,,,,,,,,,,,http://data.gbif.org/occurrences/204237188,http://data.gbif.org/ws/rest/occurrence/get?key=204237188
"National Museum of Nature and Science, Japan",Angiospermatatophytina Collection of Saitama Museum of Natural History,,,,,,,SMNH,As,3816,Specimen,,53:54.0,,,Viburnum wrightii Miq.,Miq.,Viburnum wrightii Miq.,Plantae,Angiospermae,Dicotyledoneae,Dipsacales,Caprifoliaceae,Viburnum,Japan,Japan,,Chichibu-gun Otakimura,,Saitama,Eastern Asia,Japan,,,,,,,,,,,,http://data.gbif.org/occurrences/353568894,http://data.gbif.org/ws/rest/occurrence/get?key=353568894
"National Museum of Nature and Science, Japan",Angiospermatatophytina Collection of Saitama Museum of Natural History,,,,,,,SMNH,As,16961,Specimen,,53:56.0,,,Viburnum wrightii Miq.,Miq.,Viburnum wrightii Miq.,Plantae,Angiospermae,Dicotyledoneae,Dipsacales,Caprifoliaceae,Viburnum,Japan,Japan,Ohchigawa,Chichibu-gun Otakimura,,Saitama,Eastern Asia,Japan,,,,,,,,,,,,http://data.gbif.org/occurrences/393113376,http://data.gbif.org/ws/rest/occurrence/get?key=393113376
"National Museum of Nature and Science, Japan",Angiospermatatophytina Collection of Saitama Museum of Natural History,,,,,,,SMNH,As,3824,Specimen,,53:54.0,,,Viburnum wrightii Miq.,Miq.,Viburnum wrightii Miq.,Plantae,Angiospermae,Dicotyledoneae,Dipsacales,Caprifoliaceae,Viburnum,Japan,Japan,,Tano-gun Nakasatomura,,Gunma,Eastern Asia,Japan,,,,,,,,,,,,http://data.gbif.org/occurrences/353568916,http://data.gbif.org/ws/rest/occurrence/get?key=353568916
"National Museum of Nature and Science, Japan",Angiospermatatophytina Collection of Saitama Museum of Natural History,,,,,,,SMNH,As,16955,Specimen,,53:56.0,,,Viburnum wrightii Miq.,Miq.,Viburnum wrightii Miq.,Plantae,Angiospermae,Dicotyledoneae,Dipsacales,Caprifoliaceae,Viburnum,Japan,Japan,Mt. Tenmaru-yama,Tano-gun Uenomura,,Gunma,Eastern Asia,Japan,,,,,,,,,,,,http://data.gbif.org/occurrences/393113365,http://data.gbif.org/ws/rest/occurrence/get?key=393113365
"National Museum of Nature and Science, Japan",Angiospermatatophytina Collection of Saitama Museum of Natural History,,,,,,,SMNH,As,16959,Specimen,,53:56.0,,,Viburnum wrightii Miq.,Miq.,Viburnum wrightii Miq.,Plantae,Angiospermae,Dicotyledoneae,Dipsacales,Caprifoliaceae,Viburnum,Japan,Japan,Mt. Hakuseki-san,Chichibu-gun Oganomachi,,Saitama,Eastern Asia,Japan,,,,,,,,,,,,http://data.gbif.org/occurrences/393113372,http://data.gbif.org/ws/rest/occurrence/get?key=393113372
"National Museum of Nature and Science, Japan",Angiosperm specimens of Iwate Prefectural Museum,,,,,,,IPMM,PA,33761,Specimen,,00:25.0,,,Viburnum wrightii Miq.,Miq.,Viburnum wrightii Miq.,Plantae,Angiospermae,Sympetalae,Dipsacales,Caprifoliaceae,Viburnum,Japan,Japan,,Morioka-shi,,Iwate,Eastern Asia,Japan,,,,,,,,,,,,http://data.gbif.org/occurrences/204237418,http://data.gbif.org/ws/rest/occurrence/get?key=204237418
"National Museum of Nature and Science, Japan",Angiospermatatophytina Collection of Saitama Museum of Natural History,,,,,,,SMNH,As,16944,Specimen,,53:56.0,,,Viburnum wrightii Miq.,Miq.,Viburnum wrightii Miq.,Plantae,Angiospermae,Dicotyledoneae,Dipsacales,Caprifoliaceae,Viburnum,Japan,Japan,Mt. Kumakura-san,Chichibu-gun Arakawamura,,Saitama,Eastern Asia,Japan,,,,,,,,,,,,http://data.gbif.org/occurrences/393113346,http://data.gbif.org/ws/rest/occurrence/get?key=393113346
"National Museum of Nature and Science, Japan",Angiospermatatophytina Collection of Saitama Museum of Natural History,,,,,,,SMNH,As,3822,Specimen,,53:54.0,,,Viburnum wrightii Miq.,Miq.,Viburnum wrightii Miq.,Plantae,Angiospermae,Dicotyledoneae,Dipsacales,Caprifoliaceae,Viburnum,Japan,Japan,,Chichibu-gun Otakimura,,Saitama,Eastern Asia,Japan,,,,,,,,,,,,http://data.gbif.org/occurrences/353568909,http://data.gbif.org/ws/rest/occurrence/get?key=353568909
"National Museum of Nature and Science, Japan",Angiospermatatophytina Collection of Saitama Museum of Natural History,,,,,,,SMNH,As,16952,Specimen,,53:56.0,,,Viburnum wrightii Miq.,Miq.,Viburnum wrightii Miq.,Plantae,Angiospermae,Dicotyledoneae,Dipsacales,Caprifoliaceae,Viburnum,Japan,Japan,Mt. Mae-shiraiwa-san,Chichibu-gun Otakimura,,Saitama,Eastern Asia,Japan,,,,,,,,,,,,http://data.gbif.org/occurrences/393113360,http://data.gbif.org/ws/rest/occurrence/get?key=393113360
"National Museum of Nature and Science, Japan",Angiospermatatophytina Collection of Saitama Museum of Natural History,,,,,,,SMNH,As,16945,Specimen,,53:56.0,,,Viburnum wrightii Miq.,Miq.,Viburnum wrightii Miq.,Plantae,Angiospermae,Dicotyledoneae,Dipsacales,Caprifoliaceae,Viburnum,Japan,Japan,Mt. Futago-yama,Chichibu-gun Oganomachi,,Saitama,Eastern Asia,Japan,,,,,,,,,,,,http://data.gbif.org/occurrences/393113347,http://data.gbif.org/ws/rest/occurrence/get?key=393113347
"National Museum of Nature and Science, Japan",Angiospermatatophytina Collection of Saitama Museum of Natural History,,,,,,,SMNH,As,24082,Specimen,,53:58.0,,,Viburnum wrightii Miq.,Miq.,Viburnum wrightii Miq.,Plantae,Angiospermae,Dicotyledoneae,Dipsacales,Caprifoliaceae,Viburnum,Japan,Japan,Ohchigawa,Chichibu-gun Otakimura,,Saitama,Eastern Asia,Japan,,,,,,,,,,,,http://data.gbif.org/occurrences/393113843,http://data.gbif.org/ws/rest/occurrence/get?key=393113843
"National Museum of Nature and Science, Japan",Angiosperm specimens of Iwate Prefectural Museum,,,,,,,IPMM,PA,41797,Specimen,,00:25.0,,,Viburnum wrightii Miq.,Miq.,Viburnum wrightii Miq.,Plantae,Angiospermae,Sympetalae,Dipsacales,Caprifoliaceae,Viburnum,Japan,Japan,,Kitakami-shi,,Iwate,Eastern Asia,Japan,,,,,,,,,,,,http://data.gbif.org/occurrences/204237503,http://data.gbif.org/ws/rest/occurrence/get?key=204237503