Data Publisher,Dataset,Dataset Rights,Collector name,Collector number,Field number,GUID,Date collected,Institution code,Collection code,Catalogue number,Basis of record,Image url,Last indexed,Identifier,Identification date,Scientific name,Author,Scientific name (interpreted),Kingdom,Phylum,Class,Order,Family,Genus,Country,Country (interpreted),Locality,County,Continent or Ocean,State/Province,Region,Publisher country,Latitude,Longitude,Coordinate precision,Cell id,Centi cell id,Min depth,Max depth,Max depth,Min altitude,Max altitude,Altitude precision,GBIF portal url,GBIF webservice url
"National Museum of Nature and Science, Japan",Herbarium of Kitakyushu Museum of Natural History and Human History,,,,,,,KMNH,KMNH,1993Y30GR10,Specimen,,11:36.0,,,Deinostema   adenocaulum   (Maxim.)  Yamazaki,,Deinostema adenocaulum (Maxim.) Yamazaki,Plantae,,,Tubiflorae,Scrophulariaceae,Deinostema,Japan,Japan,,Kitakyushu City,,Fukuoka  Pref.,Eastern Asia,Japan,,,,,,,,,,,,http://data.gbif.org/occurrences/150191528,http://data.gbif.org/ws/rest/occurrence/get?key=150191528
"National Museum of Nature and Science, Japan",Herbarium of Kitakyushu Museum of Natural History and Human History,,,,,,,KMNH,KMNH,1994Z21GR03,Specimen,,11:36.0,,,Deinostema   adenocaulum   (Maxim.)  Yamazaki,,Deinostema adenocaulum (Maxim.) Yamazaki,Plantae,,,Tubiflorae,Scrophulariaceae,Deinostema,Japan,Japan,,,,Fukuoka  Pref.,Eastern Asia,Japan,,,,,,,,,,,,http://data.gbif.org/occurrences/150191525,http://data.gbif.org/ws/rest/occurrence/get?key=150191525
"National Museum of Nature and Science, Japan","FKSE-Herbarium specimens of Faculty of Symbiotic Systems Science, Fukushima University, Japan",,,,,,,FKSE,Plant,5331,Specimen,,51:39.0,,,Deinostema adenocaulum (Maxim.) T.Yamaz.,(Maxim.) T.Yamaz.,Deinostema adenocaulum (Maxim.) T.Yamaz.,Plantae,,,,SCROPHULARIACEAE,Deinostema,Japan,Japan,,Koriyama-shi,,Fukushima,Eastern Asia,Japan,,,,,,,,,,,,http://data.gbif.org/occurrences/238092227,http://data.gbif.org/ws/rest/occurrence/get?key=238092227
"National Museum of Nature and Science, Japan","Herbarium Specimens of Museum of Nature and Human Activities, Hyogo Prefecture, Japan",,,,,,,HYO,HYO-C,C1-195943,Specimen,,25:24.0,,,Deinostema adenocaulum (Maxim.) T.Yamaz.,(Maxim.) T.Yamaz.,Deinostema adenocaulum (Maxim.) T.Yamaz.,Plantae,,,,Scrophulariaceae,Deinostema,Japan,Japan,,,,Shiga,Eastern Asia,Japan,,,,,,,,,100,,,http://data.gbif.org/occurrences/177351873,http://data.gbif.org/ws/rest/occurrence/get?key=177351873
"National Museum of Nature and Science, Japan","Herbarium Specimens of Museum of Nature and Human Activities, Hyogo Prefecture, Japan",,,,,,,HYO,HYO-C,C1-205602,Specimen,,25:24.0,,,Deinostema adenocaulum (Maxim.) T.Yamaz.,(Maxim.) T.Yamaz.,Deinostema adenocaulum (Maxim.) T.Yamaz.,Plantae,,,,Scrophulariaceae,Deinostema,Japan,Japan,,,,Hyogo,Eastern Asia,Japan,,,,,,,,,400,450,,http://data.gbif.org/occurrences/177351876,http://data.gbif.org/ws/rest/occurrence/get?key=177351876
"National Museum of Nature and Science, Japan","Herbarium Specimens of Museum of Nature and Human Activities, Hyogo Prefecture, Japan",,,,,,,HYO,HYO-C,C1-196442,Specimen,,25:24.0,,,Deinostema adenocaulum (Maxim.) T.Yamaz.,(Maxim.) T.Yamaz.,Deinostema adenocaulum (Maxim.) T.Yamaz.,Plantae,,,,Scrophulariaceae,Deinostema,Japan,Japan,,,,Hyogo,Eastern Asia,Japan,,,,,,,,,200,300,,http://data.gbif.org/occurrences/177351874,http://data.gbif.org/ws/rest/occurrence/get?key=177351874
"National Museum of Nature and Science, Japan","Herbarium Specimens of Museum of Nature and Human Activities, Hyogo Prefecture, Japan",,,,,,,HYO,HYO-C,C1-195926,Specimen,,25:24.0,,,Deinostema adenocaulum (Maxim.) T.Yamaz.,(Maxim.) T.Yamaz.,Deinostema adenocaulum (Maxim.) T.Yamaz.,Plantae,,,,Scrophulariaceae,Deinostema,Japan,Japan,,,,Kyoto,Eastern Asia,Japan,,,,,,,,,20,,,http://data.gbif.org/occurrences/177351872,http://data.gbif.org/ws/rest/occurrence/get?key=177351872
"National Museum of Nature and Science, Japan",Kochi Prefectural Makino Botanical Garden,,,,,,,MBK,MBK,161978,Specimen,,03:21.0,,,Deinostema adenocaulum (Maxim.) T.Yamaz.,,Deinostema adenocaulum (Maxim.) T.Yamaz.,Plantae,,,Tubiflorae,Scrophulariaceae,Deinostema,Japan,Japan,,,,Pref. Kochi,Eastern Asia,Japan,,,,,,,,,,,,http://data.gbif.org/occurrences/143962312,http://data.gbif.org/ws/rest/occurrence/get?key=143962312
"National Museum of Nature and Science, Japan","Plant specimens depodited in Osaka Museum of Natural History, Japan.",,,,,,,OSA,OSA,244543,Specimen,,18:08.0,,,Deinostema adenocaulum (Maxim.) T.Yamaz.,(Maxim.) T.Yamaz.,Deinostema adenocaulum (Maxim.) T.Yamaz.,Plantae,,,,Scrophulariaceae,Deinostema,Japan,Japan,,Yoshino-gun Shimokitayamamura,,Nara,Eastern Asia,Japan,34.3553,135.798,,44955,37,,,,,,,http://data.gbif.org/occurrences/204374366,http://data.gbif.org/ws/rest/occurrence/get?key=204374366
"National Museum of Nature and Science, Japan","Plant specimens depodited in Osaka Museum of Natural History, Japan.",,,,,,,OSA,OSA,244546,Specimen,,18:08.0,,,Deinostema adenocaulum (Maxim.) T.Yamaz.,(Maxim.) T.Yamaz.,Deinostema adenocaulum (Maxim.) T.Yamaz.,Plantae,,,,Scrophulariaceae,Deinostema,Japan,Japan,,Yoshino-gun Shimokitayamamura,,Nara,Eastern Asia,Japan,34.3553,135.798,,44955,37,,,,,,,http://data.gbif.org/occurrences/204374369,http://data.gbif.org/ws/rest/occurrence/get?key=204374369
"National Museum of Nature and Science, Japan","Plant specimens depodited in Osaka Museum of Natural History, Japan.",,,,,,,OSA,OSA,245885,Specimen,,18:08.0,,,Deinostema adenocaulum (Maxim.) T.Yamaz.,(Maxim.) T.Yamaz.,Deinostema adenocaulum (Maxim.) T.Yamaz.,Plantae,,,,Scrophulariaceae,Deinostema,Japan,Japan,,Yoshino-gun Shimokitayamamura,,Nara,Eastern Asia,Japan,34.3553,135.798,,44955,37,,,,,,,http://data.gbif.org/occurrences/204374373,http://data.gbif.org/ws/rest/occurrence/get?key=204374373
"National Museum of Nature and Science, Japan","Plant specimens depodited in Osaka Museum of Natural History, Japan.",,,,,,,OSA,OSA,244542,Specimen,,18:08.0,,,Deinostema adenocaulum (Maxim.) T.Yamaz.,(Maxim.) T.Yamaz.,Deinostema adenocaulum (Maxim.) T.Yamaz.,Plantae,,,,Scrophulariaceae,Deinostema,Japan,Japan,,Uda-shi,,Nara,Eastern Asia,Japan,34.4916,135.951,,44955,49,,,,,,,http://data.gbif.org/occurrences/204374365,http://data.gbif.org/ws/rest/occurrence/get?key=204374365
"National Museum of Nature and Science, Japan","Plant specimens depodited in Osaka Museum of Natural History, Japan.",,,,,,,OSA,OSA,244544,Specimen,,18:08.0,,,Deinostema adenocaulum (Maxim.) T.Yamaz.,(Maxim.) T.Yamaz.,Deinostema adenocaulum (Maxim.) T.Yamaz.,Plantae,,,,Scrophulariaceae,Deinostema,Japan,Japan,,Yoshino-gun Shimokitayamamura,,Nara,Eastern Asia,Japan,34.3553,135.798,,44955,37,,,,,,,http://data.gbif.org/occurrences/204374367,http://data.gbif.org/ws/rest/occurrence/get?key=204374367
"National Museum of Nature and Science, Japan","Plant specimens depodited in Osaka Museum of Natural History, Japan.",,,,,,,OSA,OSA,245531,Specimen,,18:08.0,,,Deinostema adenocaulum (Maxim.) T.Yamaz.,(Maxim.) T.Yamaz.,Deinostema adenocaulum (Maxim.) T.Yamaz.,Plantae,,,,Scrophulariaceae,Deinostema,Japan,Japan,,Yoshino-gun Shimokitayamamura,,Nara,Eastern Asia,Japan,34.3553,135.798,,44955,37,,,,,,,http://data.gbif.org/occurrences/204374371,http://data.gbif.org/ws/rest/occurrence/get?key=204374371
"National Museum of Nature and Science, Japan","Plant specimens depodited in Osaka Museum of Natural History, Japan.",,,,,,,OSA,OSA,251630,Specimen,,18:08.0,,,Deinostema adenocaulum (Maxim.) T.Yamaz.,(Maxim.) T.Yamaz.,Deinostema adenocaulum (Maxim.) T.Yamaz.,Plantae,,,,Scrophulariaceae,Deinostema,Japan,Japan,,Uda-gun Sonimura,,Nara,Eastern Asia,Japan,34.4916,135.951,,44955,49,,,,,,,http://data.gbif.org/occurrences/204374273,http://data.gbif.org/ws/rest/occurrence/get?key=204374273
"National Museum of Nature and Science, Japan","Plant specimens depodited in Osaka Museum of Natural History, Japan.",,,,,,,OSA,OSA,7863,Specimen,,18:08.0,,,Deinostema adenocaulum (Maxim.) T.Yamaz.,(Maxim.) T.Yamaz.,Deinostema adenocaulum (Maxim.) T.Yamaz.,Plantae,,,,Scrophulariaceae,Deinostema,Japan,Japan,,Uda-gun Muromura,,Nara,Eastern Asia,Japan,34.4916,135.951,,44955,49,,,,,,,http://data.gbif.org/occurrences/204374370,http://data.gbif.org/ws/rest/occurrence/get?key=204374370
"National Museum of Nature and Science, Japan","Plant specimens depodited in Osaka Museum of Natural History, Japan.",,,,,,,OSA,OSA,245565,Specimen,,18:08.0,,,Deinostema adenocaulum (Maxim.) T.Yamaz.,(Maxim.) T.Yamaz.,Deinostema adenocaulum (Maxim.) T.Yamaz.,Plantae,,,,Scrophulariaceae,Deinostema,Japan,Japan,,Yoshino-gun Higashiyoshinomura,,Nara,Eastern Asia,Japan,34.4069,135.798,,44955,47,,,,,,,http://data.gbif.org/occurrences/204374375,http://data.gbif.org/ws/rest/occurrence/get?key=204374375
"National Museum of Nature and Science, Japan","Plant specimens depodited in Osaka Museum of Natural History, Japan.",,,,,,,OSA,OSA,244545,Specimen,,18:08.0,,,Deinostema adenocaulum (Maxim.) T.Yamaz.,(Maxim.) T.Yamaz.,Deinostema adenocaulum (Maxim.) T.Yamaz.,Plantae,,,,Scrophulariaceae,Deinostema,Japan,Japan,,Yoshino-gun Shimokitayamamura,,Nara,Eastern Asia,Japan,34.3553,135.798,,44955,37,,,,,,,http://data.gbif.org/occurrences/204374368,http://data.gbif.org/ws/rest/occurrence/get?key=204374368
"National Museum of Nature and Science, Japan","Plant specimens depodited in Osaka Museum of Natural History, Japan.",,,,,,,OSA,OSA,244547,Specimen,,18:08.0,,,Deinostema adenocaulum (Maxim.) T.Yamaz.,(Maxim.) T.Yamaz.,Deinostema adenocaulum (Maxim.) T.Yamaz.,Plantae,,,,Scrophulariaceae,Deinostema,Japan,Japan,,Uda-shi,,Nara,Eastern Asia,Japan,34.4916,135.951,,44955,49,,,,,,,http://data.gbif.org/occurrences/204374374,http://data.gbif.org/ws/rest/occurrence/get?key=204374374
"National Museum of Nature and Science, Japan","Plant specimens depodited in Osaka Museum of Natural History, Japan.",,,,,,,OSA,OSA,245532,Specimen,,18:08.0,,,Deinostema adenocaulum (Maxim.) T.Yamaz.,(Maxim.) T.Yamaz.,Deinostema adenocaulum (Maxim.) T.Yamaz.,Plantae,,,,Scrophulariaceae,Deinostema,Japan,Japan,,Yoshino-gun Shimokitayamamura,,Nara,Eastern Asia,Japan,34.3553,135.798,,44955,37,,,,,,,http://data.gbif.org/occurrences/204374372,http://data.gbif.org/ws/rest/occurrence/get?key=204374372
"National Museum of Nature and Science, Japan","Plant specimens depodited in Osaka Museum of Natural History, Japan.",,,,,,,OSA,OSA,251629,Specimen,,18:08.0,,,Deinostema adenocaulum (Maxim.) T.Yamaz.,(Maxim.) T.Yamaz.,Deinostema adenocaulum (Maxim.) T.Yamaz.,Plantae,,,,Scrophulariaceae,Deinostema,Japan,Japan,,Uda-gun Sonimura,,Nara,Eastern Asia,Japan,34.4916,135.951,,44955,49,,,,,,,http://data.gbif.org/occurrences/204374272,http://data.gbif.org/ws/rest/occurrence/get?key=204374272
"National Museum of Nature and Science, Japan","Plant specimens depodited in Osaka Museum of Natural History, Japan.",,,,,,,OSA,OSA,244853,Specimen,,18:08.0,,,Deinostema adenocaulum (Maxim.) T.Yamaz.,(Maxim.) T.Yamaz.,Deinostema adenocaulum (Maxim.) T.Yamaz.,Plantae,,,,Scrophulariaceae,Deinostema,Japan,Japan,,Yoshino-gun Tenkawamura,,Nara,Eastern Asia,Japan,34.4069,135.798,,44955,47,,,,,,,http://data.gbif.org/occurrences/204374376,http://data.gbif.org/ws/rest/occurrence/get?key=204374376
"National Museum of Nature and Science, Japan",Vascular Plant Specimen Database of Kanagawa Prefectural Museum of Natural History,,,,,,,KPM,NA,KPM-NA0143830,Specimen,,24:59.0,,,Deinostema adenocaulum (Maxim.) T.Yamaz.,,Deinostema adenocaulum (Maxim.) T.Yamaz.,Plantae,Angiospermae,Dicotyledoneae,,SCROPHULARIACEAE,Deinostema,Japan,Japan,,"Aki-gun, Toyo-cho",,Kochi Prefecture,Eastern Asia,Japan,,,,,,,,,10,,,http://data.gbif.org/occurrences/388816951,http://data.gbif.org/ws/rest/occurrence/get?key=388816951
"National Museum of Nature and Science, Japan",Vascular Plant Specimen Database of Kanagawa Prefectural Museum of Natural History,,,,,,,KPM,NA,KPM-NA0129985,Specimen,,24:59.0,,,Deinostema adenocaulum (Maxim.) T.Yamaz.,,Deinostema adenocaulum (Maxim.) T.Yamaz.,Plantae,Angiospermae,Dicotyledoneae,,SCROPHULARIACEAE,Deinostema,Japan,Japan,,Shobara-shi,,Hiroshima Prefecture,Eastern Asia,Japan,,,,,,,,,710,,,http://data.gbif.org/occurrences/388816927,http://data.gbif.org/ws/rest/occurrence/get?key=388816927
"National Museum of Nature and Science, Japan",Vascular plant specimens of Akita Prefectural Museum,,,,,,,AKPM,vs,1278,Specimen,,39:57.0,,,Deinostema adenocaulum (Maxim.) T.Yamaz.,(Maxim.) T.Yamaz.,Deinostema adenocaulum (Maxim.) T.Yamaz.,Plantae,Angiospermae,Dicotyledoneae,,Scrophulariaceae,Deinostema,Japan,Japan,,Akita-shi,,Akita,Eastern Asia,Japan,,,,,,,,,,,,http://data.gbif.org/occurrences/237732342,http://data.gbif.org/ws/rest/occurrence/get?key=237732342
"National Museum of Nature and Science, Japan",Vascular plant specimens of Akita Prefectural Museum,,,,,,,AKPM,vs,46901,Specimen,,39:58.0,,,Deinostema adenocaulum (Maxim.) T.Yamaz.,(Maxim.) T.Yamaz.,Deinostema adenocaulum (Maxim.) T.Yamaz.,Plantae,Angiospermae,Dicotyledoneae,,Scrophulariaceae,Deinostema,Japan,Japan,,Kitaakita-gun Takanosumachi,,Akita,Eastern Asia,Japan,,,,,,,,,,,,http://data.gbif.org/occurrences/237732929,http://data.gbif.org/ws/rest/occurrence/get?key=237732929
"National Museum of Nature and Science, Japan",Vascular plant specimens of Akita Prefectural Museum,,,,,,,AKPM,vs,41405,Specimen,,39:58.0,,,Deinostema adenocaulum (Maxim.) T.Yamaz.,(Maxim.) T.Yamaz.,Deinostema adenocaulum (Maxim.) T.Yamaz.,Plantae,Angiospermae,Dicotyledoneae,,Scrophulariaceae,Deinostema,Japan,Japan,,Kawabe-gun Yuuwamachi,,Akita,Eastern Asia,Japan,,,,,,,,,,,,http://data.gbif.org/occurrences/237732901,http://data.gbif.org/ws/rest/occurrence/get?key=237732901
"National Museum of Nature and Science, Japan",Vascular plant specimens of Akita Prefectural Museum,,,,,,,AKPM,vs,3597,Specimen,,39:57.0,,,Deinostema adenocaulum (Maxim.) T.Yamaz.,(Maxim.) T.Yamaz.,Deinostema adenocaulum (Maxim.) T.Yamaz.,Plantae,Angiospermae,Dicotyledoneae,,Scrophulariaceae,Deinostema,Japan,Japan,,Akita-shi,,Akita,Eastern Asia,Japan,,,,,,,,,,,,http://data.gbif.org/occurrences/237732392,http://data.gbif.org/ws/rest/occurrence/get?key=237732392
"National Museum of Nature and Science, Japan",Vascular plant specimens of Akita Prefectural Museum,,,,,,,AKPM,vs,46902,Specimen,,39:58.0,,,Deinostema adenocaulum (Maxim.) T.Yamaz.,(Maxim.) T.Yamaz.,Deinostema adenocaulum (Maxim.) T.Yamaz.,Plantae,Angiospermae,Dicotyledoneae,,Scrophulariaceae,Deinostema,Japan,Japan,,Kitaakita-gun Takanosumachi,,Akita,Eastern Asia,Japan,,,,,,,,,,,,http://data.gbif.org/occurrences/237732930,http://data.gbif.org/ws/rest/occurrence/get?key=237732930
"National Museum of Nature and Science, Japan",Vascular plant specimens of Akita Prefectural Museum,,,,,,,AKPM,vs,46900,Specimen,,39:58.0,,,Deinostema adenocaulum (Maxim.) T.Yamaz.,(Maxim.) T.Yamaz.,Deinostema adenocaulum (Maxim.) T.Yamaz.,Plantae,Angiospermae,Dicotyledoneae,,Scrophulariaceae,Deinostema,Japan,Japan,,Kitaakita-gun Takanosumachi,,Akita,Eastern Asia,Japan,,,,,,,,,,,,http://data.gbif.org/occurrences/237732928,http://data.gbif.org/ws/rest/occurrence/get?key=237732928
"National Museum of Nature and Science, Japan",Vascular plant specimens of Akita Prefectural Museum,,,,,,,AKPM,vs,1280,Specimen,,39:57.0,,,Deinostema adenocaulum (Maxim.) T.Yamaz.,(Maxim.) T.Yamaz.,Deinostema adenocaulum (Maxim.) T.Yamaz.,Plantae,Angiospermae,Dicotyledoneae,,Scrophulariaceae,Deinostema,Japan,Japan,,Akita-shi,,Akita,Eastern Asia,Japan,,,,,,,,,,,,http://data.gbif.org/occurrences/237732344,http://data.gbif.org/ws/rest/occurrence/get?key=237732344
"National Museum of Nature and Science, Japan",Vascular plant specimens of Akita Prefectural Museum,,,,,,,AKPM,vs,1277,Specimen,,39:57.0,,,Deinostema adenocaulum (Maxim.) T.Yamaz.,(Maxim.) T.Yamaz.,Deinostema adenocaulum (Maxim.) T.Yamaz.,Plantae,Angiospermae,Dicotyledoneae,,Scrophulariaceae,Deinostema,Japan,Japan,,Akita-shi,,Akita,Eastern Asia,Japan,,,,,,,,,,,,http://data.gbif.org/occurrences/237732341,http://data.gbif.org/ws/rest/occurrence/get?key=237732341
"National Museum of Nature and Science, Japan",Vascular plant specimens of Akita Prefectural Museum,,,,,,,AKPM,vs,1281,Specimen,,39:57.0,,,Deinostema adenocaulum (Maxim.) T.Yamaz.,(Maxim.) T.Yamaz.,Deinostema adenocaulum (Maxim.) T.Yamaz.,Plantae,Angiospermae,Dicotyledoneae,,Scrophulariaceae,Deinostema,Japan,Japan,,Yuri-gun Kisakatamachi,,Akita,Eastern Asia,Japan,,,,,,,,,,,,http://data.gbif.org/occurrences/237732345,http://data.gbif.org/ws/rest/occurrence/get?key=237732345
"National Museum of Nature and Science, Japan",Vascular plant specimens of Akita Prefectural Museum,,,,,,,AKPM,vs,41406,Specimen,,40:02.0,,,Deinostema adenocaulum (Maxim.) T.Yamaz.,(Maxim.) T.Yamaz.,Deinostema adenocaulum (Maxim.) T.Yamaz.,Plantae,Angiospermae,Dicotyledoneae,,Scrophulariaceae,Deinostema,Japan,Japan,,Fudaimura,,Iwate,Eastern Asia,Japan,,,,,,,,,,,,http://data.gbif.org/occurrences/624029679,http://data.gbif.org/ws/rest/occurrence/get?key=624029679
"National Museum of Nature and Science, Japan",Vascular plant specimens of Akita Prefectural Museum,,,,,,,AKPM,vs,1279,Specimen,,39:57.0,,,Deinostema adenocaulum (Maxim.) T.Yamaz.,(Maxim.) T.Yamaz.,Deinostema adenocaulum (Maxim.) T.Yamaz.,Plantae,Angiospermae,Dicotyledoneae,,Scrophulariaceae,Deinostema,Japan,Japan,,Oga-shi,,Akita,Eastern Asia,Japan,,,,,,,,,,,,http://data.gbif.org/occurrences/237732343,http://data.gbif.org/ws/rest/occurrence/get?key=237732343
"National Museum of Nature and Science, Japan","Gunma Museum of Natural History, Vascular Plant Specimen",,,,,,,GMNHJ,plant,BS0040278,Specimen,,34:39.0,,,Deinostema adenocaulum (Maxim.) Yamazaki,(Maxim.) Yamazaki,Deinostema adenocaulum (Maxim.) Yamazaki,Plantae,Spermatophyta,Dicotyledoneae,,Scrophulariaceae,Deinostema,Japan,Japan,Pond Morinji-numa,Tatebayashi-shi,,Gunma,Eastern Asia,Japan,36.2258,139.534,,45679,25,,,,,,,http://data.gbif.org/occurrences/295233470,http://data.gbif.org/ws/rest/occurrence/get?key=295233470
