Data Publisher,Dataset,Dataset Rights,Collector name,Collector number,Field number,GUID,Date collected,Institution code,Collection code,Catalogue number,Basis of record,Image url,Last indexed,Identifier,Identification date,Scientific name,Author,Scientific name (interpreted),Kingdom,Phylum,Class,Order,Family,Genus,Country,Country (interpreted),Locality,County,Continent or Ocean,State/Province,Region,Publisher country,Latitude,Longitude,Coordinate precision,Cell id,Centi cell id,Min depth,Max depth,Max depth,Min altitude,Max altitude,Altitude precision,GBIF portal url,GBIF webservice url
"National Museum of Nature and Science, Japan",Herbarium of Kitakyushu Museum of Natural History and Human History,,,,,,,KMNH,KMNH,2000X10GR26,Specimen,,11:47.0,,,Euonymus   chibae   Makino,,Euonymus chibae Makino,Plantae,,,Celastrales,Celastraceae,Euonymus,Japan,Japan,,,,Kagoshima  Pref.,Eastern Asia,Japan,,,,,,,,,,,,http://data.gbif.org/occurrences/150193842,http://data.gbif.org/ws/rest/occurrence/get?key=150193842
"National Museum of Nature and Science, Japan",Herbarium of Kitakyushu Museum of Natural History and Human History,,,,,,,KMNH,KMNH,2000Y15GR08,Specimen,,11:47.0,,,Euonymus   chibae   Makino,,Euonymus chibae Makino,Plantae,,,Celastrales,Celastraceae,Euonymus,Japan,Japan,,,,Nagasaki  Pref.,Eastern Asia,Japan,,,,,,,,,,,,http://data.gbif.org/occurrences/150193844,http://data.gbif.org/ws/rest/occurrence/get?key=150193844
"National Museum of Nature and Science, Japan",Herbarium of Kitakyushu Museum of Natural History and Human History,,,,,,,KMNH,KMNH,2000Y20GR02,Specimen,,11:47.0,,,Euonymus   chibae   Makino,,Euonymus chibae Makino,Plantae,,,Celastrales,Celastraceae,Euonymus,Japan,Japan,,,,Fukuoka  Pref.,Eastern Asia,Japan,,,,,,,,,,,,http://data.gbif.org/occurrences/150193843,http://data.gbif.org/ws/rest/occurrence/get?key=150193843
"National Institute of Genetics, ROIS","Herbarium Specimens of Museum of Nature and Human Activities, Hyogo Pref., Japan",,,,,,,HYO,VP,C1-016429,Specimen,,26:04.0,,,Euonymus chibae,,Euonymus chibae,Plantae,Magnoliophyta,,,Celastraceae,Euonymus,Japan,Japan,"KYUSHU. Pref.Nagasaki: Isahaya Park, Isahaya City.",,,Nagasaki,Eastern Asia,Japan,,,,,,,,,,,,http://data.gbif.org/occurrences/323520036,http://data.gbif.org/ws/rest/occurrence/get?key=323520036
"National Museum of Nature and Science, Japan","Herbarium Specimens of Museum of Nature and Human Activities, Hyogo Prefecture, Japan",,,,,,,HYO,C1,C1-016429,Specimen,,25:51.0,,,Euonymus chibae Makino,Makino,Euonymus chibae Makino,Plantae,,,,Celastraceae,Celastraceae,JAPAN,Japan,,Isahaya-shi,,Pref. Nagasaki:,Eastern Asia,Japan,,,,,,,,,,,,http://data.gbif.org/occurrences/204205428,http://data.gbif.org/ws/rest/occurrence/get?key=204205428
"National Museum of Nature and Science, Japan",Plant Specimens of Kurashiki Museum of Natural History,,,,,,,KURA,KURA,104842,Specimen,,14:34.0,,,Euonymus chibae Makino,Makino,Euonymus chibae Makino,Plantae,,,,Celastraceae,Euonymus,Japan,Japan,,,,Nagasaki,Eastern Asia,Japan,,,,,,,,,,,,http://data.gbif.org/occurrences/43130441,http://data.gbif.org/ws/rest/occurrence/get?key=43130441
"National Museum of Nature and Science, Japan",Plant Specimens of Kurashiki Museum of Natural History,,,,,,,KURA,KURA,104841,Specimen,,14:34.0,,,Euonymus chibae Makino,Makino,Euonymus chibae Makino,Plantae,,,,Celastraceae,Euonymus,Japan,Japan,,,,Nagasaki,Eastern Asia,Japan,,,,,,,,,,,,http://data.gbif.org/occurrences/43130439,http://data.gbif.org/ws/rest/occurrence/get?key=43130439
"National Museum of Nature and Science, Japan",Plant Specimens of Kurashiki Museum of Natural History,,,,,,,KURA,KURA,104843,Specimen,,14:34.0,,,Euonymus chibae Makino,Makino,Euonymus chibae Makino,Plantae,,,,Celastraceae,Euonymus,Japan,Japan,,,,Nagasaki,Eastern Asia,Japan,,,,,,,,,,,,http://data.gbif.org/occurrences/43130442,http://data.gbif.org/ws/rest/occurrence/get?key=43130442
"National Museum of Nature and Science, Japan",Vascular Plant Specimen Database of Kanagawa Prefectural Museum of Natural History,,,,,,,KPM,NA,KPM-NA0067869,Specimen,,26:00.0,,,Euonymus chibae Makino,,Euonymus chibae Makino,Plantae,Angiospermae,Dicotyledoneae,,CELASTRACEAE,Euonymus,Japan,Japan,,"Kunigami-gun,, Kunigamison",,Okinawa Prefecture,Eastern Asia,Japan,,,,,,,,,,,,http://data.gbif.org/occurrences/388825409,http://data.gbif.org/ws/rest/occurrence/get?key=388825409
"National Museum of Nature and Science, Japan",Vascular Plant Specimen Database of Kanagawa Prefectural Museum of Natural History,,,,,,,KPM,NA,KPM-NA0076180,Specimen,,26:00.0,,,Euonymus chibae Makino,,Euonymus chibae Makino,Plantae,Angiospermae,Dicotyledoneae,,CELASTRACEAE,Euonymus,Japan,Japan,,"Kunigami-gun,, Kunigamison",,Okinawa Prefecture,Eastern Asia,Japan,,,,,,,,,,,,http://data.gbif.org/occurrences/388825439,http://data.gbif.org/ws/rest/occurrence/get?key=388825439
"National Museum of Nature and Science, Japan",Vascular Plant Specimen Database of Kanagawa Prefectural Museum of Natural History,,,,,,,KPM,NA,KPM-NA0076245,Specimen,,26:00.0,,,Euonymus chibae Makino,,Euonymus chibae Makino,Plantae,Angiospermae,Dicotyledoneae,,CELASTRACEAE,Euonymus,Japan,Japan,,"Kunigami-gun,, Kunigamison",,Okinawa Prefecture,Eastern Asia,Japan,,,,,,,,,,,,http://data.gbif.org/occurrences/388825440,http://data.gbif.org/ws/rest/occurrence/get?key=388825440
"National Museum of Nature and Science, Japan",Vascular Plant Specimen Database of Kanagawa Prefectural Museum of Natural History,,,,,,,KPM,NA,KPM-NA0067868,Specimen,,26:00.0,,,Euonymus chibae Makino,,Euonymus chibae Makino,Plantae,Angiospermae,Dicotyledoneae,,CELASTRACEAE,Euonymus,Japan,Japan,,"Kunigami-gun,, Kunigamison",,Okinawa Prefecture,Eastern Asia,Japan,,,,,,,,,,,,http://data.gbif.org/occurrences/388825408,http://data.gbif.org/ws/rest/occurrence/get?key=388825408
"National Museum of Nature and Science, Japan",Vascular Plant Specimen Database of Kanagawa Prefectural Museum of Natural History,,,,,,,KPM,NA,KPM-NA0136774,Specimen,,26:01.0,,,Euonymus chibae Makino,,Euonymus chibae Makino,Plantae,Angiospermae,Dicotyledoneae,,CELASTRACEAE,Euonymus,Japan,Japan,,"Kunigami-gun,, Kunigamison",,Okinawa Prefecture,Eastern Asia,Japan,,,,,,,,,160,,,http://data.gbif.org/occurrences/388825563,http://data.gbif.org/ws/rest/occurrence/get?key=388825563
