Data Publisher,Dataset,Dataset Rights,Collector name,Collector number,Field number,GUID,Date collected,Institution code,Collection code,Catalogue number,Basis of record,Image url,Last indexed,Identifier,Identification date,Scientific name,Author,Scientific name (interpreted),Kingdom,Phylum,Class,Order,Family,Genus,Country,Country (interpreted),Locality,County,Continent or Ocean,State/Province,Region,Publisher country,Latitude,Longitude,Coordinate precision,Cell id,Centi cell id,Min depth,Max depth,Max depth,Min altitude,Max altitude,Altitude precision,GBIF portal url,GBIF webservice url
"National Museum of Nature and Science, Japan",Angiosperm specimens of Iwate Prefectural Museum,,,,,,,IPMM,PA,73706,Specimen,,00:13.0,,,Sium suave Walter  var. nipponicum (Maxim.) H.Hara,Walter,Sium suave var. nipponicum (Maxim.) H.Hara,Plantae,Angiospermae,Dicotyledoneae,,Umbelliferae,Sium,Japan,Japan,,Toyo-shi,,Ehime,Eastern Asia,Japan,,,,,,,,,,,,http://data.gbif.org/occurrences/93894927,http://data.gbif.org/ws/rest/occurrence/get?key=93894927
"National Museum of Nature and Science, Japan",Angiosperm specimens of Iwate Prefectural Museum,,,,,,,IPMM,PA,73539,Specimen,,00:13.0,,,Sium suave Walter  var. nipponicum (Maxim.) H.Hara,Walter,Sium suave var. nipponicum (Maxim.) H.Hara,Plantae,Angiospermae,Dicotyledoneae,,Umbelliferae,Sium,Japan,Japan,,Miyako-shi,,Iwate,Eastern Asia,Japan,,,,,,,,,,,,http://data.gbif.org/occurrences/93894929,http://data.gbif.org/ws/rest/occurrence/get?key=93894929
"National Museum of Nature and Science, Japan","Gunma Museum of Natural History, Vascular Plant Specimen",,,,,,,GMNHJ,plant,BS0086328,Specimen,,35:47.0,,,Sium suave Walter  var. nipponicum (Maxim.) H.Hara,,Sium suave var. nipponicum (Maxim.) H.Hara,Plantae,Spermatophyta,,,Umbelliferae,Sium,Japan,Japan,Horinouchi,Suginami-ku,,Tokyo,Eastern Asia,Japan,,,,,,,,,,,,http://data.gbif.org/occurrences/188208254,http://data.gbif.org/ws/rest/occurrence/get?key=188208254
"National Museum of Nature and Science, Japan","FKSE-Herbarium specimens of Faculty of Symbiotic Systems Science, Fukushima University, Japan",,,,,,,FKSE,Plant,19461,Specimen,,53:37.0,,,Sium suave Walter  var. nipponicum (Maxim.) H.Hara,Walter,Sium suave var. nipponicum (Maxim.) H.Hara,Plantae,,,,APIACEAE,Sium,Japan,Japan,,Shirakawa-shi,,Fukushima,Eastern Asia,Japan,,,,,,,,,,,,http://data.gbif.org/occurrences/391299671,http://data.gbif.org/ws/rest/occurrence/get?key=391299671
"National Museum of Nature and Science, Japan","FKSE-Herbarium specimens of Faculty of Symbiotic Systems Science, Fukushima University, Japan",,,,,,,FKSE,Plant,1558,Specimen,,53:35.0,,,Sium suave Walter  var. nipponicum (Maxim.) H.Hara,Walter,Sium suave var. nipponicum (Maxim.) H.Hara,Plantae,,,,APIACEAE,Sium,Japan,Japan,,Shirakawa-shi,,Fukushima,Eastern Asia,Japan,,,,,,,,,,,,http://data.gbif.org/occurrences/238100287,http://data.gbif.org/ws/rest/occurrence/get?key=238100287
"National Museum of Nature and Science, Japan","FKSE-Herbarium specimens of Faculty of Symbiotic Systems Science, Fukushima University, Japan",,,,,,,FKSE,Plant,1557,Specimen,,53:35.0,,,Sium suave Walter  var. nipponicum (Maxim.) H.Hara,Walter,Sium suave var. nipponicum (Maxim.) H.Hara,Plantae,,,,APIACEAE,Sium,Japan,Japan,,Shirakawa-shi,,Fukushima,Eastern Asia,Japan,,,,,,,,,,,,http://data.gbif.org/occurrences/238100286,http://data.gbif.org/ws/rest/occurrence/get?key=238100286
"National Museum of Nature and Science, Japan","FKSE-Herbarium specimens of Faculty of Symbiotic Systems Science, Fukushima University, Japan",,,,,,,FKSE,Plant,1559,Specimen,,53:35.0,,,Sium suave Walter  var. nipponicum (Maxim.) H.Hara,Walter,Sium suave var. nipponicum (Maxim.) H.Hara,Plantae,,,,APIACEAE,Sium,Japan,Japan,,Nishishirakawa-gun,,Fukushima,Eastern Asia,Japan,,,,,,,,,,,,http://data.gbif.org/occurrences/238100288,http://data.gbif.org/ws/rest/occurrence/get?key=238100288
"National Museum of Nature and Science, Japan",Angiosperm specimens of Iwate Prefectural Museum,,,,,,,IPMM,PA,5291,Specimen,,00:16.0,,,Sium suave Walter var. nipponicum (Maxim.) H.Hara,Walter,Sium suave var. nipponicum (Maxim.) H.Hara,Plantae,Angiospermae,Dicotyledoneae,Umbelliflorae,Umbelliferae,Sium,Japan,Japan,,Morioka-shi,,Iwate,Eastern Asia,Japan,,,,,,,,,,,,http://data.gbif.org/occurrences/204236392,http://data.gbif.org/ws/rest/occurrence/get?key=204236392
"National Museum of Nature and Science, Japan","FKSE-Herbarium specimens of Faculty of Symbiotic Systems Science, Fukushima University, Japan",,,,,,,FKSE,Plant,758,Specimen,,53:35.0,,,Sium suave Walter var. nipponicum (Maxim.) H.Hara,Walter,Sium suave var. nipponicum (Maxim.) H.Hara,Plantae,,,,APIACEAE,Sium,Japan,Japan,,Nishishirakawa-gun,,Fukushima,Eastern Asia,Japan,,,,,,,,,,,,http://data.gbif.org/occurrences/238100277,http://data.gbif.org/ws/rest/occurrence/get?key=238100277
"National Museum of Nature and Science, Japan",Kochi Prefectural Makino Botanical Garden,,,,,,,MBK,MBK,175644,Specimen,,04:43.0,,,Sium suave Walter var. nipponicum (Maxim.) H.Hara,,Sium suave var. nipponicum (Maxim.) H.Hara,Plantae,,,Umbelliflorae,Umbelliferae,Sium,Japan,Japan,,,,Pref. Kochi,Eastern Asia,Japan,,,,,,,,,,,,http://data.gbif.org/occurrences/143974638,http://data.gbif.org/ws/rest/occurrence/get?key=143974638
"National Institute of Genetics, ROIS","Plant Specimen Database of Tama Forest Science Garden, Forestry and Forest Products Research Institute, Japan",,,,,,,FFPRI,TFA,21195,Specimen,,24:02.0,,,Sium suave Walter var. nipponicum (Maxim.) H.Hara,,Sium suave var. nipponicum (Maxim.) H.Hara,Plantae,Magnoliophyta,Magnoliopsida,Apiales,Apiaceae,Sium,Japan,Japan,Gotokuzi,Setagawa Ward,,Tokyo Prefecture,Eastern Asia,Japan,35.648754,139.6474,,45319,66,,,,,,,http://data.gbif.org/occurrences/360264509,http://data.gbif.org/ws/rest/occurrence/get?key=360264509
"National Institute of Genetics, ROIS","Plant Specimen Database of Tama Forest Science Garden, Forestry and Forest Products Research Institute, Japan",,,,,,,FFPRI,TFA,21196,Specimen,,24:02.0,,,Sium suave Walter var. nipponicum (Maxim.) H.Hara,,Sium suave var. nipponicum (Maxim.) H.Hara,Plantae,Magnoliophyta,Magnoliopsida,Apiales,Apiaceae,Sium,Japan,Japan,Nanae Village,Kameda County,,Hokkaido Prefecture,Eastern Asia,Japan,,,,,,,,,,,,http://data.gbif.org/occurrences/360264510,http://data.gbif.org/ws/rest/occurrence/get?key=360264510
"National Institute of Genetics, ROIS","Plant Specimen Database of Tama Forest Science Garden, Forestry and Forest Products Research Institute, Japan",,,,,,,FFPRI,TFA,21193,Specimen,,24:02.0,,,Sium suave Walter var. nipponicum (Maxim.) H.Hara,,Sium suave var. nipponicum (Maxim.) H.Hara,Plantae,Magnoliophyta,Magnoliopsida,Apiales,Apiaceae,Sium,Japan,Japan,,,,Ibaraki Prefecture,Eastern Asia,Japan,,,,,,,,,,,,http://data.gbif.org/occurrences/360264507,http://data.gbif.org/ws/rest/occurrence/get?key=360264507
"National Institute of Genetics, ROIS","Plant Specimen Database of Tama Forest Science Garden, Forestry and Forest Products Research Institute, Japan",,,,,,,FFPRI,TFA,21194,Specimen,,24:02.0,,,Sium suave Walter var. nipponicum (Maxim.) H.Hara,,Sium suave var. nipponicum (Maxim.) H.Hara,Plantae,Magnoliophyta,Magnoliopsida,Apiales,Apiaceae,Sium,Japan,Japan,Inba-numa,,,Tiba Prefecture,Eastern Asia,Japan,,,,,,,,,,,,http://data.gbif.org/occurrences/360264508,http://data.gbif.org/ws/rest/occurrence/get?key=360264508
"National Institute of Genetics, ROIS","Plant Specimen Database of Tama Forest Science Garden, Forestry and Forest Products Research Institute, Japan",,,,,,,FFPRI,TFA,21191,Specimen,,24:02.0,,,Sium suave Walter var. nipponicum (Maxim.) H.Hara,,Sium suave var. nipponicum (Maxim.) H.Hara,Plantae,Magnoliophyta,Magnoliopsida,Apiales,Apiaceae,Sium,Japan,Japan,,,,Ibaraki Prefecture,Eastern Asia,Japan,,,,,,,,,,,,http://data.gbif.org/occurrences/360264505,http://data.gbif.org/ws/rest/occurrence/get?key=360264505
"National Institute of Genetics, ROIS","Plant Specimen Database of Tama Forest Science Garden, Forestry and Forest Products Research Institute, Japan",,,,,,,FFPRI,TFA,21198,Specimen,,24:02.0,,,Sium suave Walter var. nipponicum (Maxim.) H.Hara,,Sium suave var. nipponicum (Maxim.) H.Hara,Plantae,Magnoliophyta,Magnoliopsida,Apiales,Apiaceae,Sium,Japan,Japan,,,,Tokyo Prefecture,Eastern Asia,Japan,,,,,,,,,,,,http://data.gbif.org/occurrences/360264512,http://data.gbif.org/ws/rest/occurrence/get?key=360264512
"National Institute of Genetics, ROIS","Plant Specimen Database of Tama Forest Science Garden, Forestry and Forest Products Research Institute, Japan",,,,,,,FFPRI,TFA,21192,Specimen,,24:02.0,,,Sium suave Walter var. nipponicum (Maxim.) H.Hara,,Sium suave var. nipponicum (Maxim.) H.Hara,Plantae,Magnoliophyta,Magnoliopsida,Apiales,Apiaceae,Sium,Japan,Japan,,,,Ibaraki Prefecture,Eastern Asia,Japan,,,,,,,,,,,,http://data.gbif.org/occurrences/360264506,http://data.gbif.org/ws/rest/occurrence/get?key=360264506
"National Institute of Genetics, ROIS","Plant Specimen Database of Tama Forest Science Garden, Forestry and Forest Products Research Institute, Japan",,,,,,,FFPRI,TFA,21197,Specimen,,24:02.0,,,Sium suave Walter var. nipponicum (Maxim.) H.Hara,,Sium suave var. nipponicum (Maxim.) H.Hara,Plantae,Magnoliophyta,Magnoliopsida,Apiales,Apiaceae,Sium,Japan,Japan,,,,Tokyo Prefecture,Eastern Asia,Japan,,,,,,,,,,,,http://data.gbif.org/occurrences/360264511,http://data.gbif.org/ws/rest/occurrence/get?key=360264511
"National Museum of Nature and Science, Japan",Vascular Plant Specimen Database of Kanagawa Prefectural Museum of Natural History,,,,,,,KPM,NA,KPM-NA0198590,Specimen,,31:14.0,,,Sium suave Walter var. nipponicum (Maxim.) H.Hara,,Sium suave var. nipponicum (Maxim.) H.Hara,Plantae,Angiospermae,Dicotyledoneae,,APIACEAE (UMBELLIFERAE),Sium,Japan,Japan,,Tochigi-shi,,Tochigi Prefecture,Eastern Asia,Japan,,,,,,,,,80,,,http://data.gbif.org/occurrences/388868825,http://data.gbif.org/ws/rest/occurrence/get?key=388868825
"National Museum of Nature and Science, Japan",Vascular Plant Specimen Database of Kanagawa Prefectural Museum of Natural History,,,,,,,KPM,NA,KPM-NA0198682,Specimen,,31:14.0,,,Sium suave Walter var. nipponicum (Maxim.) H.Hara,,Sium suave var. nipponicum (Maxim.) H.Hara,Plantae,Angiospermae,Dicotyledoneae,,APIACEAE (UMBELLIFERAE),Sium,Japan,Japan,,Tochigi-shi,,Tochigi Prefecture,Eastern Asia,Japan,,,,,,,,,80,,,http://data.gbif.org/occurrences/388868826,http://data.gbif.org/ws/rest/occurrence/get?key=388868826
"National Museum of Nature and Science, Japan",Vascular Plant Specimen Database of Kanagawa Prefectural Museum of Natural History,,,,,,,KPM,NA,KPM-NA0024585,Specimen,,31:13.0,,,Sium suave Walter var. nipponicum (Maxim.) H.Hara,,Sium suave var. nipponicum (Maxim.) H.Hara,Plantae,Angiospermae,Dicotyledoneae,,APIACEAE (UMBELLIFERAE),Sium,Japan,Japan,,"Akkeshi-gun, Akkeshi-cho",,Hokkaido,Eastern Asia,Japan,,,,,,,,,,,,http://data.gbif.org/occurrences/388868544,http://data.gbif.org/ws/rest/occurrence/get?key=388868544
"National Museum of Nature and Science, Japan",Vascular Plant Specimen Database of Kanagawa Prefectural Museum of Natural History,,,,,,,KPM,NA,KPM-NA0129536,Specimen,,31:13.0,,,Sium suave Walter var. nipponicum (Maxim.) H.Hara,,Sium suave var. nipponicum (Maxim.) H.Hara,Plantae,Angiospermae,Dicotyledoneae,,APIACEAE (UMBELLIFERAE),Sium,Japan,Japan,,Imaichi-shi,,Tochigi Prefecture,Eastern Asia,Japan,,,,,,,,,,,,http://data.gbif.org/occurrences/388868761,http://data.gbif.org/ws/rest/occurrence/get?key=388868761
"National Museum of Nature and Science, Japan",Vascular Plant Specimen Database of Kanagawa Prefectural Museum of Natural History,,,,,,,KPM,NA,KPM-NA0134633,Specimen,,31:13.0,,,Sium suave Walter var. nipponicum (Maxim.) H.Hara,,Sium suave var. nipponicum (Maxim.) H.Hara,Plantae,Angiospermae,Dicotyledoneae,,APIACEAE (UMBELLIFERAE),Sium,Japan,Japan,,Nikko-shi,,Tochigi Prefecture,Eastern Asia,Japan,,,,,,,,,,,,http://data.gbif.org/occurrences/388868774,http://data.gbif.org/ws/rest/occurrence/get?key=388868774
"National Museum of Nature and Science, Japan",Vascular Plant Specimen Database of Kanagawa Prefectural Museum of Natural History,,,,,,,KPM,NA,KPM-NA0161770,Specimen,,31:14.0,,,Sium suave Walter var. nipponicum (Maxim.) H.Hara,,Sium suave var. nipponicum (Maxim.) H.Hara,Plantae,Angiospermae,Dicotyledoneae,,APIACEAE (UMBELLIFERAE),Sium,Japan,Japan,,Nobeoka-shi,,Miyazaki Prefecture,Eastern Asia,Japan,,,,,,,,,,,,http://data.gbif.org/occurrences/388868799,http://data.gbif.org/ws/rest/occurrence/get?key=388868799
"National Museum of Nature and Science, Japan",Vascular Plant Specimen Database of Kanagawa Prefectural Museum of Natural History,,,,,,,KPM,NA,KPM-NA0074339,Specimen,,31:13.0,,,Sium suave Walter var. nipponicum (Maxim.) H.Hara,,Sium suave var. nipponicum (Maxim.) H.Hara,Plantae,Angiospermae,Dicotyledoneae,,APIACEAE (UMBELLIFERAE),Sium,Japan,Japan,,"Soya-gun, Sarufutsu-mura",,Hokkaido,Eastern Asia,Japan,,,,,,,,,,,,http://data.gbif.org/occurrences/388868628,http://data.gbif.org/ws/rest/occurrence/get?key=388868628
"National Museum of Nature and Science, Japan",Vascular plant specimens of Akita Prefectural Museum,,,,,,,AKPM,vs,55067,Specimen,,42:15.0,,,Sium suave Walter var. nipponicum (Maxim.) H.Hara,Walter,Sium suave var. nipponicum (Maxim.) H.Hara,Plantae,Angiospermae,Dicotyledoneae,,Apiaceae,Sium,Japan,Japan,,Omotegomura,,Fukushima,Eastern Asia,Japan,,,,,,,,,,,,http://data.gbif.org/occurrences/624033274,http://data.gbif.org/ws/rest/occurrence/get?key=624033274
"National Museum of Nature and Science, Japan","Plant specimens depodited in Osaka Museum of Natural History, Japan.",,,,,,,OSA,C,OSA63323,Specimen,,24:27.0,,,Sium suave Walter var. nipponicum (Maxim.) Hara,Walter,Sium suave var. nipponicum (Maxim.) Hara,Plantae,,,,Apiaceae,Sium,Japan,Japan,,Kasai-gun Hina-cho,,Hyogo Prefecture,Eastern Asia,Japan,,,,,,,,,,,,http://data.gbif.org/occurrences/295171661,http://data.gbif.org/ws/rest/occurrence/get?key=295171661
"National Institute of Genetics, ROIS","Herbarium Specimens of Museum of Nature and Human Activities, Hyogo Pref., Japan",,,,,,,HYO,VP,C1-077972,Specimen,,19:11.0,,,Sium suave subsp. nipponicum,,Sium suave subsp. nipponicum,Plantae,Magnoliophyta,,,Umbelliferae,Sium,Japan,Japan,"Hyogo Pref.; Mihara-gun, Seidan-cho, Matsuho",,,Hyogo,Eastern Asia,Japan,135.233,35.0167,,,,,,,470,470,,http://data.gbif.org/occurrences/323465814,http://data.gbif.org/ws/rest/occurrence/get?key=323465814
"National Institute of Genetics, ROIS","Herbarium Specimens of Museum of Nature and Human Activities, Hyogo Pref., Japan",,,,,,,HYO,VP,C1-115410,Specimen,,19:11.0,,,Sium suave subsp. nipponicum,,Sium suave subsp. nipponicum,Plantae,Magnoliophyta,,,Umbelliferae,Sium,Japan,Japan,"Hyogo Pref.; Mihara-gun, Seidan-cho, Matsuho",,,Hyogo,Eastern Asia,Japan,135.233,35.0167,,,,,,,470,470,,http://data.gbif.org/occurrences/323465816,http://data.gbif.org/ws/rest/occurrence/get?key=323465816
"National Museum of Nature and Science, Japan",Vascular Plants Collection of Sagamihara City Museum,,,,,,,JSCM,VS,38278,Specimen,,44:07.0,,,Sium suave Walt. subsp. nipponicum Sugimoto,Walt.,Sium suave subsp. nipponicum Sugimoto,Plantae,Spermatophyta,,,APIACEAE,Sium,Japan,Japan,,Minamisaku-gun Minamimakimura,,Nagano,Eastern Asia,Japan,,,,,,,,,1400,,,http://data.gbif.org/occurrences/387685416,http://data.gbif.org/ws/rest/occurrence/get?key=387685416
"National Museum of Nature and Science, Japan",Vascular Plants Collection of Sagamihara City Museum,,,,,,,JSCM,VS,38277,Specimen,,44:07.0,,,Sium suave Walt. subsp. nipponicum Sugimoto,Walt.,Sium suave subsp. nipponicum Sugimoto,Plantae,Spermatophyta,,,APIACEAE,Sium,Japan,Japan,,Minamisaku-gun Minamimakimura,,Nagano,Eastern Asia,Japan,,,,,,,,,1400,,,http://data.gbif.org/occurrences/387685415,http://data.gbif.org/ws/rest/occurrence/get?key=387685415
"National Museum of Nature and Science, Japan",Vascular Plants Collection of Sagamihara City Museum,,,,,,,JSCM,VS,22701,Specimen,,44:05.0,,,Sium suave Walt. subsp. nipponicum Sugimoto,Walt.,Sium suave subsp. nipponicum Sugimoto,Plantae,Spermatophyta,,,APIACEAE,Sium,Japan,Japan,,Hachioji-shi,,Tokyo,Eastern Asia,Japan,,,,,,,,,,,,http://data.gbif.org/occurrences/351229921,http://data.gbif.org/ws/rest/occurrence/get?key=351229921
"National Museum of Nature and Science, Japan",Vascular Plants Collection of Sagamihara City Museum,,,,,,,JSCM,VS,31398,Specimen,,44:06.0,,,Sium suave Walt. subsp. nipponicum Sugimoto,Walt.,Sium suave subsp. nipponicum Sugimoto,Plantae,Spermatophyta,,,APIACEAE,Sium,Japan,Japan,,Minamisaku-gun Komimachi,,Nagano,Eastern Asia,Japan,,,,,,,,,1,,,http://data.gbif.org/occurrences/387685137,http://data.gbif.org/ws/rest/occurrence/get?key=387685137
"National Museum of Nature and Science, Japan","Herbarium Specimens of Museum of Nature and Human Activities, Hyogo Prefecture, Japan",,,,,,,HYO,HYO-C,C1-193944,Specimen,,29:03.0,,,Sium suave Walter subsp. nipponicum (Maxim.) Sugimoto,Walter,Sium suave subsp. nipponicum (Maxim.) Sugimoto,Plantae,,,,Umbelliferae,Sium,Japan,Japan,,,,Hyogo,Eastern Asia,Japan,,,,,,,,,,,,http://data.gbif.org/occurrences/177383414,http://data.gbif.org/ws/rest/occurrence/get?key=177383414
"National Museum of Nature and Science, Japan","Herbarium Specimens of Museum of Nature and Human Activities, Hyogo Prefecture, Japan",,,,,,,HYO,C1,C1077972,Specimen,,29:05.0,,,Sium suave Walter subsp. nipponicum (Maxim.) Sugimoto,Walter,Sium suave subsp. nipponicum (Maxim.) Sugimoto,Plantae,,,,Umbelliferae,Sium,Japan,Japan,,,,Hyogo,Eastern Asia,Japan,,,,,,,,,470,,,http://data.gbif.org/occurrences/238052501,http://data.gbif.org/ws/rest/occurrence/get?key=238052501
"National Museum of Nature and Science, Japan","Herbarium Specimens of Museum of Nature and Human Activities, Hyogo Prefecture, Japan",,,,,,,HYO,C1,C1010600,Specimen,,29:06.0,,,Sium suave Walter subsp. nipponicum (Maxim.) Sugimoto,Walter,Sium suave subsp. nipponicum (Maxim.) Sugimoto,Plantae,,,,Umbelliferae,Sium,Japan,Japan,,,,Hyogo,Eastern Asia,Japan,,,,,,,,,,,,http://data.gbif.org/occurrences/238052663,http://data.gbif.org/ws/rest/occurrence/get?key=238052663
"National Museum of Nature and Science, Japan","Herbarium Specimens of Museum of Nature and Human Activities, Hyogo Prefecture, Japan",,,,,,,HYO,C1,C1079446,Specimen,,29:05.0,,,Sium suave Walter subsp. nipponicum (Maxim.) Sugimoto,Walter,Sium suave subsp. nipponicum (Maxim.) Sugimoto,Plantae,,,,Umbelliferae,Sium,Japan,Japan,,,,Hyogo,Eastern Asia,Japan,,,,,,,,,115,,,http://data.gbif.org/occurrences/238052469,http://data.gbif.org/ws/rest/occurrence/get?key=238052469
"National Museum of Nature and Science, Japan","Herbarium Specimens of Museum of Nature and Human Activities, Hyogo Prefecture, Japan",,,,,,,HYO,C1,C1014079,Specimen,,29:06.0,,,Sium suave Walter subsp. nipponicum (Maxim.) Sugimoto,Walter,Sium suave subsp. nipponicum (Maxim.) Sugimoto,Plantae,,,,Umbelliferae,Sium,Japan,Japan,,,,Hyogo,Eastern Asia,Japan,,,,,,,,,,,,http://data.gbif.org/occurrences/238052661,http://data.gbif.org/ws/rest/occurrence/get?key=238052661
"National Museum of Nature and Science, Japan","Herbarium Specimens of Museum of Nature and Human Activities, Hyogo Prefecture, Japan",,,,,,,HYO,C1,C1004010,Specimen,,29:06.0,,,Sium suave Walter subsp. nipponicum (Maxim.) Sugimoto,Walter,Sium suave subsp. nipponicum (Maxim.) Sugimoto,Plantae,,,,Umbelliferae,Sium,Japan,Japan,,,,Hyogo,Eastern Asia,Japan,,,,,,,,,,,,http://data.gbif.org/occurrences/238052660,http://data.gbif.org/ws/rest/occurrence/get?key=238052660
"National Museum of Nature and Science, Japan","Herbarium Specimens of Museum of Nature and Human Activities, Hyogo Prefecture, Japan",,,,,,,HYO,C1,C1015608,Specimen,,29:06.0,,,Sium suave Walter subsp. nipponicum (Maxim.) Sugimoto,Walter,Sium suave subsp. nipponicum (Maxim.) Sugimoto,Plantae,,,,Umbelliferae,Sium,Japan,Japan,,,,Hyogo,Eastern Asia,Japan,,,,,,,,,,,,http://data.gbif.org/occurrences/238052662,http://data.gbif.org/ws/rest/occurrence/get?key=238052662
"National Museum of Nature and Science, Japan","Herbarium Specimens of Museum of Nature and Human Activities, Hyogo Prefecture, Japan",,,,,,,HYO,C1,C1079445,Specimen,,29:05.0,,,Sium suave Walter subsp. nipponicum (Maxim.) Sugimoto,Walter,Sium suave subsp. nipponicum (Maxim.) Sugimoto,Plantae,,,,Umbelliferae,Sium,Japan,Japan,,,,Hyogo,Eastern Asia,Japan,,,,,,,,,115,,,http://data.gbif.org/occurrences/238052468,http://data.gbif.org/ws/rest/occurrence/get?key=238052468
"National Museum of Nature and Science, Japan","Herbarium Specimens of Museum of Nature and Human Activities, Hyogo Prefecture, Japan",,,,,,,HYO,C1,C1115410,Specimen,,29:05.0,,,Sium suave Walter subsp. nipponicum (Maxim.) Sugimoto,Walter,Sium suave subsp. nipponicum (Maxim.) Sugimoto,Plantae,,,,Umbelliferae,Sium,Japan,Japan,,,,Hyogo,Eastern Asia,Japan,,,,,,,,,470,,,http://data.gbif.org/occurrences/238052502,http://data.gbif.org/ws/rest/occurrence/get?key=238052502
"National Museum of Nature and Science, Japan","Ibaraki Nature Museum, Vascular Plants collection",,,,,,,INM,Va,115754,Specimen,,54:14.0,,,Sium suave Walter subsp. nipponicum (Maxim.) Sugimoto,(Maxim.) Sugimoto,Sium suave subsp. nipponicum (Maxim.) Sugimoto,Plantae,SPERMATOPHYTAANGIOSPERMAE,DICOTYLEDONEAE,,APIACEAE,Sium,Japan,Japan,,Mito-shi,,Ibaraki,Eastern Asia,Japan,,,,,,,,,,,,http://data.gbif.org/occurrences/381843478,http://data.gbif.org/ws/rest/occurrence/get?key=381843478
"National Museum of Nature and Science, Japan","Ibaraki Nature Museum, Vascular Plants collection",,,,,,,INM,Va,115746,Specimen,,54:14.0,,,Sium suave Walter subsp. nipponicum (Maxim.) Sugimoto,(Maxim.) Sugimoto,Sium suave subsp. nipponicum (Maxim.) Sugimoto,Plantae,SPERMATOPHYTAANGIOSPERMAE,DICOTYLEDONEAE,,APIACEAE,Sium,Japan,Japan,,,,Ibaraki,Eastern Asia,Japan,,,,,,,,,,,,http://data.gbif.org/occurrences/381843470,http://data.gbif.org/ws/rest/occurrence/get?key=381843470
"National Museum of Nature and Science, Japan","Ibaraki Nature Museum, Vascular Plants collection",,,,,,,INM,Va,20043,Specimen,,54:11.0,,,Sium suave Walter subsp. nipponicum (Maxim.) Sugimoto,(Maxim.) Sugimoto,Sium suave subsp. nipponicum (Maxim.) Sugimoto,Plantae,ANGIOSPERMAE,DICOTYLEDONEAE,,APIACEAE,Sium,Japan,Japan,,Nishiibaraki-gun Nanakaimura,,Ibaraki,Eastern Asia,Japan,,,,,,,,,200,,,http://data.gbif.org/occurrences/381843050,http://data.gbif.org/ws/rest/occurrence/get?key=381843050
"National Museum of Nature and Science, Japan","Ibaraki Nature Museum, Vascular Plants collection",,,,,,,INM,Va,115752,Specimen,,54:14.0,,,Sium suave Walter subsp. nipponicum (Maxim.) Sugimoto,(Maxim.) Sugimoto,Sium suave subsp. nipponicum (Maxim.) Sugimoto,Plantae,SPERMATOPHYTAANGIOSPERMAE,DICOTYLEDONEAE,,APIACEAE,Sium,Japan,Japan,,,,Ibaraki,Eastern Asia,Japan,,,,,,,,,,,,http://data.gbif.org/occurrences/381843476,http://data.gbif.org/ws/rest/occurrence/get?key=381843476
"National Museum of Nature and Science, Japan","Ibaraki Nature Museum, Vascular Plants collection",,,,,,,INM,Va,115750,Specimen,,54:14.0,,,Sium suave Walter subsp. nipponicum (Maxim.) Sugimoto,(Maxim.) Sugimoto,Sium suave subsp. nipponicum (Maxim.) Sugimoto,Plantae,SPERMATOPHYTAANGIOSPERMAE,DICOTYLEDONEAE,,APIACEAE,Sium,Japan,Japan,,Nishiibaraki-gun Tomobemachi,,Ibaraki,Eastern Asia,Japan,,,,,,,,,,,,http://data.gbif.org/occurrences/381843474,http://data.gbif.org/ws/rest/occurrence/get?key=381843474
"National Museum of Nature and Science, Japan","Ibaraki Nature Museum, Vascular Plants collection",,,,,,,INM,Va,19251,Specimen,,54:11.0,,,Sium suave Walter subsp. nipponicum (Maxim.) Sugimoto,(Maxim.) Sugimoto,Sium suave subsp. nipponicum (Maxim.) Sugimoto,Plantae,ANGIOSPERMAE,DICOTYLEDONEAE,,APIACEAE,Sium,Japan,Japan,,Makabe-gun Yamatomura,,Ibaraki,Eastern Asia,Japan,,,,,,,,,160,,,http://data.gbif.org/occurrences/381843042,http://data.gbif.org/ws/rest/occurrence/get?key=381843042