Data Publisher,Dataset,Dataset Rights,Collector name,Collector number,Field number,GUID,Date collected,Institution code,Collection code,Catalogue number,Basis of record,Image url,Last indexed,Identifier,Identification date,Scientific name,Author,Scientific name (interpreted),Kingdom,Phylum,Class,Order,Family,Genus,Country,Country (interpreted),Locality,County,Continent or Ocean,State/Province,Region,Publisher country,Latitude,Longitude,Coordinate precision,Cell id,Centi cell id,Min depth,Max depth,Max depth,Min altitude,Max altitude,Altitude precision,GBIF portal url,GBIF webservice url
"National Museum of Nature and Science, Japan",Angiosperm specimens of Iwate Prefectural Museum,,,,,,,IPMM,PA,72865,Specimen,,00:17.0,,,Sorbaria kirilowii (Regel) Maxim.,(Regel) Maxim.,Sorbaria kirilowii (Regel) Maxim.,Plantae,Angiospermae,Dicotyledoneae,,Rosaceae,Sorbaria,Japan,Japan,,Kamaishi-shi,,Iwate,Eastern Asia,Japan,,,,,,,,,,,,http://data.gbif.org/occurrences/93894983,http://data.gbif.org/ws/rest/occurrence/get?key=93894983
"National Museum of Nature and Science, Japan",Angiosperm specimens of Iwate Prefectural Museum,,,,,,,IPMM,PA,72866,Specimen,,00:17.0,,,Sorbaria kirilowii (Regel) Maxim.,(Regel) Maxim.,Sorbaria kirilowii (Regel) Maxim.,Plantae,Angiospermae,Dicotyledoneae,,Rosaceae,Sorbaria,Japan,Japan,,Kamaishi-shi,,Iwate,Eastern Asia,Japan,,,,,,,,,,,,http://data.gbif.org/occurrences/93894989,http://data.gbif.org/ws/rest/occurrence/get?key=93894989
"National Museum of Nature and Science, Japan",Angiosperm specimens of Iwate Prefectural Museum,,,,,,,IPMM,PA,22978,Specimen,,00:19.0,,,Sorbaria kirilowii (Regel) Maxim.,(Regel) Maxim.,Sorbaria kirilowii (Regel) Maxim.,Plantae,Angiospermae,Dicotyledoneae,Rosales,Rosaceae,Sorbaria,Japan,Japan,,Morioka-shi,,Iwate,Eastern Asia,Japan,,,,,,,,,,,,http://data.gbif.org/occurrences/204236517,http://data.gbif.org/ws/rest/occurrence/get?key=204236517
"National Museum of Nature and Science, Japan",Angiosperm specimens of Iwate Prefectural Museum,,,,,,,IPMM,PA,73211,Specimen,,00:17.0,,,Sorbaria kirilowii (Regel) Maxim.,(Regel) Maxim.,Sorbaria kirilowii (Regel) Maxim.,Plantae,Angiospermae,Dicotyledoneae,,Rosaceae,Sorbaria,Japan,Japan,,Kamaishi-shi,,Iwate,Eastern Asia,Japan,,,,,,,,,,,,http://data.gbif.org/occurrences/93894986,http://data.gbif.org/ws/rest/occurrence/get?key=93894986
"National Museum of Nature and Science, Japan",Angiosperm specimens of Iwate Prefectural Museum,,,,,,,IPMM,PA,72867,Specimen,,00:17.0,,,Sorbaria kirilowii (Regel) Maxim.,(Regel) Maxim.,Sorbaria kirilowii (Regel) Maxim.,Plantae,Angiospermae,Dicotyledoneae,,Rosaceae,Sorbaria,Japan,Japan,,Oshuu-shi,,Iwate,Eastern Asia,Japan,,,,,,,,,,,,http://data.gbif.org/occurrences/93894997,http://data.gbif.org/ws/rest/occurrence/get?key=93894997
"National Museum of Nature and Science, Japan",Angiosperm specimens of Iwate Prefectural Museum,,,,,,,IPMM,PA,28958,Specimen,,00:20.0,,,Sorbaria kirilowii (Regel) Maxim.,(Regel) Maxim.,Sorbaria kirilowii (Regel) Maxim.,Plantae,Angiospermae,Dicotyledoneae,Rosales,Rosaceae,Sorbaria,Japan,Japan,,Morioka-shi,,Iwate,Eastern Asia,Japan,,,,,,,,,,,,http://data.gbif.org/occurrences/204236620,http://data.gbif.org/ws/rest/occurrence/get?key=204236620
"National Institute of Genetics, ROIS","Plant Specimen Database of Tama Forest Science Garden, Forestry and Forest Products Research Institute, Japan",,,,,,,FFPRI,TFA,13529,Specimen,,22:36.0,,,Sorbaria kirilowii (Regel) Maxim.,,Sorbaria kirilowii (Regel) Maxim.,Plantae,Magnoliophyta,Magnoliopsida,Rosales,Rosaceae,Sorbaria,Japan,Japan,"Asakawa Experimental Forest, Forestry and Forest Products Research Institute",Hatiozi City,,Tokyo Prefecture,Eastern Asia,Japan,35.646755,139.27286,,45319,62,,,,180,250,,http://data.gbif.org/occurrences/360256826,http://data.gbif.org/ws/rest/occurrence/get?key=360256826
"National Institute of Genetics, ROIS","Plant Specimen Database of Tama Forest Science Garden, Forestry and Forest Products Research Institute, Japan",,,,,,,FFPRI,TFA,13530,Specimen,,22:36.0,,,Sorbaria kirilowii (Regel) Maxim.,,Sorbaria kirilowii (Regel) Maxim.,Plantae,Magnoliophyta,Magnoliopsida,Rosales,Rosaceae,Sorbaria,Japan,Japan,"Asakawa Experimental Forest, Forestry and Forest Products Research Institute",Hatiozi City,,Tokyo Prefecture,Eastern Asia,Japan,35.646755,139.27286,,45319,62,,,,180,250,,http://data.gbif.org/occurrences/360256827,http://data.gbif.org/ws/rest/occurrence/get?key=360256827
"National Institute of Genetics, ROIS","Plant Specimen Database of Tama Forest Science Garden, Forestry and Forest Products Research Institute, Japan",,,,,,,FFPRI,TFA,13532,Specimen,,22:36.0,,,Sorbaria kirilowii (Regel) Maxim.,,Sorbaria kirilowii (Regel) Maxim.,Plantae,Magnoliophyta,Magnoliopsida,Rosales,Rosaceae,Sorbaria,Japan,Japan,"Asakawa Experimental Forest, Forestry and Forest Products Research Institute",Hatiozi City,,Tokyo Prefecture,Eastern Asia,Japan,35.646755,139.27286,,45319,62,,,,180,250,,http://data.gbif.org/occurrences/360256829,http://data.gbif.org/ws/rest/occurrence/get?key=360256829
"National Institute of Genetics, ROIS","Plant Specimen Database of Tama Forest Science Garden, Forestry and Forest Products Research Institute, Japan",,,,,,,FFPRI,TFA,13531,Specimen,,22:36.0,,,Sorbaria kirilowii (Regel) Maxim.,,Sorbaria kirilowii (Regel) Maxim.,Plantae,Magnoliophyta,Magnoliopsida,Rosales,Rosaceae,Sorbaria,Japan,Japan,"Asakawa Experimental Forest, Forestry and Forest Products Research Institute",Hatiozi City,,Tokyo Prefecture,Eastern Asia,Japan,35.646755,139.27286,,45319,62,,,,180,250,,http://data.gbif.org/occurrences/360256828,http://data.gbif.org/ws/rest/occurrence/get?key=360256828
"National Museum of Nature and Science, Japan","Plant specimens depodited in Osaka Museum of Natural History, Japan.",,,,,,,OSA,C,OSA682,Specimen,,24:29.0,,,Sorbaria kirilowii Ragel,Ragel,Sorbaria kirilowii Ragel,Plantae,,,,Rosaceae,Sorbaria,Japan,Japan,cult.,Nishinomiya-shi,,Hyogo Prefecture,Eastern Asia,Japan,,,,,,,,,,,,http://data.gbif.org/occurrences/295171839,http://data.gbif.org/ws/rest/occurrence/get?key=295171839
"National Museum of Nature and Science, Japan","Plant specimens depodited in Osaka Museum of Natural History, Japan.",,,,,,,OSA,C,OSA76086,Specimen,,24:32.0,,,Sorbaria kirilowii Regel,,Sorbaria kirilowii Regel,Plantae,,,,Rosaceae,Sorbaria,Japan,Japan,,Kaizuka-shi,,Osaka,Eastern Asia,Japan,,,,,,,,,,,,http://data.gbif.org/occurrences/295172441,http://data.gbif.org/ws/rest/occurrence/get?key=295172441
"National Museum of Nature and Science, Japan","Plant specimens depodited in Osaka Museum of Natural History, Japan.",,,,,,,OSA,C,OSA41150,Specimen,,24:31.0,,,Sorbaria kirilowii Regel,Regel,Sorbaria kirilowii Regel,Plantae,,,,Rosaceae,Sorbaria,Japan,Japan,,Kobe-shi,,Hyogo Prefecture,Eastern Asia,Japan,,,,,,,,,,,,http://data.gbif.org/occurrences/295172114,http://data.gbif.org/ws/rest/occurrence/get?key=295172114
"National Museum of Nature and Science, Japan","Plant specimens depodited in Osaka Museum of Natural History, Japan.",,,,,,,OSA,C,OSA1355,Specimen,,24:29.0,,,Sorbaria kirilowii Regel,Regel,Sorbaria kirilowii Regel,Plantae,,,,Rosaceae,Sorbaria,Japan,Japan,cult.,Nishinomiya-shi,,Hyogo Prefecture,Eastern Asia,Japan,,,,,,,,,,,,http://data.gbif.org/occurrences/295171844,http://data.gbif.org/ws/rest/occurrence/get?key=295171844
"National Museum of Nature and Science, Japan",Vascular Plant Specimen Database of Kanagawa Prefectural Museum of Natural History,,,,,,,KPM,NA,KPM-NA1046660,Specimen,,31:18.0,,,Sorbaria kirilowii Regel,,Sorbaria kirilowii Regel,Plantae,Angiospermae,Dicotyledoneae,,ROSACEAE,Sorbaria,Japan,Japan,,Yamato-shi,,Kanagawa Prefecture,Eastern Asia,Japan,35.5074,139.441,,45319,54,,,,,,,http://data.gbif.org/occurrences/234435365,http://data.gbif.org/ws/rest/occurrence/get?key=234435365
