Data Publisher,Dataset,Dataset Rights,Collector name,Collector number,Field number,GUID,Date collected,Institution code,Collection code,Catalogue number,Basis of record,Image url,Last indexed,Identifier,Identification date,Scientific name,Author,Scientific name (interpreted),Kingdom,Phylum,Class,Order,Family,Genus,Country,Country (interpreted),Locality,County,Continent or Ocean,State/Province,Region,Publisher country,Latitude,Longitude,Coordinate precision,Cell id,Centi cell id,Min depth,Max depth,Max depth,Min altitude,Max altitude,Altitude precision,GBIF portal url,GBIF webservice url
"National Museum of Natural History, Smithsonian Institution",NMNH Botany Collections,See: http://www.mnh.si.edu/rc/db/2data_access_policy.html,Collector unknown,W-521,,,,US,Botany,USw12521,Specimen,,23:39.0,,,Sorbus commixta,,Sorbus commixta,Plantae,,Dicotyledonae,Rosales,Rosaceae,Sorbus,Japan,Japan,,,Asia-Temperate,,Eastern Asia,United States,,,,,,,,,,,,http://data.gbif.org/occurrences/243644588,http://data.gbif.org/ws/rest/occurrence/get?key=243644588
"National Museum of Natural History, Smithsonian Institution",NMNH Botany Collections,See: http://www.mnh.si.edu/rc/db/2data_access_policy.html,Collector unknown,,,,,US,Botany,USw12517,Specimen,,23:39.0,,,Sorbus commixta,,Sorbus commixta,Plantae,,Dicotyledonae,Rosales,Rosaceae,Sorbus,Japan,Japan,,,Asia-Temperate,,Eastern Asia,United States,,,,,,,,,,,,http://data.gbif.org/occurrences/243644583,http://data.gbif.org/ws/rest/occurrence/get?key=243644583
"National Museum of Natural History, Smithsonian Institution",NMNH Botany Collections,See: http://www.mnh.si.edu/rc/db/2data_access_policy.html,Collector unknown,W-519,,,,US,Botany,USw12519,Specimen,,23:39.0,,,Sorbus commixta,,Sorbus commixta,Plantae,,Dicotyledonae,Rosales,Rosaceae,Sorbus,Japan,Japan,,,Asia-Temperate,,Eastern Asia,United States,,,,,,,,,,,,http://data.gbif.org/occurrences/243644585,http://data.gbif.org/ws/rest/occurrence/get?key=243644585
"National Museum of Natural History, Smithsonian Institution",NMNH Botany Collections,See: http://www.mnh.si.edu/rc/db/2data_access_policy.html,Collector unknown,W-520,,,,US,Botany,USw12520,Specimen,,23:39.0,,,Sorbus commixta,,Sorbus commixta,Plantae,,Dicotyledonae,Rosales,Rosaceae,Sorbus,Japan,Japan,,,Asia-Temperate,,Eastern Asia,United States,,,,,,,,,,,,http://data.gbif.org/occurrences/243644586,http://data.gbif.org/ws/rest/occurrence/get?key=243644586
"National Museum of Natural History, Smithsonian Institution",NMNH Botany Collections,See: http://www.mnh.si.edu/rc/db/2data_access_policy.html,Collector unknown,W-518,,,,US,Botany,USw12518,Specimen,,23:39.0,,,Sorbus commixta,,Sorbus commixta,Plantae,,Dicotyledonae,Rosales,Rosaceae,Sorbus,Japan,Japan,,,Asia-Temperate,,Eastern Asia,United States,,,,,,,,,,,,http://data.gbif.org/occurrences/243644584,http://data.gbif.org/ws/rest/occurrence/get?key=243644584
Yale University Peabody Museum,Peabody Paleobotany DiGIR Service,"Peabody Museum data records may be used by individual researchers or research groups, but they may not be repackaged, resold, or redistributed in any form without the express written consent of a curatorial staff member of the museum. If any of these records are used in an analysis or report, the provenance of the original data must be acknowledged and the Peabody notified. Yale University and the Peabody Museum of Natural History and its staff are not responsible for damages, injury or loss due to the use of these data.",,,,,00:00.0,YPM,PB,YPM PB 164608,Specimen,,12:56.0,,,Sorbus commixta,Hedl.,Sorbus commixta,Plantae,Tracheophyta,,Rosales,Rosaceae,Sorbus,Japan,Japan,"Honshu. Coll.: Hotta, M. & Fukuoka, N",,Asia,,Eastern Asia,United States,,,,,,,,,,,,http://data.gbif.org/occurrences/352439610,http://data.gbif.org/ws/rest/occurrence/get?key=352439610
Yale University Peabody Museum,Peabody Paleoportal DiGIR Service (PB),"Peabody Museum data records may be used by individual researchers or research groups, but they may not be repackaged, resold, or redistributed in any form without the express written consent of a curatorial staff member of the museum. If any of these records are used in an analysis or report, the provenance of the original data must be acknowledged and the Peabody notified. Yale University and the Peabody Museum of Natural History and its staff are not responsible for damages, injury or loss due to the use of these data.",,,,,00:00.0,YPM,PB,PB.164608,Specimen,,22:56.0,,,Sorbus commixta,Hedl.,Sorbus commixta,Plantae,Tracheophyta,,Rosales,Rosaceae,Sorbus,Japan,Japan,"Honshu. Coll.: Hotta, M. & Fukuoka, N",,Asia,,Eastern Asia,United States,,,,,,,,,,,,http://data.gbif.org/occurrences/203389166,http://data.gbif.org/ws/rest/occurrence/get?key=203389166
Yale University Peabody Museum,Peabody Paleobotany DiGIR Service,"Peabody Museum data records may be used by individual researchers or research groups, but they may not be repackaged, resold, or redistributed in any form without the express written consent of a curatorial staff member of the museum. If any of these records are used in an analysis or report, the provenance of the original data must be acknowledged and the Peabody notified. Yale University and the Peabody Museum of Natural History and its staff are not responsible for damages, injury or loss due to the use of these data.",,,,,00:00.0,YPM,PB,PB.164608,Specimen,,56:04.0,,,Sorbus commixta,Hedl.,Sorbus commixta,Plantae,Tracheophyta,,Rosales,Rosaceae,Sorbus,Japan,Japan,"Honshu. Coll.: Hotta, M. & Fukuoka, N",,Asia,,Eastern Asia,United States,,,,,,,,,,,,http://data.gbif.org/occurrences/202660644,http://data.gbif.org/ws/rest/occurrence/get?key=202660644
Yale University Peabody Museum,Peabody Paleoportal DiGIR Service (PB),"Peabody Museum data records may be used by individual researchers or research groups, but they may not be repackaged, resold, or redistributed in any form without the express written consent of a curatorial staff member of the museum. If any of these records are used in an analysis or report, the provenance of the original data must be acknowledged and the Peabody notified. Yale University and the Peabody Museum of Natural History and its staff are not responsible for damages, injury or loss due to the use of these data.",,,,,00:00.0,YPM,PB,YPM PB 164608,Specimen,,51:19.0,,,Sorbus commixta,Hedl.,Sorbus commixta,Plantae,Tracheophyta,,Rosales,Rosaceae,Sorbus,Japan,Japan,"Honshu. Coll.: Hotta, M. & Fukuoka, N",,Asia,,Eastern Asia,United States,,,,,,,,,,,,http://data.gbif.org/occurrences/352266569,http://data.gbif.org/ws/rest/occurrence/get?key=352266569
"National Museum of Nature and Science, Japan",Angiosperm specimens of Iwate Prefectural Museum,,,,,,,IPMM,PA,74714,Specimen,,00:17.0,,,Sorbus commixta Hedl.,Hedl.,Sorbus commixta Hedl.,Plantae,Angiospermae,Dicotyledoneae,,Rosaceae,Sorbus,Japan,Japan,,,,Hokkaido,Eastern Asia,Japan,,,,,,,,,,,,http://data.gbif.org/occurrences/93895000,http://data.gbif.org/ws/rest/occurrence/get?key=93895000
"National Museum of Nature and Science, Japan",Angiosperm specimens of Iwate Prefectural Museum,,,,,,,IPMM,PA,5068,Specimen,,00:19.0,,,Sorbus commixta Hedl.,Hedl.,Sorbus commixta Hedl.,Plantae,Angiospermae,Dicotyledoneae,Rosales,Rosaceae,Sorbus,Japan,Japan,,Hanamaki-shi,,Iwate,Eastern Asia,Japan,,,,,,,,,,,,http://data.gbif.org/occurrences/204236372,http://data.gbif.org/ws/rest/occurrence/get?key=204236372
"National Museum of Nature and Science, Japan",Angiosperm specimens of Iwate Prefectural Museum,,,,,,,IPMM,PA,28973,Specimen,,00:20.0,,,Sorbus commixta Hedl.,Hedl.,Sorbus commixta Hedl.,Plantae,Angiospermae,Dicotyledoneae,Rosales,Rosaceae,Sorbus,Japan,Japan,,Akita-shi,,Akita,Eastern Asia,Japan,,,,,,,,,,,,http://data.gbif.org/occurrences/204236623,http://data.gbif.org/ws/rest/occurrence/get?key=204236623
"National Museum of Nature and Science, Japan",Angiosperm specimens of Iwate Prefectural Museum,,,,,,,IPMM,PA,22982,Specimen,,00:19.0,,,Sorbus commixta Hedl.,Hedl.,Sorbus commixta Hedl.,Plantae,Angiospermae,Dicotyledoneae,Rosales,Rosaceae,Sorbus,Japan,Japan,,Shimohei-gun Iwaizumicho,,Iwate,Eastern Asia,Japan,,,,,,,,,,,,http://data.gbif.org/occurrences/204236520,http://data.gbif.org/ws/rest/occurrence/get?key=204236520
"National Museum of Nature and Science, Japan",Angiosperm specimens of Iwate Prefectural Museum,,,,,,,IPMM,PA,28977,Specimen,,00:20.0,,,Sorbus commixta Hedl.,Hedl.,Sorbus commixta Hedl.,Plantae,Angiospermae,Dicotyledoneae,Rosales,Rosaceae,Sorbus,Japan,Japan,,Kamikawa-gun Kamikawacho,,Hokkaido,Eastern Asia,Japan,,,,,,,,,,,,http://data.gbif.org/occurrences/204236627,http://data.gbif.org/ws/rest/occurrence/get?key=204236627
"National Museum of Nature and Science, Japan",Angiosperm specimens of Iwate Prefectural Museum,,,,,,,IPMM,PA,33227,Specimen,,00:20.0,,,Sorbus commixta Hedl.,Hedl.,Sorbus commixta Hedl.,Plantae,Angiospermae,Dicotyledoneae,Rosales,Rosaceae,Sorbus,Japan,Japan,,Shibetsu-shi,,Hokkaido,Eastern Asia,Japan,,,,,,,,,,,,http://data.gbif.org/occurrences/204236747,http://data.gbif.org/ws/rest/occurrence/get?key=204236747
"National Museum of Nature and Science, Japan",Angiosperm specimens of Iwate Prefectural Museum,,,,,,,IPMM,PA,28978,Specimen,,00:20.0,,,Sorbus commixta Hedl.,Hedl.,Sorbus commixta Hedl.,Plantae,Angiospermae,Dicotyledoneae,Rosales,Rosaceae,Sorbus,Japan,Japan,,Sorachi-gun Minamifuranocho,,Hokkaido,Eastern Asia,Japan,,,,,,,,,,,,http://data.gbif.org/occurrences/204236628,http://data.gbif.org/ws/rest/occurrence/get?key=204236628
"National Museum of Nature and Science, Japan",Angiosperm specimens of Iwate Prefectural Museum,,,,,,,IPMM,PA,5070,Specimen,,00:19.0,,,Sorbus commixta Hedl.,Hedl.,Sorbus commixta Hedl.,Plantae,Angiospermae,Dicotyledoneae,Rosales,Rosaceae,Sorbus,Japan,Japan,,Shiwa-gun Yahabacho,,Iwate,Eastern Asia,Japan,,,,,,,,,,,,http://data.gbif.org/occurrences/204236374,http://data.gbif.org/ws/rest/occurrence/get?key=204236374
"National Museum of Nature and Science, Japan",Angiosperm specimens of Iwate Prefectural Museum,,,,,,,IPMM,PA,28980,Specimen,,00:20.0,,,Sorbus commixta Hedl.,Hedl.,Sorbus commixta Hedl.,Plantae,Angiospermae,Dicotyledoneae,Rosales,Rosaceae,Sorbus,Japan,Japan,,Morioka-shi,,Iwate,Eastern Asia,Japan,,,,,,,,,,,,http://data.gbif.org/occurrences/204236630,http://data.gbif.org/ws/rest/occurrence/get?key=204236630
"National Museum of Nature and Science, Japan",Angiosperm specimens of Iwate Prefectural Museum,,,,,,,IPMM,PA,41403,Specimen,,00:21.0,,,Sorbus commixta Hedl.,Hedl.,Sorbus commixta Hedl.,Plantae,Angiospermae,Dicotyledoneae,Rosales,Rosaceae,Sorbus,Japan,Japan,,Kitakami-shi,,Iwate,Eastern Asia,Japan,,,,,,,,,,,,http://data.gbif.org/occurrences/204236820,http://data.gbif.org/ws/rest/occurrence/get?key=204236820
"National Museum of Nature and Science, Japan",Angiosperm specimens of Iwate Prefectural Museum,,,,,,,IPMM,PA,28976,Specimen,,00:20.0,,,Sorbus commixta Hedl.,Hedl.,Sorbus commixta Hedl.,Plantae,Angiospermae,Dicotyledoneae,Rosales,Rosaceae,Sorbus,Japan,Japan,,,,Iwate,Eastern Asia,Japan,,,,,,,,,,,,http://data.gbif.org/occurrences/204236626,http://data.gbif.org/ws/rest/occurrence/get?key=204236626
"National Museum of Nature and Science, Japan",Angiospermatatophytina Collection of Saitama Museum of Natural History,,,,,,,SMNH,As,23181,Specimen,,53:48.0,,,Sorbus commixta Hedl.,Hedl.,Sorbus commixta Hedl.,Plantae,Angiospermae,Dicotyledoneae,Rosales,Rosaceae,Sorbus,Japan,Japan,Mt. Asahi-dake,Nasu-gun Nasumachi,,Tochigi,Eastern Asia,Japan,,,,,,,,,,,,http://data.gbif.org/occurrences/393111836,http://data.gbif.org/ws/rest/occurrence/get?key=393111836
"National Museum of Nature and Science, Japan",Angiosperm specimens of Iwate Prefectural Museum,,,,,,,IPMM,PA,49949,Specimen,,00:21.0,,,Sorbus commixta Hedl.,Hedl.,Sorbus commixta Hedl.,Plantae,Angiospermae,Dicotyledoneae,Rosales,Rosaceae,Sorbus,Japan,Japan,,Miyako-shi,,Iwate,Eastern Asia,Japan,,,,,,,,,,,,http://data.gbif.org/occurrences/204236860,http://data.gbif.org/ws/rest/occurrence/get?key=204236860
"National Museum of Nature and Science, Japan",Angiosperm specimens of Iwate Prefectural Museum,,,,,,,IPMM,PA,5067,Specimen,,00:19.0,,,Sorbus commixta Hedl.,Hedl.,Sorbus commixta Hedl.,Plantae,Angiospermae,Dicotyledoneae,Rosales,Rosaceae,Sorbus,Japan,Japan,,Hanamaki-shi,,Iwate,Eastern Asia,Japan,,,,,,,,,,,,http://data.gbif.org/occurrences/204236371,http://data.gbif.org/ws/rest/occurrence/get?key=204236371
"National Museum of Nature and Science, Japan",Angiosperm specimens of Iwate Prefectural Museum,,,,,,,IPMM,PA,72868,Specimen,,00:17.0,,,Sorbus commixta Hedl.,Hedl.,Sorbus commixta Hedl.,Plantae,Angiospermae,Dicotyledoneae,,Rosaceae,Sorbus,Japan,Japan,,Kamihei-gun Otsuchicho,,Iwate,Eastern Asia,Japan,,,,,,,,,,,,http://data.gbif.org/occurrences/93895003,http://data.gbif.org/ws/rest/occurrence/get?key=93895003
"National Museum of Nature and Science, Japan",Angiosperm specimens of Iwate Prefectural Museum,,,,,,,IPMM,PA,73160,Specimen,,00:17.0,,,Sorbus commixta Hedl.,Hedl.,Sorbus commixta Hedl.,Plantae,Angiospermae,Dicotyledoneae,,Rosaceae,Sorbus,Japan,Japan,,Hanamaki-shi,,Iwate,Eastern Asia,Japan,,,,,,,,,,,,http://data.gbif.org/occurrences/93895021,http://data.gbif.org/ws/rest/occurrence/get?key=93895021
"National Museum of Nature and Science, Japan",Angiosperm specimens of Iwate Prefectural Museum,,,,,,,IPMM,PA,28971,Specimen,,00:20.0,,,Sorbus commixta Hedl.,Hedl.,Sorbus commixta Hedl.,Plantae,Angiospermae,Dicotyledoneae,Rosales,Rosaceae,Sorbus,Japan,Japan,,Ichinoseki-shi,,Iwate,Eastern Asia,Japan,,,,,,,,,,,,http://data.gbif.org/occurrences/204236621,http://data.gbif.org/ws/rest/occurrence/get?key=204236621
"National Museum of Nature and Science, Japan",Angiosperm specimens of Iwate Prefectural Museum,,,,,,,IPMM,PA,33229,Specimen,,00:20.0,,,Sorbus commixta Hedl.,Hedl.,Sorbus commixta Hedl.,Plantae,Angiospermae,Dicotyledoneae,Rosales,Rosaceae,Sorbus,Japan,Japan,,Kazuno-shi,,Akita,Eastern Asia,Japan,,,,,,,,,,,,http://data.gbif.org/occurrences/204236749,http://data.gbif.org/ws/rest/occurrence/get?key=204236749
"National Museum of Nature and Science, Japan",Angiosperm specimens of Iwate Prefectural Museum,,,,,,,IPMM,PA,28972,Specimen,,00:20.0,,,Sorbus commixta Hedl.,Hedl.,Sorbus commixta Hedl.,Plantae,Angiospermae,Dicotyledoneae,Rosales,Rosaceae,Sorbus,Japan,Japan,,Tono-shi,,Iwate,Eastern Asia,Japan,,,,,,,,,,,,http://data.gbif.org/occurrences/204236622,http://data.gbif.org/ws/rest/occurrence/get?key=204236622
"National Museum of Nature and Science, Japan",Angiosperm specimens of Iwate Prefectural Museum,,,,,,,IPMM,PA,72870,Specimen,,00:17.0,,,Sorbus commixta Hedl.,Hedl.,Sorbus commixta Hedl.,Plantae,Angiospermae,Dicotyledoneae,,Rosaceae,Sorbus,Japan,Japan,,Ofunato-shi,,Iwate,Eastern Asia,Japan,,,,,,,,,,,,http://data.gbif.org/occurrences/93895005,http://data.gbif.org/ws/rest/occurrence/get?key=93895005
"National Museum of Nature and Science, Japan",Angiosperm specimens of Iwate Prefectural Museum,,,,,,,IPMM,PA,28975,Specimen,,00:20.0,,,Sorbus commixta Hedl.,Hedl.,Sorbus commixta Hedl.,Plantae,Angiospermae,Dicotyledoneae,Rosales,Rosaceae,Sorbus,Japan,Japan,,Aomori-shi,,Aomori,Eastern Asia,Japan,,,,,,,,,,,,http://data.gbif.org/occurrences/204236625,http://data.gbif.org/ws/rest/occurrence/get?key=204236625
"National Museum of Nature and Science, Japan",Angiosperm specimens of Iwate Prefectural Museum,,,,,,,IPMM,PA,7474,Specimen,,00:19.0,,,Sorbus commixta Hedl.,Hedl.,Sorbus commixta Hedl.,Plantae,Angiospermae,Dicotyledoneae,Rosales,Rosaceae,Sorbus,Japan,Japan,,Hanamaki-shi,,Iwate,Eastern Asia,Japan,,,,,,,,,,,,http://data.gbif.org/occurrences/204236450,http://data.gbif.org/ws/rest/occurrence/get?key=204236450
"National Museum of Nature and Science, Japan",Angiosperm specimens of Iwate Prefectural Museum,,,,,,,IPMM,PA,28979,Specimen,,00:20.0,,,Sorbus commixta Hedl.,Hedl.,Sorbus commixta Hedl.,Plantae,Angiospermae,Dicotyledoneae,Rosales,Rosaceae,Sorbus,Japan,Japan,,Yuubari-gun Yunicho,,Hokkaido,Eastern Asia,Japan,,,,,,,,,,,,http://data.gbif.org/occurrences/204236629,http://data.gbif.org/ws/rest/occurrence/get?key=204236629
"National Museum of Nature and Science, Japan",Angiosperm specimens of Iwate Prefectural Museum,,,,,,,IPMM,PA,5069,Specimen,,00:19.0,,,Sorbus commixta Hedl.,Hedl.,Sorbus commixta Hedl.,Plantae,Angiospermae,Dicotyledoneae,Rosales,Rosaceae,Sorbus,Japan,Japan,,Iwate-gun Shizukuishicho,,Iwate,Eastern Asia,Japan,,,,,,,,,,,,http://data.gbif.org/occurrences/204236373,http://data.gbif.org/ws/rest/occurrence/get?key=204236373
"National Museum of Nature and Science, Japan",Angiosperm specimens of Iwate Prefectural Museum,,,,,,,IPMM,PA,22980,Specimen,,00:19.0,,,Sorbus commixta Hedl.,Hedl.,Sorbus commixta Hedl.,Plantae,Angiospermae,Dicotyledoneae,Rosales,Rosaceae,Sorbus,Japan,Japan,,Ichinoseki-shi,,Iwate,Eastern Asia,Japan,,,,,,,,,,,,http://data.gbif.org/occurrences/204236518,http://data.gbif.org/ws/rest/occurrence/get?key=204236518
"National Museum of Nature and Science, Japan",Angiosperm specimens of Iwate Prefectural Museum,,,,,,,IPMM,PA,78544,Specimen,,00:21.0,,,Sorbus commixta Hedl.,Hedl.,Sorbus commixta Hedl.,Plantae,Angiospermae,Dicotyledoneae,Rosales,Rosaceae,Sorbus,Japan,Japan,,Nishitsugaru-gun Ajigasawamachi,,Aomori,Eastern Asia,Japan,,,,,,,,,,,,http://data.gbif.org/occurrences/204236872,http://data.gbif.org/ws/rest/occurrence/get?key=204236872
"National Museum of Nature and Science, Japan",Angiosperm specimens of Iwate Prefectural Museum,,,,,,,IPMM,PA,74712,Specimen,,00:17.0,,,Sorbus commixta Hedl.,Hedl.,Sorbus commixta Hedl.,Plantae,Angiospermae,Dicotyledoneae,,Rosaceae,Sorbus,Japan,Japan,,Ofunato-shi,,Iwate,Eastern Asia,Japan,,,,,,,,,,,,http://data.gbif.org/occurrences/93895018,http://data.gbif.org/ws/rest/occurrence/get?key=93895018
"National Museum of Nature and Science, Japan",Angiosperm specimens of Iwate Prefectural Museum,,,,,,,IPMM,PA,72869,Specimen,,00:17.0,,,Sorbus commixta Hedl.,Hedl.,Sorbus commixta Hedl.,Plantae,Angiospermae,Dicotyledoneae,,Rosaceae,Sorbus,Japan,Japan,,Shimohei-gun Yamadamachi,,Iwate,Eastern Asia,Japan,,,,,,,,,,,,http://data.gbif.org/occurrences/93895020,http://data.gbif.org/ws/rest/occurrence/get?key=93895020
"National Museum of Nature and Science, Japan",Angiosperm specimens of Iwate Prefectural Museum,,,,,,,IPMM,PA,72872,Specimen,,00:17.0,,,Sorbus commixta Hedl.,Hedl.,Sorbus commixta Hedl.,Plantae,Angiospermae,Dicotyledoneae,,Rosaceae,Sorbus,Japan,Japan,,,,Hokkaido,Eastern Asia,Japan,,,,,,,,,,,,http://data.gbif.org/occurrences/93895023,http://data.gbif.org/ws/rest/occurrence/get?key=93895023
"National Museum of Nature and Science, Japan",Angiosperm specimens of Iwate Prefectural Museum,,,,,,,IPMM,PA,33228,Specimen,,00:20.0,,,Sorbus commixta Hedl.,Hedl.,Sorbus commixta Hedl.,Plantae,Angiospermae,Dicotyledoneae,Rosales,Rosaceae,Sorbus,Japan,Japan,,Akita-shi,,Akita,Eastern Asia,Japan,,,,,,,,,,,,http://data.gbif.org/occurrences/204236748,http://data.gbif.org/ws/rest/occurrence/get?key=204236748
"National Museum of Nature and Science, Japan",Angiosperm specimens of Iwate Prefectural Museum,,,,,,,IPMM,PA,72871,Specimen,,00:17.0,,,Sorbus commixta Hedl.,Hedl.,Sorbus commixta Hedl.,Plantae,Angiospermae,Dicotyledoneae,,Rosaceae,Sorbus,Japan,Japan,,Ofunato-shi,,Iwate,Eastern Asia,Japan,,,,,,,,,,,,http://data.gbif.org/occurrences/93895010,http://data.gbif.org/ws/rest/occurrence/get?key=93895010
"National Museum of Nature and Science, Japan",Angiosperm specimens of Iwate Prefectural Museum,,,,,,,IPMM,PA,74713,Specimen,,00:17.0,,,Sorbus commixta Hedl.,Hedl.,Sorbus commixta Hedl.,Plantae,Angiospermae,Dicotyledoneae,,Rosaceae,Sorbus,Japan,Japan,,Miyako-shi,,Iwate,Eastern Asia,Japan,,,,,,,,,,,,http://data.gbif.org/occurrences/93895022,http://data.gbif.org/ws/rest/occurrence/get?key=93895022
"National Museum of Nature and Science, Japan",Angiosperm specimens of Iwate Prefectural Museum,,,,,,,IPMM,PA,33230,Specimen,,00:20.0,,,Sorbus commixta Hedl.,Hedl.,Sorbus commixta Hedl.,Plantae,Angiospermae,Dicotyledoneae,Rosales,Rosaceae,Sorbus,Japan,Japan,,Sunagawa-shi,,Hokkaido,Eastern Asia,Japan,,,,,,,,,,,,http://data.gbif.org/occurrences/204236750,http://data.gbif.org/ws/rest/occurrence/get?key=204236750
"National Museum of Nature and Science, Japan",Angiosperm specimens of Iwate Prefectural Museum,,,,,,,IPMM,PA,22983,Specimen,,00:19.0,,,Sorbus commixta Hedl.,Hedl.,Sorbus commixta Hedl.,Plantae,Angiospermae,Dicotyledoneae,Rosales,Rosaceae,Sorbus,Japan,Japan,,Miyako-shi,,Iwate,Eastern Asia,Japan,,,,,,,,,,,,http://data.gbif.org/occurrences/204236521,http://data.gbif.org/ws/rest/occurrence/get?key=204236521
"National Museum of Nature and Science, Japan",Angiosperm specimens of Iwate Prefectural Museum,,,,,,,IPMM,PA,22981,Specimen,,00:19.0,,,Sorbus commixta Hedl.,Hedl.,Sorbus commixta Hedl.,Plantae,Angiospermae,Dicotyledoneae,Rosales,Rosaceae,Sorbus,Japan,Japan,,Shimohei-gun Yamadamachi,,Iwate,Eastern Asia,Japan,,,,,,,,,,,,http://data.gbif.org/occurrences/204236519,http://data.gbif.org/ws/rest/occurrence/get?key=204236519
"National Museum of Nature and Science, Japan",Angiosperm specimens of Iwate Prefectural Museum,,,,,,,IPMM,PA,28974,Specimen,,00:20.0,,,Sorbus commixta Hedl.,Hedl.,Sorbus commixta Hedl.,Plantae,Angiospermae,Dicotyledoneae,Rosales,Rosaceae,Sorbus,Japan,Japan,,Obihiro-shi,,Hokkaido,Eastern Asia,Japan,,,,,,,,,,,,http://data.gbif.org/occurrences/204236624,http://data.gbif.org/ws/rest/occurrence/get?key=204236624
Bioversity International,"EURISCO, The European Genetic Resources Search Catalogue","You may access and use the Information only if you agree to and abide by the terms of this Agreement. Permission is granted to access and use the Information from this site, provided that:                 http://eurisco.ecpgr.org/_1About/9Legal/index.php. Copyright laws and treaty provisions protect information appearing on this site ('Information'). Bioversity International (former IPGRI) or the original provider of the Information holds the copyright on such information. None of the Information may be copied, reproduced, modified, published, up/downloaded, posted, retransmitted, sold, broadcast, circulated or distributed in any form or by any means other than as described below, or with prior written permission of the copyright holder, Bioversity International or the original provider.                 http://eurisco.ecpgr.org/_1About/9Legal/index.php.",,,525,GBR004:297679,,GBR004,GBR,297679,Specimen,,11:23.0,,,Sorbus commixta Hedl.,,Sorbus commixta Hedl.,,,,,,Sorbus,JPN,Japan,,,,,Eastern Asia,,,,,,,,,,,,,http://data.gbif.org/occurrences/231073404,http://data.gbif.org/ws/rest/occurrence/get?key=231073404
"National Museum of Nature and Science, Japan","Gunma Museum of Natural History, Vascular Plant Specimen",,,,,,,GMNHJ,plant,BS0000087,Specimen,,35:47.0,,,Sorbus commixta Hedl.,,Sorbus commixta Hedl.,Plantae,Spermatophyta,,,Rosaceae,Sorbus,Japan,Japan,Kusatsu,Agatsuma-gun Kusatsumachi,,Gunma,Eastern Asia,Japan,36.6183,138.605,,45678,66,,,,,,,http://data.gbif.org/occurrences/188210188,http://data.gbif.org/ws/rest/occurrence/get?key=188210188
"National Museum of Nature and Science, Japan","Gunma Museum of Natural History, Vascular Plant Specimen",,,,,,,GMNHJ,plant,BS0065903,Specimen,,35:48.0,,,Sorbus commixta Hedl.,,Sorbus commixta Hedl.,Plantae,Spermatophyta,,,Rosaceae,Sorbus,Japan,Japan,"Akagisan,Kozuga-shima, Lake Ono, Mt. Akagi",Seta-gun Fujimimura,,Gunma,Eastern Asia,Japan,36.5517,139.184,,45679,51,,,,,,,http://data.gbif.org/occurrences/188211201,http://data.gbif.org/ws/rest/occurrence/get?key=188211201