Data Publisher,Dataset,Dataset Rights,Collector name,Collector number,Field number,GUID,Date collected,Institution code,Collection code,Catalogue number,Basis of record,Image url,Last indexed,Identifier,Identification date,Scientific name,Author,Scientific name (interpreted),Kingdom,Phylum,Class,Order,Family,Genus,Country,Country (interpreted),Locality,County,Continent or Ocean,State/Province,Region,Publisher country,Latitude,Longitude,Coordinate precision,Cell id,Centi cell id,Min depth,Max depth,Max depth,Min altitude,Max altitude,Altitude precision,GBIF portal url,GBIF webservice url
"National Institute of Genetics, ROIS","Herbarium Specimens of Museum of Nature and Human Activities, Hyogo Pref., Japan",,,,,,,HYO,VP,C1-167058,Specimen,,26:05.0,,,Tricyrtis nana,,Tricyrtis nana,Plantae,Magnoliophyta,,,Liliaceae,Tricyrtis,Japan,Japan,"Mie Pref.; Ise, Mt.Asama.",,,Mie,Eastern Asia,Japan,,,,,,,,,,,,http://data.gbif.org/occurrences/323520153,http://data.gbif.org/ws/rest/occurrence/get?key=323520153
"National Museum of Nature and Science, Japan","Herbarium Specimens of Tokushima Prefectural Museum, Japan",,,,,,,TKPM,B,SP003994,Specimen,,23:51.0,,,Tricyrtis nana Yatabe,Yatabe,Tricyrtis nana Yatabe,Plantae,Angiospermae,Monocotyledoneae,Angiospermae,Liliaceae,Tricyrtis,Japan,Japan,,Shishikui-cho,,Tokushima Pref.,Eastern Asia,Japan,,,,,,,,,,,,http://data.gbif.org/occurrences/150150776,http://data.gbif.org/ws/rest/occurrence/get?key=150150776
"National Museum of Nature and Science, Japan","Herbarium Specimens of Tokushima Prefectural Museum, Japan",,,,,,,TKPM,B,SP042202,Specimen,,23:52.0,,,Tricyrtis nana Yatabe,Yatabe,Tricyrtis nana Yatabe,Plantae,Angiospermae,Monocotyledoneae,Angiospermae,Liliaceae,Tricyrtis,Japan,Japan,,Sanagouchi-son,,Tokushima Pref.,Eastern Asia,Japan,,,,,,,,,,,,http://data.gbif.org/occurrences/150151049,http://data.gbif.org/ws/rest/occurrence/get?key=150151049
"National Museum of Nature and Science, Japan","Herbarium Specimens of Tokushima Prefectural Museum, Japan",,,,,,,TKPM,TKPM-B,SP116287,Specimen,,23:50.0,,,Tricyrtis nana Yatabe,Yatabe,Tricyrtis nana Yatabe,Plantae,Angiospermae,Monocotyledoneae,Liliiflorae,Liliaceae,Tricyrtis,Japan,Japan,Aki-gun,Aki-gun,,Kochi,Eastern Asia,Japan,33.544,134.292,,44594,52,,,,,,,http://data.gbif.org/occurrences/43224756,http://data.gbif.org/ws/rest/occurrence/get?key=43224756
"National Museum of Nature and Science, Japan","Herbarium Specimens of Tokushima Prefectural Museum, Japan",,,,,,,TKPM,TKPM-B,SP116281,Specimen,,23:50.0,,,Tricyrtis nana Yatabe,Yatabe,Tricyrtis nana Yatabe,Plantae,Angiospermae,Monocotyledoneae,Liliiflorae,Liliaceae,Tricyrtis,Japan,Japan,"Nakatosa-cho, Takaoka-gun",Nakatosa-cho,,Kochi,Eastern Asia,Japan,33.3076,133.234,,44593,32,,,,,,,http://data.gbif.org/occurrences/43224745,http://data.gbif.org/ws/rest/occurrence/get?key=43224745
"National Museum of Nature and Science, Japan","Herbarium Specimens of Tokushima Prefectural Museum, Japan",,,,,,,TKPM,TKPM-B,SP116289,Specimen,,23:50.0,,,Tricyrtis nana Yatabe,Yatabe,Tricyrtis nana Yatabe,Plantae,Angiospermae,Monocotyledoneae,Liliiflorae,Liliaceae,Tricyrtis,Japan,Japan,Muroto City,Muroto City,,Kochi,Eastern Asia,Japan,33.2925,134.145,,44594,21,,,,,,,http://data.gbif.org/occurrences/43224761,http://data.gbif.org/ws/rest/occurrence/get?key=43224761
"National Museum of Nature and Science, Japan","Herbarium Specimens of Tokushima Prefectural Museum, Japan",,,,,,,TKPM,TKPM-B,SP116273,Specimen,,23:50.0,,,Tricyrtis nana Yatabe,Yatabe,Tricyrtis nana Yatabe,Plantae,Angiospermae,Monocotyledoneae,Liliiflorae,Liliaceae,Tricyrtis,Japan,Japan,"Kitou-son, Naka-gun",Kitou-son,,Tokushima,Eastern Asia,Japan,33.9558,134.652,,44594,96,,,,,,,http://data.gbif.org/occurrences/43224730,http://data.gbif.org/ws/rest/occurrence/get?key=43224730
"National Museum of Nature and Science, Japan","Herbarium Specimens of Tokushima Prefectural Museum, Japan",,,,,,,TKPM,TKPM-B,SP116279,Specimen,,23:50.0,,,Tricyrtis nana Yatabe,Yatabe,Tricyrtis nana Yatabe,Plantae,Angiospermae,Monocotyledoneae,Liliiflorae,Liliaceae,Tricyrtis,Japan,Japan,"Shishikui-cho, Kaifu-gun",Shishikui-cho,,Tokushima,Eastern Asia,Japan,33.7331,134.537,,44594,75,,,,,,,http://data.gbif.org/occurrences/43224741,http://data.gbif.org/ws/rest/occurrence/get?key=43224741
"National Museum of Nature and Science, Japan","Herbarium Specimens of Tokushima Prefectural Museum, Japan",,,,,,,TKPM,TKPM-B,SP116274,Specimen,,23:50.0,,,Tricyrtis nana Yatabe,Yatabe,Tricyrtis nana Yatabe,Plantae,Angiospermae,Monocotyledoneae,Liliiflorae,Liliaceae,Tricyrtis,Japan,Japan,"Aioi-cho, Naka-gun",Aioi-cho,,Tokushima,Eastern Asia,Japan,33.9558,134.652,,44594,96,,,,,,,http://data.gbif.org/occurrences/43224732,http://data.gbif.org/ws/rest/occurrence/get?key=43224732
"National Museum of Nature and Science, Japan","Herbarium Specimens of Tokushima Prefectural Museum, Japan",,,,,,,TKPM,TKPM-B,SP116280,Specimen,,23:50.0,,,Tricyrtis nana Yatabe,Yatabe,Tricyrtis nana Yatabe,Plantae,Angiospermae,Monocotyledoneae,Liliiflorae,Liliaceae,Tricyrtis,Japan,Japan,"Shishikui-cho, Kaifu-gun",Shishikui-cho,,Tokushima,Eastern Asia,Japan,33.7331,134.537,,44594,75,,,,,,,http://data.gbif.org/occurrences/43224744,http://data.gbif.org/ws/rest/occurrence/get?key=43224744
"National Museum of Nature and Science, Japan","Herbarium Specimens of Tokushima Prefectural Museum, Japan",,,,,,,TKPM,B,SP003993,Specimen,,23:51.0,,,Tricyrtis nana Yatabe,Yatabe,Tricyrtis nana Yatabe,Plantae,Angiospermae,Monocotyledoneae,Angiospermae,Liliaceae,Tricyrtis,Japan,Japan,,Kainan-cho,,Tokushima Pref.,Eastern Asia,Japan,,,,,,,,,,,,http://data.gbif.org/occurrences/150150775,http://data.gbif.org/ws/rest/occurrence/get?key=150150775
"National Museum of Nature and Science, Japan","Herbarium Specimens of Tokushima Prefectural Museum, Japan",,,,,,,TKPM,TKPM-B,SP116275,Specimen,,23:50.0,,,Tricyrtis nana Yatabe,Yatabe,Tricyrtis nana Yatabe,Plantae,Angiospermae,Monocotyledoneae,Liliiflorae,Liliaceae,Tricyrtis,Japan,Japan,"Kitou-son, Naka-gun",Kitou-son,,Tokushima,Eastern Asia,Japan,33.9558,134.652,,44594,96,,,,,,,http://data.gbif.org/occurrences/43224733,http://data.gbif.org/ws/rest/occurrence/get?key=43224733
"National Museum of Nature and Science, Japan","Herbarium Specimens of Tokushima Prefectural Museum, Japan",,,,,,,TKPM,TKPM-B,SP116282,Specimen,,23:50.0,,,Tricyrtis nana Yatabe,Yatabe,Tricyrtis nana Yatabe,Plantae,Angiospermae,Monocotyledoneae,Liliiflorae,Liliaceae,Tricyrtis,Japan,Japan,"Kubokawa-cho, Takaoka-gun",Kubokawa-cho,,Kochi,Eastern Asia,Japan,33.2275,133.146,,44593,21,,,,,,,http://data.gbif.org/occurrences/43224748,http://data.gbif.org/ws/rest/occurrence/get?key=43224748
"National Museum of Nature and Science, Japan","Herbarium Specimens of Tokushima Prefectural Museum, Japan",,,,,,,TKPM,TKPM-B,SP116288,Specimen,,23:50.0,,,Tricyrtis nana Yatabe,Yatabe,Tricyrtis nana Yatabe,Plantae,Angiospermae,Monocotyledoneae,Liliiflorae,Liliaceae,Tricyrtis,Japan,Japan,"Toyo-cho, Aki-gun",Toyo-cho,,Kochi,Eastern Asia,Japan,33.544,134.292,,44594,52,,,,,,,http://data.gbif.org/occurrences/43224758,http://data.gbif.org/ws/rest/occurrence/get?key=43224758
"National Museum of Nature and Science, Japan","Herbarium Specimens of Tokushima Prefectural Museum, Japan",,,,,,,TKPM,TKPM-B,SP116276,Specimen,,23:50.0,,,Tricyrtis nana Yatabe,Yatabe,Tricyrtis nana Yatabe,Plantae,Angiospermae,Monocotyledoneae,Liliiflorae,Liliaceae,Tricyrtis,Japan,Japan,"Kaminaka-cho, Naka-gun",Kaminaka-cho,,Tokushima,Eastern Asia,Japan,33.9558,134.652,,44594,96,,,,,,,http://data.gbif.org/occurrences/43224735,http://data.gbif.org/ws/rest/occurrence/get?key=43224735
"National Museum of Nature and Science, Japan","Herbarium Specimens of Tokushima Prefectural Museum, Japan",,,,,,,TKPM,TKPM-B,SP116283,Specimen,,23:50.0,,,Tricyrtis nana Yatabe,Yatabe,Tricyrtis nana Yatabe,Plantae,Angiospermae,Monocotyledoneae,Liliiflorae,Liliaceae,Tricyrtis,Japan,Japan,"Otoyo-cho, Nagaoka-gun",Otoyo-cho,,Kochi,Eastern Asia,Japan,33.5564,133.536,,44593,55,,,,,,,http://data.gbif.org/occurrences/43224750,http://data.gbif.org/ws/rest/occurrence/get?key=43224750
"National Museum of Nature and Science, Japan","Herbarium Specimens of Tokushima Prefectural Museum, Japan",,,,,,,TKPM,TKPM-B,SP116284,Specimen,,23:50.0,,,Tricyrtis nana Yatabe,Yatabe,Tricyrtis nana Yatabe,Plantae,Angiospermae,Monocotyledoneae,Liliiflorae,Liliaceae,Tricyrtis,Japan,Japan,"Tosayamada-cho, Kami-gun",Tosayamada-cho,,Kochi,Eastern Asia,Japan,33.605,133.682,,44593,66,,,,,,,http://data.gbif.org/occurrences/43224751,http://data.gbif.org/ws/rest/occurrence/get?key=43224751
"National Museum of Nature and Science, Japan","Herbarium Specimens of Tokushima Prefectural Museum, Japan",,,,,,,TKPM,TKPM-B,SP116285,Specimen,,23:50.0,,,Tricyrtis nana Yatabe,Yatabe,Tricyrtis nana Yatabe,Plantae,Angiospermae,Monocotyledoneae,Liliiflorae,Liliaceae,Tricyrtis,Japan,Japan,Aki-gun,Aki-gun,,Kochi,Eastern Asia,Japan,33.544,134.292,,44594,52,,,,,,,http://data.gbif.org/occurrences/43224753,http://data.gbif.org/ws/rest/occurrence/get?key=43224753
"National Museum of Nature and Science, Japan","Herbarium Specimens of Tokushima Prefectural Museum, Japan",,,,,,,TKPM,TKPM-B,SP116278,Specimen,,23:50.0,,,Tricyrtis nana Yatabe,Yatabe,Tricyrtis nana Yatabe,Plantae,Angiospermae,Monocotyledoneae,Liliiflorae,Liliaceae,Tricyrtis,Japan,Japan,"Shishikui-cho, Kaifu-gun",Shishikui-cho,,Tokushima,Eastern Asia,Japan,33.7331,134.537,,44594,75,,,,,,,http://data.gbif.org/occurrences/43224738,http://data.gbif.org/ws/rest/occurrence/get?key=43224738
"National Museum of Nature and Science, Japan","Herbarium Specimens of Tokushima Prefectural Museum, Japan",,,,,,,TKPM,TKPM-B,SP116277,Specimen,,23:50.0,,,Tricyrtis nana Yatabe,Yatabe,Tricyrtis nana Yatabe,Plantae,Angiospermae,Monocotyledoneae,Liliiflorae,Liliaceae,Tricyrtis,Japan,Japan,Kaifu-gun,Kaifu-gun,,Tokushima,Eastern Asia,Japan,33.7331,134.537,,44594,75,,,,,,,http://data.gbif.org/occurrences/43224736,http://data.gbif.org/ws/rest/occurrence/get?key=43224736
"National Museum of Nature and Science, Japan","Herbarium Specimens of Tokushima Prefectural Museum, Japan",,,,,,,TKPM,TKPM-B,SP116290,Specimen,,23:50.0,,,Tricyrtis nana Yatabe,Yatabe,Tricyrtis nana Yatabe,Plantae,Angiospermae,Monocotyledoneae,Liliiflorae,Liliaceae,Tricyrtis,Japan,Japan,"Toyo-cho, Aki-gun",Toyo-cho,,Kochi,Eastern Asia,Japan,33.5155,134.28,,44594,52,,,,,,,http://data.gbif.org/occurrences/43224763,http://data.gbif.org/ws/rest/occurrence/get?key=43224763
"National Museum of Nature and Science, Japan","Herbarium Specimens of Tokushima Prefectural Museum, Japan",,,,,,,TKPM,B,SP003987,Specimen,,23:51.0,,,Tricyrtis nana Yatabe,Yatabe,Tricyrtis nana Yatabe,Plantae,Angiospermae,Monocotyledoneae,Angiospermae,Liliaceae,Tricyrtis,Japan,Japan,,Aioi-cho,,Tokushima Pref.,Eastern Asia,Japan,,,,,,,,,,,,http://data.gbif.org/occurrences/150150774,http://data.gbif.org/ws/rest/occurrence/get?key=150150774
"National Museum of Nature and Science, Japan",Kochi Prefectural Makino Botanical Garden,,,,,,,MBK,MBK,17558,Specimen,,04:51.0,,,Tricyrtis nana Yatabe,,Tricyrtis nana Yatabe,Plantae,,,Liliiflorae,Liliaceae,Tricyrtis,Japan,Japan,,,,Pref. Kochi,Eastern Asia,Japan,,,,,,,,,,,,http://data.gbif.org/occurrences/143974982,http://data.gbif.org/ws/rest/occurrence/get?key=143974982
"National Museum of Nature and Science, Japan",Kochi Prefectural Makino Botanical Garden,,,,,,,MBK,MBK,17332,Specimen,,04:51.0,,,Tricyrtis nana Yatabe,,Tricyrtis nana Yatabe,Plantae,,,Liliiflorae,Liliaceae,Tricyrtis,Japan,Japan,,,,Pref. Kochi,Eastern Asia,Japan,,,,,,,,,,,,http://data.gbif.org/occurrences/143974965,http://data.gbif.org/ws/rest/occurrence/get?key=143974965
"National Museum of Nature and Science, Japan",Kochi Prefectural Makino Botanical Garden,,,,,,,MBK,MBK,3961,Specimen,,04:54.0,,,Tricyrtis nana Yatabe,Yatabe,Tricyrtis nana Yatabe,Plantae,,,,Liliaceae,Tricyrtis,Japan,Japan,,Ise-shi,,Mie,Eastern Asia,Japan,,,,,,,,,,,,http://data.gbif.org/occurrences/287513225,http://data.gbif.org/ws/rest/occurrence/get?key=287513225
"National Museum of Nature and Science, Japan",Kochi Prefectural Makino Botanical Garden,,,,,,,MBK,MBK,17327,Specimen,,04:51.0,,,Tricyrtis nana Yatabe,,Tricyrtis nana Yatabe,Plantae,,,Liliiflorae,Liliaceae,Tricyrtis,Japan,Japan,,,,Pref. Kochi,Eastern Asia,Japan,,,,,,,,,,,,http://data.gbif.org/occurrences/143974960,http://data.gbif.org/ws/rest/occurrence/get?key=143974960
"National Museum of Nature and Science, Japan",Kochi Prefectural Makino Botanical Garden,,,,,,,MBK,MBK,17331,Specimen,,04:51.0,,,Tricyrtis nana Yatabe,,Tricyrtis nana Yatabe,Plantae,,,Liliiflorae,Liliaceae,Tricyrtis,Japan,Japan,,,,Pref. Kochi,Eastern Asia,Japan,,,,,,,,,,,,http://data.gbif.org/occurrences/143974964,http://data.gbif.org/ws/rest/occurrence/get?key=143974964
"National Museum of Nature and Science, Japan",Kochi Prefectural Makino Botanical Garden,,,,,,,MBK,MBK,3694,Specimen,,23:28.0,,,Tricyrtis nana Yatabe,Yatabe,Tricyrtis nana Yatabe,Plantae,,,,Liliaceae,Tricyrtis,Japan,Japan,Ise shrine,Ise-shi,,Mie,Eastern Asia,Japan,34.4937,136.709,,44956,47,,,,,,,http://data.gbif.org/occurrences/287515488,http://data.gbif.org/ws/rest/occurrence/get?key=287515488
"National Museum of Nature and Science, Japan",Kochi Prefectural Makino Botanical Garden,,,,,,,MBK,MBK,17326,Specimen,,04:51.0,,,Tricyrtis nana Yatabe,,Tricyrtis nana Yatabe,Plantae,,,Liliiflorae,Liliaceae,Tricyrtis,Japan,Japan,,,,Pref. Kochi,Eastern Asia,Japan,,,,,,,,,,,,http://data.gbif.org/occurrences/143974959,http://data.gbif.org/ws/rest/occurrence/get?key=143974959
"National Museum of Nature and Science, Japan",Kochi Prefectural Makino Botanical Garden,,,,,,,MBK,MBK,3693,Specimen,,23:28.0,,,Tricyrtis nana Yatabe,Yatabe,Tricyrtis nana Yatabe,Plantae,,,,Liliaceae,Tricyrtis,Japan,Japan,Ise shrine,Ise-shi,,Mie,Eastern Asia,Japan,34.4937,136.709,,44956,47,,,,,,,http://data.gbif.org/occurrences/287515486,http://data.gbif.org/ws/rest/occurrence/get?key=287515486
"National Museum of Nature and Science, Japan",Kochi Prefectural Makino Botanical Garden,,,,,,,MBK,MBK,3961,Specimen,,02:22.0,,,Tricyrtis nana Yatabe,Yatabe,Tricyrtis nana Yatabe,Plantae,,,,Liliaceae,Tricyrtis,Japan,Japan,Ise shrine,Ise-shi,,Mie,Eastern Asia,Japan,,,,,,,,,,,,http://data.gbif.org/occurrences/354284601,http://data.gbif.org/ws/rest/occurrence/get?key=354284601
"National Museum of Nature and Science, Japan",Kochi Prefectural Makino Botanical Garden,,,,,,,MBK,MBK,124894,Specimen,,04:54.0,,,Tricyrtis nana Yatabe,Yatabe,Tricyrtis nana Yatabe,Plantae,,,,Liliaceae,Tricyrtis,Japan,Japan,,Ise-shi,,Mie,Eastern Asia,Japan,,,,,,,,,,,,http://data.gbif.org/occurrences/472898569,http://data.gbif.org/ws/rest/occurrence/get?key=472898569
"National Museum of Nature and Science, Japan",Kochi Prefectural Makino Botanical Garden,,,,,,,MBK,MBK,17329,Specimen,,04:51.0,,,Tricyrtis nana Yatabe,,Tricyrtis nana Yatabe,Plantae,,,Liliiflorae,Liliaceae,Tricyrtis,Japan,Japan,,,,Pref. Kochi,Eastern Asia,Japan,,,,,,,,,,,,http://data.gbif.org/occurrences/143974962,http://data.gbif.org/ws/rest/occurrence/get?key=143974962
"National Museum of Nature and Science, Japan",Kochi Prefectural Makino Botanical Garden,,,,,,,MBK,MBK,17330,Specimen,,04:51.0,,,Tricyrtis nana Yatabe,,Tricyrtis nana Yatabe,Plantae,,,Liliiflorae,Liliaceae,Tricyrtis,Japan,Japan,,,,Pref. Kochi,Eastern Asia,Japan,,,,,,,,,,,,http://data.gbif.org/occurrences/143974963,http://data.gbif.org/ws/rest/occurrence/get?key=143974963
"National Museum of Nature and Science, Japan",Kochi Prefectural Makino Botanical Garden,,,,,,,MBK,MBK,17334,Specimen,,04:51.0,,,Tricyrtis nana Yatabe,,Tricyrtis nana Yatabe,Plantae,,,Liliiflorae,Liliaceae,Tricyrtis,Japan,Japan,,,,Pref. Kochi,Eastern Asia,Japan,,,,,,,,,,,,http://data.gbif.org/occurrences/143974967,http://data.gbif.org/ws/rest/occurrence/get?key=143974967
"National Museum of Nature and Science, Japan",Kochi Prefectural Makino Botanical Garden,,,,,,,MBK,MBK,17333,Specimen,,04:51.0,,,Tricyrtis nana Yatabe,,Tricyrtis nana Yatabe,Plantae,,,Liliiflorae,Liliaceae,Tricyrtis,Japan,Japan,,,,Pref. Kochi,Eastern Asia,Japan,,,,,,,,,,,,http://data.gbif.org/occurrences/143974966,http://data.gbif.org/ws/rest/occurrence/get?key=143974966
"National Museum of Nature and Science, Japan",Kochi Prefectural Makino Botanical Garden,,,,,,,MBK,MBK,168477,Specimen,,04:52.0,,,Tricyrtis nana Yatabe,,Tricyrtis nana Yatabe,Plantae,,,Liliiflorae,Liliaceae,Tricyrtis,Japan,Japan,,,,Pref. Kochi,Eastern Asia,Japan,,,,,,,,,,,,http://data.gbif.org/occurrences/143975530,http://data.gbif.org/ws/rest/occurrence/get?key=143975530
"National Museum of Nature and Science, Japan",Kochi Prefectural Makino Botanical Garden,,,,,,,MBK,MBK,174383,Specimen,,04:52.0,,,Tricyrtis nana Yatabe,,Tricyrtis nana Yatabe,Plantae,,,Liliiflorae,Liliaceae,Tricyrtis,Japan,Japan,,,,Pref. Kochi,Eastern Asia,Japan,,,,,,,,,,,,http://data.gbif.org/occurrences/143975601,http://data.gbif.org/ws/rest/occurrence/get?key=143975601
"National Museum of Nature and Science, Japan",Kochi Prefectural Makino Botanical Garden,,,,,,,MBK,MBK,124894,Specimen,,02:22.0,,,Tricyrtis nana Yatabe,Yatabe,Tricyrtis nana Yatabe,Plantae,,,,Liliaceae,Tricyrtis,Japan,Japan,Ise shrine,Ise-shi,,Mie,Eastern Asia,Japan,,,,,,,,,,,,http://data.gbif.org/occurrences/354284600,http://data.gbif.org/ws/rest/occurrence/get?key=354284600
"National Museum of Nature and Science, Japan",Kochi Prefectural Makino Botanical Garden,,,,,,,MBK,MBK,17328,Specimen,,04:51.0,,,Tricyrtis nana Yatabe,,Tricyrtis nana Yatabe,Plantae,,,Liliiflorae,Liliaceae,Tricyrtis,Japan,Japan,,,,Pref. Kochi,Eastern Asia,Japan,,,,,,,,,,,,http://data.gbif.org/occurrences/143974961,http://data.gbif.org/ws/rest/occurrence/get?key=143974961
"National Museum of Nature and Science, Japan",Kochi Prefectural Makino Botanical Garden,,,,,,,MBK,MBK,61040,Specimen,,04:51.0,,,Tricyrtis nana Yatabe,,Tricyrtis nana Yatabe,Plantae,,,Liliiflorae,Liliaceae,Tricyrtis,Japan,Japan,,,,Pref. Kochi,Eastern Asia,Japan,,,,,,,,,,,,http://data.gbif.org/occurrences/143975330,http://data.gbif.org/ws/rest/occurrence/get?key=143975330
"National Museum of Nature and Science, Japan","Plant specimens depodited in Osaka Museum of Natural History, Japan.",,,,,,,OSA,C,OSA70,Specimen,,25:05.0,,,Tricyrtis nana Yatabe,Yatabe,Tricyrtis nana Yatabe,Plantae,,,,Liliaceae,Tricyrtis,Japan,Japan,,Ise-shi,,Mie Prefecture,Eastern Asia,Japan,,,,,,,,,,,,http://data.gbif.org/occurrences/295176419,http://data.gbif.org/ws/rest/occurrence/get?key=295176419
"National Museum of Nature and Science, Japan","Plant specimens depodited in Osaka Museum of Natural History, Japan.",,,,,,,OSA,OSA,111893,Specimen,,25:05.0,,,Tricyrtis nana Yatabe,Yatabe,Tricyrtis nana Yatabe,Plantae,,,,Liliaceae,Tricyrtis,Japan,Japan,,Yoshino-gun Totsukawamura,,Nara,Eastern Asia,Japan,34.4069,135.798,,44955,47,,,,,,,http://data.gbif.org/occurrences/204394589,http://data.gbif.org/ws/rest/occurrence/get?key=204394589
"National Museum of Nature and Science, Japan","Plant specimens depodited in Osaka Museum of Natural History, Japan.",,,,,,,OSA,OSA,198963,Specimen,,25:05.0,,,Tricyrtis nana Yatabe,Yatabe,Tricyrtis nana Yatabe,Plantae,,,,Liliaceae,Tricyrtis,Japan,Japan,,Yoshino-gun Totsukawamura,,Nara,Eastern Asia,Japan,34.4069,135.798,,44955,47,,,,,,,http://data.gbif.org/occurrences/204394588,http://data.gbif.org/ws/rest/occurrence/get?key=204394588
"National Museum of Nature and Science, Japan","Plant specimens depodited in Osaka Museum of Natural History, Japan.",,,,,,,OSA,OSA,198964,Specimen,,25:05.0,,,Tricyrtis nana Yatabe,Yatabe,Tricyrtis nana Yatabe,Plantae,,,,Liliaceae,Tricyrtis,Japan,Japan,,Yoshino-gun Totsukawamura,,Nara,Eastern Asia,Japan,34.4069,135.798,,44955,47,,,,,,,http://data.gbif.org/occurrences/204394587,http://data.gbif.org/ws/rest/occurrence/get?key=204394587
"National Museum of Nature and Science, Japan","Plant specimens depodited in Osaka Museum of Natural History, Japan.",,,,,,,OSA,OSA,244451,Specimen,,25:05.0,,,Tricyrtis nana Yatabe,Yatabe,Tricyrtis nana Yatabe,Plantae,,,,Liliaceae,Tricyrtis,Japan,Japan,,Yoshino-gun Totsukawamura,,Nara,Eastern Asia,Japan,34.4069,135.798,,44955,47,,,,,,,http://data.gbif.org/occurrences/204394590,http://data.gbif.org/ws/rest/occurrence/get?key=204394590
Royal Botanic Garden Edinburgh,RBGE Herbarium (E),Copyright Royal Botanic Garden Edinburgh. Contact us for rights to commercial use.,,,,,,E,E,E00043853,Specimen,,50:39.0,,,Tricyrtis nana Yatabe,,Tricyrtis nana Yatabe,,,,,Liliaceae,Tricyrtis,JP,Japan,,,,,Eastern Asia,,,,,,,,,,,,,http://data.gbif.org/occurrences/575220342,http://data.gbif.org/ws/rest/occurrence/get?key=575220342
